You are viewing a plain text version of this content. The canonical link for it is here.
Posted to dev@lucene.apache.org by Charlie Cron <hu...@gmail.com> on 2012/10/30 22:08:08 UTC
Build failed in Jenkins: slow-io-beasting #5153
See <http://sierranevada.servebeer.com:8080/job/slow-io-beasting/5153/>
------------------------------------------
[...truncated 15777 lines...]
[junit4:junit4] 2> 293482 T87 oasu.DirectUpdateHandler2.close closing DirectUpdateHandler2{commits=1,autocommits=0,soft autocommits=0,optimizes=0,rollbacks=0,expungeDeletes=0,docsPending=0,adds=0,deletesById=0,deletesByQuery=0,errors=0,cumulative_adds=0,cumulative_deletesById=0,cumulative_deletesByQuery=0,cumulative_errors=0}
[junit4:junit4] 2> 293483 T87 oasc.SolrCore.decrefSolrCoreState Closing SolrCoreState
[junit4:junit4] 2> 293483 T87 oasu.DefaultSolrCoreState.closeIndexWriter SolrCoreState ref count has reached 0 - closing IndexWriter
[junit4:junit4] 2> 293483 T87 oasu.DefaultSolrCoreState.closeIndexWriter closing IndexWriter with IndexWriterCloser
[junit4:junit4] 2> 293485 T87 oasc.SolrCore.closeSearcher [collection1] Closing main searcher on request.
[junit4:junit4] 2> 294321 T185 oaz.ClientCnxn$SendThread.startConnect Opening socket connection to server 127.0.0.1/127.0.0.1:61743
[junit4:junit4] 2> 295414 T186 oaz.ClientCnxn$EventThread.run EventThread shut down
[junit4:junit4] 2> 295414 T87 oaz.ZooKeeper.close Session: 0x13ab37c33f10008 closed
[junit4:junit4] 2> 295424 T87 oejsh.ContextHandler.doStop stopped o.e.j.s.ServletContextHandler{/solr,null}
[junit4:junit4] 2> 295647 T87 oas.SolrTestCaseJ4.tearDown ###Ending testDistribSearch
[junit4:junit4] 1> / (2)
[junit4:junit4] 1> DATA:
[junit4:junit4] 1>
[junit4:junit4] 1> /solr (6)
[junit4:junit4] 1> /solr/configs (1)
[junit4:junit4] 1> /solr/configs/conf1 (2)
[junit4:junit4] 1> /solr/configs/conf1/solrconfig.xml (0)
[junit4:junit4] 1> DATA: ...supressed...
[junit4:junit4] 1> /solr/configs/conf1/schema.xml (0)
[junit4:junit4] 1> DATA: ...supressed...
[junit4:junit4] 1> /solr/live_nodes (7)
[junit4:junit4] 1> /solr/live_nodes/127.0.0.1:61773_solr (0)
[junit4:junit4] 1> /solr/live_nodes/127.0.0.1:61779_solr (0)
[junit4:junit4] 1> /solr/live_nodes/127.0.0.1:61796_solr (0)
[junit4:junit4] 1> /solr/live_nodes/127.0.0.1:61761_solr (0)
[junit4:junit4] 1> /solr/live_nodes/127.0.0.1:61804_solr (0)
[junit4:junit4] 1> /solr/live_nodes/127.0.0.1:61788_solr (0)
[junit4:junit4] 1> /solr/live_nodes/127.0.0.1:61767_solr (0)
[junit4:junit4] 1> /solr/overseer (3)
[junit4:junit4] 1> DATA:
[junit4:junit4] 1>
[junit4:junit4] 1> /solr/overseer/queue (0)
[junit4:junit4] 1> DATA:
[junit4:junit4] 1>
[junit4:junit4] 1> /solr/overseer/queue-work (0)
[junit4:junit4] 1> DATA:
[junit4:junit4] 1>
[junit4:junit4] 1> /solr/overseer/collection-queue-work (0)
[junit4:junit4] 1> DATA:
[junit4:junit4] 1>
[junit4:junit4] 1> /solr/overseer_elect (2)
[junit4:junit4] 1> /solr/overseer_elect/election (7)
[junit4:junit4] 1> /solr/overseer_elect/election/88580488715894788-127.0.0.1:61773_solr-n_0000000002 (0)
[junit4:junit4] 1> /solr/overseer_elect/election/88580488715894789-127.0.0.1:61779_solr-n_0000000003 (0)
[junit4:junit4] 1> /solr/overseer_elect/election/88580488715894791-127.0.0.1:61796_solr-n_0000000005 (0)
[junit4:junit4] 1> /solr/overseer_elect/election/88580488715894792-127.0.0.1:61804_solr-n_0000000006 (0)
[junit4:junit4] 1> /solr/overseer_elect/election/88580488715894786-127.0.0.1:61761_solr-n_0000000000 (0)
[junit4:junit4] 1> /solr/overseer_elect/election/88580488715894787-127.0.0.1:61767_solr-n_0000000001 (0)
[junit4:junit4] 1> /solr/overseer_elect/election/88580488715894790-127.0.0.1:61788_solr-n_0000000004 (0)
[junit4:junit4] 1> /solr/overseer_elect/leader (0)
[junit4:junit4] 1> DATA:
[junit4:junit4] 1> {"id":"88580488715894786-127.0.0.1:61761_solr-n_0000000000"}
[junit4:junit4] 1> /solr/collections (2)
[junit4:junit4] 1> /solr/collections/collection1 (3)
[junit4:junit4] 1> DATA:
[junit4:junit4] 1> {"configName":"conf1"}
[junit4:junit4] 1> /solr/collections/collection1/shards (0)
[junit4:junit4] 1> /solr/collections/collection1/leader_elect (2)
[junit4:junit4] 1> /solr/collections/collection1/leader_elect/shard1 (1)
[junit4:junit4] 1> /solr/collections/collection1/leader_elect/shard1/election (2)
[junit4:junit4] 1> /solr/collections/collection1/leader_elect/shard1/election/88580488715894791-127.0.0.1:61796_solr_collection1-n_0000000001 (0)
[junit4:junit4] 1> /solr/collections/collection1/leader_elect/shard1/election/88580488715894789-127.0.0.1:61779_solr_collection1-n_0000000000 (0)
[junit4:junit4] 1> /solr/collections/collection1/leader_elect/shard2 (1)
[junit4:junit4] 1> /solr/collections/collection1/leader_elect/shard2/election (3)
[junit4:junit4] 1> /solr/collections/collection1/leader_elect/shard2/election/88580488715894792-127.0.0.1:61804_solr_collection1-n_0000000002 (0)
[junit4:junit4] 1> /solr/collections/collection1/leader_elect/shard2/election/88580488715894790-127.0.0.1:61788_solr_collection1-n_0000000001 (0)
[junit4:junit4] 1> /solr/collections/collection1/leader_elect/shard2/election/88580488715894788-127.0.0.1:61773_solr_collection1-n_0000000000 (0)
[junit4:junit4] 1> /solr/collections/collection1/leaders (2)
[junit4:junit4] 1> /solr/collections/collection1/leaders/shard1 (0)
[junit4:junit4] 1> DATA:
[junit4:junit4] 1> {
[junit4:junit4] 1> "core":"collection1",
[junit4:junit4] 1> "node_name":"127.0.0.1:61779_solr",
[junit4:junit4] 1> "base_url":"http://127.0.0.1:61779/solr"}
[junit4:junit4] 1> /solr/collections/collection1/leaders/shard2 (0)
[junit4:junit4] 1> DATA:
[junit4:junit4] 1> {
[junit4:junit4] 1> "core":"collection1",
[junit4:junit4] 1> "node_name":"127.0.0.1:61773_solr",
[junit4:junit4] 1> "base_url":"http://127.0.0.1:61773/solr"}
[junit4:junit4] 1> /solr/collections/control_collection (3)
[junit4:junit4] 1> DATA:
[junit4:junit4] 1> {"configName":"conf1"}
[junit4:junit4] 1> /solr/collections/control_collection/shards (0)
[junit4:junit4] 1> /solr/collections/control_collection/leader_elect (1)
[junit4:junit4] 1> /solr/collections/control_collection/leader_elect/control_shard (1)
[junit4:junit4] 1> /solr/collections/control_collection/leader_elect/control_shard/election (1)
[junit4:junit4] 1> /solr/collections/control_collection/leader_elect/control_shard/election/88580488715894786-127.0.0.1:61761_solr_collection1-n_0000000000 (0)
[junit4:junit4] 1> /solr/collections/control_collection/leaders (1)
[junit4:junit4] 1> /solr/collections/control_collection/leaders/control_shard (0)
[junit4:junit4] 1> DATA:
[junit4:junit4] 1> {
[junit4:junit4] 1> "core":"collection1",
[junit4:junit4] 1> "node_name":"127.0.0.1:61761_solr",
[junit4:junit4] 1> "base_url":"http://127.0.0.1:61761/solr"}
[junit4:junit4] 1> /solr/clusterstate.json (0)
[junit4:junit4] 1> DATA:
[junit4:junit4] 1> {
[junit4:junit4] 1> "collection1":{
[junit4:junit4] 1> "shard1":{
[junit4:junit4] 1> "range":"80000000-ffffffff",
[junit4:junit4] 1> "replicas":{
[junit4:junit4] 1> "127.0.0.1:61767_solr_collection1":{
[junit4:junit4] 1> "shard":null,
[junit4:junit4] 1> "roles":null,
[junit4:junit4] 1> "state":"down",
[junit4:junit4] 1> "core":"collection1",
[junit4:junit4] 1> "collection":"collection1",
[junit4:junit4] 1> "node_name":"127.0.0.1:61767_solr",
[junit4:junit4] 1> "base_url":"http://127.0.0.1:61767/solr"},
[junit4:junit4] 1> "127.0.0.1:61779_solr_collection1":{
[junit4:junit4] 1> "shard":"shard1",
[junit4:junit4] 1> "roles":null,
[junit4:junit4] 1> "state":"active",
[junit4:junit4] 1> "core":"collection1",
[junit4:junit4] 1> "collection":"collection1",
[junit4:junit4] 1> "node_name":"127.0.0.1:61779_solr",
[junit4:junit4] 1> "base_url":"http://127.0.0.1:61779/solr",
[junit4:junit4] 1> "leader":"true"},
[junit4:junit4] 1> "127.0.0.1:61796_solr_collection1":{
[junit4:junit4] 1> "shard":"shard1",
[junit4:junit4] 1> "roles":null,
[junit4:junit4] 1> "state":"active",
[junit4:junit4] 1> "core":"collection1",
[junit4:junit4] 1> "collection":"collection1",
[junit4:junit4] 1> "node_name":"127.0.0.1:61796_solr",
[junit4:junit4] 1> "base_url":"http://127.0.0.1:61796/solr"}}},
[junit4:junit4] 1> "shard2":{
[junit4:junit4] 1> "range":"0-7fffffff",
[junit4:junit4] 1> "replicas":{
[junit4:junit4] 1> "127.0.0.1:61773_solr_collection1":{
[junit4:junit4] 1> "shard":"shard2",
[junit4:junit4] 1> "roles":null,
[junit4:junit4] 1> "state":"active",
[junit4:junit4] 1> "core":"collection1",
[junit4:junit4] 1> "collection":"collection1",
[junit4:junit4] 1> "node_name":"127.0.0.1:61773_solr",
[junit4:junit4] 1> "base_url":"http://127.0.0.1:61773/solr",
[junit4:junit4] 1> "leader":"true"},
[junit4:junit4] 1> "127.0.0.1:61788_solr_collection1":{
[junit4:junit4] 1> "shard":"shard2",
[junit4:junit4] 1> "roles":null,
[junit4:junit4] 1> "state":"active",
[junit4:junit4] 1> "core":"collection1",
[junit4:junit4] 1> "collection":"collection1",
[junit4:junit4] 1> "node_name":"127.0.0.1:61788_solr",
[junit4:junit4] 1> "base_url":"http://127.0.0.1:61788/solr"},
[junit4:junit4] 1> "127.0.0.1:61804_solr_collection1":{
[junit4:junit4] 1> "shard":"shard2",
[junit4:junit4] 1> "roles":null,
[junit4:junit4] 1> "state":"active",
[junit4:junit4] 1> "core":"collection1",
[junit4:junit4] 1> "collection":"collection1",
[junit4:junit4] 1> "node_name":"127.0.0.1:61804_solr",
[junit4:junit4] 1> "base_url":"http://127.0.0.1:61804/solr"}}}},
[junit4:junit4] 1> "control_collection":{"control_shard":{"replicas":{"127.0.0.1:61761_solr_collection1":{
[junit4:junit4] 1> "shard":"control_shard",
[junit4:junit4] 1> "roles":null,
[junit4:junit4] 1> "state":"active",
[junit4:junit4] 1> "core":"collection1",
[junit4:junit4] 1> "collection":"control_collection",
[junit4:junit4] 1> "node_name":"127.0.0.1:61761_solr",
[junit4:junit4] 1> "base_url":"http://127.0.0.1:61761/solr",
[junit4:junit4] 1> "leader":"true"}}}}}
[junit4:junit4] 1> /zookeeper (1)
[junit4:junit4] 1> DATA:
[junit4:junit4] 1>
[junit4:junit4] 1>
[junit4:junit4] 2> NOTE: reproduce with: ant test -Dtestcase=CloudSolrServerTest -Dtests.method=testDistribSearch -Dtests.seed=2AEE5ECB66742742 -Dtests.slow=true -Dtests.locale=iw_IL -Dtests.timezone=Libya -Dtests.file.encoding=ISO-8859-1
[junit4:junit4] FAILURE 296s J5 | CloudSolrServerTest.testDistribSearch <<<
[junit4:junit4] > Throwable #1: java.lang.AssertionError: There are still nodes recoverying - waited for 30 seconds
[junit4:junit4] > at __randomizedtesting.SeedInfo.seed([2AEE5ECB66742742:AB08D0D3112B477E]:0)
[junit4:junit4] > at org.junit.Assert.fail(Assert.java:93)
[junit4:junit4] > at org.apache.solr.cloud.AbstractDistribZkTestBase.waitForRecoveriesToFinish(AbstractDistribZkTestBase.java:165)
[junit4:junit4] > at org.apache.solr.cloud.AbstractFullDistribZkTestBase.waitForRecoveriesToFinish(AbstractFullDistribZkTestBase.java:558)
[junit4:junit4] > at org.apache.solr.cloud.AbstractFullDistribZkTestBase.waitForThingsToLevelOut(AbstractFullDistribZkTestBase.java:1133)
[junit4:junit4] > at org.apache.solr.client.solrj.impl.CloudSolrServerTest.doTest(CloudSolrServerTest.java:95)
[junit4:junit4] > at org.apache.solr.BaseDistributedSearchTestCase.testDistribSearch(BaseDistributedSearchTestCase.java:695)
[junit4:junit4] > at sun.reflect.NativeMethodAccessorImpl.invoke0(Native Method)
[junit4:junit4] > at sun.reflect.NativeMethodAccessorImpl.invoke(NativeMethodAccessorImpl.java:39)
[junit4:junit4] > at sun.reflect.DelegatingMethodAccessorImpl.invoke(DelegatingMethodAccessorImpl.java:25)
[junit4:junit4] > at java.lang.reflect.Method.invoke(Method.java:597)
[junit4:junit4] > at com.carrotsearch.randomizedtesting.RandomizedRunner.invoke(RandomizedRunner.java:1559)
[junit4:junit4] > at com.carrotsearch.randomizedtesting.RandomizedRunner.access$600(RandomizedRunner.java:79)
[junit4:junit4] > at com.carrotsearch.randomizedtesting.RandomizedRunner$6.evaluate(RandomizedRunner.java:737)
[junit4:junit4] > at com.carrotsearch.randomizedtesting.RandomizedRunner$7.evaluate(RandomizedRunner.java:773)
[junit4:junit4] > at com.carrotsearch.randomizedtesting.RandomizedRunner$8.evaluate(RandomizedRunner.java:787)
[junit4:junit4] > at com.carrotsearch.randomizedtesting.rules.SystemPropertiesRestoreRule$1.evaluate(SystemPropertiesRestoreRule.java:53)
[junit4:junit4] > at org.apache.lucene.util.TestRuleSetupTeardownChained$1.evaluate(TestRuleSetupTeardownChained.java:50)
[junit4:junit4] > at org.apache.lucene.util.TestRuleFieldCacheSanity$1.evaluate(TestRuleFieldCacheSanity.java:51)
[junit4:junit4] > at org.apache.lucene.util.AbstractBeforeAfterRule$1.evaluate(AbstractBeforeAfterRule.java:45)
[junit4:junit4] > at com.carrotsearch.randomizedtesting.rules.SystemPropertiesInvariantRule$1.evaluate(SystemPropertiesInvariantRule.java:55)
[junit4:junit4] > at org.apache.lucene.util.TestRuleThreadAndTestName$1.evaluate(TestRuleThreadAndTestName.java:48)
[junit4:junit4] > at org.apache.lucene.util.TestRuleIgnoreAfterMaxFailures$1.evaluate(TestRuleIgnoreAfterMaxFailures.java:70)
[junit4:junit4] > at org.apache.lucene.util.TestRuleMarkFailure$1.evaluate(TestRuleMarkFailure.java:48)
[junit4:junit4] > at com.carrotsearch.randomizedtesting.rules.StatementAdapter.evaluate(StatementAdapter.java:36)
[junit4:junit4] > at com.carrotsearch.randomizedtesting.ThreadLeakControl$StatementRunner.run(ThreadLeakControl.java:358)
[junit4:junit4] > at com.carrotsearch.randomizedtesting.ThreadLeakControl.forkTimeoutingTask(ThreadLeakControl.java:782)
[junit4:junit4] > at com.carrotsearch.randomizedtesting.ThreadLeakControl$3.evaluate(ThreadLeakControl.java:442)
[junit4:junit4] > at com.carrotsearch.randomizedtesting.RandomizedRunner.runSingleTest(RandomizedRunner.java:746)
[junit4:junit4] > at com.carrotsearch.randomizedtesting.RandomizedRunner$3.evaluate(RandomizedRunner.java:648)
[junit4:junit4] > at com.carrotsearch.randomizedtesting.RandomizedRunner$4.evaluate(RandomizedRunner.java:682)
[junit4:junit4] > at com.carrotsearch.randomizedtesting.RandomizedRunner$5.evaluate(RandomizedRunner.java:693)
[junit4:junit4] > at com.carrotsearch.randomizedtesting.rules.StatementAdapter.evaluate(StatementAdapter.java:36)
[junit4:junit4] > at com.carrotsearch.randomizedtesting.rules.SystemPropertiesRestoreRule$1.evaluate(SystemPropertiesRestoreRule.java:53)
[junit4:junit4] > at org.apache.lucene.util.AbstractBeforeAfterRule$1.evaluate(AbstractBeforeAfterRule.java:45)
[junit4:junit4] > at org.apache.lucene.util.TestRuleStoreClassName$1.evaluate(TestRuleStoreClassName.java:42)
[junit4:junit4] > at com.carrotsearch.randomizedtesting.rules.SystemPropertiesInvariantRule$1.evaluate(SystemPropertiesInvariantRule.java:55)
[junit4:junit4] > at com.carrotsearch.randomizedtesting.rules.NoShadowingOrOverridesOnMethodsRule$1.evaluate(NoShadowingOrOverridesOnMethodsRule.java:39)
[junit4:junit4] > at com.carrotsearch.randomizedtesting.rules.NoShadowingOrOverridesOnMethodsRule$1.evaluate(NoShadowingOrOverridesOnMethodsRule.java:39)
[junit4:junit4] > at com.carrotsearch.randomizedtesting.rules.StatementAdapter.evaluate(StatementAdapter.java:36)
[junit4:junit4] > at org.apache.lucene.util.TestRuleAssertionsRequired$1.evaluate(TestRuleAssertionsRequired.java:43)
[junit4:junit4] > at org.apache.lucene.util.TestRuleMarkFailure$1.evaluate(TestRuleMarkFailure.java:48)
[junit4:junit4] > at org.apache.lucene.util.TestRuleIgnoreAfterMaxFailures$1.evaluate(TestRuleIgnoreAfterMaxFailures.java:70)
[junit4:junit4] > at org.apache.lucene.util.TestRuleIgnoreTestSuites$1.evaluate(TestRuleIgnoreTestSuites.java:55)
[junit4:junit4] > at com.carrotsearch.randomizedtesting.rules.StatementAdapter.evaluate(StatementAdapter.java:36)
[junit4:junit4] > at com.carrotsearch.randomizedtesting.ThreadLeakControl$StatementRunner.run(ThreadLeakControl.java:358)
[junit4:junit4] > at java.lang.Thread.run(Thread.java:662)
[junit4:junit4] 2> 295696 T87 oas.SolrTestCaseJ4.deleteCore ###deleteCore
[junit4:junit4] 2> NOTE: test params are: codec=Lucene3x, sim=DefaultSimilarity, locale=iw_IL, timezone=Libya
[junit4:junit4] 2> NOTE: Windows Vista 6.0 x86/Sun Microsystems Inc. 1.6.0_23 (32-bit)/cpus=4,threads=1,free=5195536,total=16515072
[junit4:junit4] 2> NOTE: All tests run in this JVM: [LargeVolumeEmbeddedTest, SolrDocumentTest, SolrExceptionTest, MultiCoreExampleJettyTest, TestDocumentObjectBinder, JettyWebappTest, TermsResponseTest, TestHash, SolrQueryTest, QueryResponseTest, SolrParamTest, FieldAnalysisResponseTest, FacetFieldTest, NamedListTest, CloudSolrServerTest]
[junit4:junit4] Completed on J5 in 295.74s, 1 test, 1 failure <<< FAILURES!
[junit4:junit4]
[junit4:junit4]
[junit4:junit4] Tests with failures:
[junit4:junit4] - org.apache.solr.client.solrj.impl.CloudSolrServerTest.testDistribSearch
[junit4:junit4]
[junit4:junit4]
[junit4:junit4] JVM J0: 4.95 .. 81.04 = 76.09s
[junit4:junit4] JVM J1: 4.95 .. 52.51 = 47.56s
[junit4:junit4] JVM J2: 4.95 .. 52.73 = 47.78s
[junit4:junit4] JVM J3: 4.95 .. 50.55 = 45.60s
[junit4:junit4] JVM J4: 4.95 .. 50.60 = 45.65s
[junit4:junit4] JVM J5: 4.46 .. 346.64 = 342.18s
[junit4:junit4] JVM J6: 5.20 .. 52.80 = 47.61s
[junit4:junit4] JVM J7: 4.95 .. 52.06 = 47.11s
[junit4:junit4] Execution time total: 5 minutes 46 seconds
[junit4:junit4] Tests summary: 43 suites, 239 tests, 1 failure
BUILD FAILED
<http://sierranevada.servebeer.com:8080/job/slow-io-beasting/ws/build.xml>:39: The following error occurred while executing this line:
<http://sierranevada.servebeer.com:8080/job/slow-io-beasting/ws/solr/build.xml>:185: The following error occurred while executing this line:
<http://sierranevada.servebeer.com:8080/job/slow-io-beasting/ws/lucene/module-build.xml>:61: The following error occurred while executing this line:
<http://sierranevada.servebeer.com:8080/job/slow-io-beasting/ws/lucene/common-build.xml>:1159: The following error occurred while executing this line:
<http://sierranevada.servebeer.com:8080/job/slow-io-beasting/ws/lucene/common-build.xml>:827: There were test failures: 43 suites, 239 tests, 1 failure
Total time: 20 minutes 31 seconds
Build step 'Invoke Ant' marked build as failure
---------------------------------------------------------------------
To unsubscribe, e-mail: dev-unsubscribe@lucene.apache.org
For additional commands, e-mail: dev-help@lucene.apache.org
Jenkins build is back to normal : slow-io-beasting #5155
Posted by Charlie Cron <hu...@gmail.com>.
See <http://sierranevada.servebeer.com:8080/job/slow-io-beasting/5155/>
---------------------------------------------------------------------
To unsubscribe, e-mail: dev-unsubscribe@lucene.apache.org
For additional commands, e-mail: dev-help@lucene.apache.org
Build failed in Jenkins: slow-io-beasting #5154
Posted by Charlie Cron <hu...@gmail.com>.
See <http://sierranevada.servebeer.com:8080/job/slow-io-beasting/5154/>
------------------------------------------
[...truncated 13829 lines...]
[junit4:junit4] 2> 29905 T10 oasc.SolrDeletionPolicy.onCommit SolrDeletionPolicy.onCommit: commits:num=1
[junit4:junit4] 2> commit{dir=BaseDirectoryWrapper(NRTCachingDirectory(org.apache.lucene.store.NIOFSDirectory@<http://sierranevada.servebeer.com:8080/job/slow-io-beasting/ws/solr/build/solr-solrj/test/J0/org.apache.solr.client.solrj.TestLBHttpSolrServer$SolrInstance-1351632240596/solr/collection12/collection1/data/index> lockFactory=org.apache.lucene.store.NativeFSLockFactory@c84361; maxCacheMB=0.1572265625 maxMergeSizeMB=0.7578125)),segFN=segments_1,generation=1,filenames=[segments_1]
[junit4:junit4] 2> 29906 T10 oasc.SolrDeletionPolicy.updateCommits newest commit = 1
[junit4:junit4] 2> 29909 T10 oasc.RequestHandlers.initHandlersFromConfig created standard: solr.StandardRequestHandler
[junit4:junit4] 2> 29910 T10 oasc.RequestHandlers.initHandlersFromConfig created defaults: solr.StandardRequestHandler
[junit4:junit4] 2> 29910 T10 oasc.RequestHandlers.initHandlersFromConfig adding lazy requestHandler: solr.StandardRequestHandler
[junit4:junit4] 2> 29911 T10 oasc.RequestHandlers.initHandlersFromConfig created lazy: solr.StandardRequestHandler
[junit4:junit4] 2> 29911 T10 oasc.RequestHandlers.initHandlersFromConfig created /update: solr.UpdateRequestHandler
[junit4:junit4] 2> 29912 T10 oasc.RequestHandlers.initHandlersFromConfig created /replication: solr.ReplicationHandler
[junit4:junit4] 2> 29922 T10 oashl.XMLLoader.init xsltCacheLifetimeSeconds=60
[junit4:junit4] 2> 29938 T10 oass.SolrIndexSearcher.<init> Opening Searcher@487fb7 main
[junit4:junit4] 2> 29939 T10 oass.SolrIndexSearcher.getIndexDir WARNING WARNING: Directory impl does not support setting indexDir: org.apache.lucene.store.BaseDirectoryWrapper
[junit4:junit4] 2> 29939 T10 oasu.CommitTracker.<init> Hard AutoCommit: disabled
[junit4:junit4] 2> 29939 T10 oasu.CommitTracker.<init> Soft AutoCommit: disabled
[junit4:junit4] 2> 29940 T10 oashc.HttpShardHandlerFactory.getParameter Setting socketTimeout to: 0
[junit4:junit4] 2> 29940 T10 oashc.HttpShardHandlerFactory.getParameter Setting urlScheme to: http://
[junit4:junit4] 2> 29940 T10 oashc.HttpShardHandlerFactory.getParameter Setting connTimeout to: 0
[junit4:junit4] 2> 29941 T10 oashc.HttpShardHandlerFactory.getParameter Setting maxConnectionsPerHost to: 20
[junit4:junit4] 2> 29941 T10 oashc.HttpShardHandlerFactory.getParameter Setting corePoolSize to: 0
[junit4:junit4] 2> 29941 T10 oashc.HttpShardHandlerFactory.getParameter Setting maximumPoolSize to: 2147483647
[junit4:junit4] 2> 29941 T10 oashc.HttpShardHandlerFactory.getParameter Setting maxThreadIdleTime to: 5
[junit4:junit4] 2> 29942 T10 oashc.HttpShardHandlerFactory.getParameter Setting sizeOfQueue to: -1
[junit4:junit4] 2> 29942 T10 oashc.HttpShardHandlerFactory.getParameter Setting fairnessPolicy to: false
[junit4:junit4] 2> 29942 T10 oascsi.HttpClientUtil.createClient Creating new http client, config:maxConnectionsPerHost=20&maxConnections=10000&socketTimeout=0&connTimeout=0&retry=false
[junit4:junit4] 2> 29955 T10 oash.ReplicationHandler.inform Commits will be reserved for 10000
[junit4:junit4] 2> 29955 T10 oasc.CoreContainer.register registering core: collection1
[junit4:junit4] 2> 29955 T10 oass.SolrDispatchFilter.init user.dir=<http://sierranevada.servebeer.com:8080/job/slow-io-beasting/ws/solr/build/solr-solrj/test/J0>
[junit4:junit4] 2> 29956 T10 oass.SolrDispatchFilter.init SolrDispatchFilter.init() done
[junit4:junit4] 2> 29957 T117 oasc.SolrCore.registerSearcher [collection1] Registered new searcher Searcher@487fb7 main{StandardDirectoryReader(segments_1:1)}
[junit4:junit4] 2> ASYNC NEW_CORE C9 name=collection1 org.apache.solr.core.SolrCore@1ea763a
[junit4:junit4] 2> 29979 T115 C9 oasc.SolrDeletionPolicy.onInit SolrDeletionPolicy.onInit: commits:num=1
[junit4:junit4] 2> commit{dir=BaseDirectoryWrapper(NRTCachingDirectory(org.apache.lucene.store.NIOFSDirectory@<http://sierranevada.servebeer.com:8080/job/slow-io-beasting/ws/solr/build/solr-solrj/test/J0/org.apache.solr.client.solrj.TestLBHttpSolrServer$SolrInstance-1351632240596/solr/collection12/collection1/data/index> lockFactory=org.apache.lucene.store.NativeFSLockFactory@c84361; maxCacheMB=0.1572265625 maxMergeSizeMB=0.7578125)),segFN=segments_1,generation=1,filenames=[segments_1]
[junit4:junit4] 2> 29980 T115 C9 oasc.SolrDeletionPolicy.updateCommits newest commit = 1
[junit4:junit4] 2> 29987 T115 C9 UPDATE [collection1] webapp=/solr path=/update params={wt=javabin&version=2} {add=[0, 1, 2, 3, 4, 5, 6, 7, 8, 9]} 0 17
[junit4:junit4] 2> 29992 T116 C9 oasu.DirectUpdateHandler2.commit start commit{flags=0,_version_=0,optimize=false,openSearcher=true,waitSearcher=true,expungeDeletes=false,softCommit=false}
[junit4:junit4] 2> 30043 T116 C9 oasc.SolrDeletionPolicy.onCommit SolrDeletionPolicy.onCommit: commits:num=2
[junit4:junit4] 2> commit{dir=BaseDirectoryWrapper(NRTCachingDirectory(org.apache.lucene.store.NIOFSDirectory@<http://sierranevada.servebeer.com:8080/job/slow-io-beasting/ws/solr/build/solr-solrj/test/J0/org.apache.solr.client.solrj.TestLBHttpSolrServer$SolrInstance-1351632240596/solr/collection12/collection1/data/index> lockFactory=org.apache.lucene.store.NativeFSLockFactory@c84361; maxCacheMB=0.1572265625 maxMergeSizeMB=0.7578125)),segFN=segments_1,generation=1,filenames=[segments_1]
[junit4:junit4] 2> commit{dir=BaseDirectoryWrapper(NRTCachingDirectory(org.apache.lucene.store.NIOFSDirectory@<http://sierranevada.servebeer.com:8080/job/slow-io-beasting/ws/solr/build/solr-solrj/test/J0/org.apache.solr.client.solrj.TestLBHttpSolrServer$SolrInstance-1351632240596/solr/collection12/collection1/data/index> lockFactory=org.apache.lucene.store.NativeFSLockFactory@c84361; maxCacheMB=0.1572265625 maxMergeSizeMB=0.7578125)),segFN=segments_2,generation=2,filenames=[_0.tis, _0.nrm, _0.fnm, _0.tii, _0.frq, segments_2, _0.fdx, _0.si, _0.fdt]
[junit4:junit4] 2> 30043 T116 C9 oasc.SolrDeletionPolicy.updateCommits newest commit = 2
[junit4:junit4] 2> 30053 T116 C9 oass.SolrIndexSearcher.<init> Opening Searcher@190d536 main
[junit4:junit4] 2> 30053 T116 C9 oass.SolrIndexSearcher.getIndexDir WARNING WARNING: Directory impl does not support setting indexDir: org.apache.lucene.store.BaseDirectoryWrapper
[junit4:junit4] 2> 30054 T116 C9 oasu.DirectUpdateHandler2.commit end_commit_flush
[junit4:junit4] 2> 30054 T117 oasc.SolrCore.registerSearcher [collection1] Registered new searcher Searcher@190d536 main{StandardDirectoryReader(segments_2:3 _0(4.1):C10)}
[junit4:junit4] 2> 30054 T116 C9 UPDATE [collection1] webapp=/solr path=/update params={waitSearcher=true&wt=javabin&commit=true&softCommit=false&version=2} {commit=} 0 62
[junit4:junit4] 2> 30059 T90 C7 REQ [collection1] webapp=/solr path=/select params={wt=javabin&q=*:*&version=2} hits=10 status=0 QTime=1
[junit4:junit4] 2> 30062 T99 C8 REQ [collection1] webapp=/solr path=/select params={wt=javabin&q=*:*&version=2} hits=10 status=0 QTime=1
[junit4:junit4] 2> 30068 T108 C9 REQ [collection1] webapp=/solr path=/select params={wt=javabin&q=*:*&version=2} hits=10 status=0 QTime=0
[junit4:junit4] 2> 30081 T10 oasc.CoreContainer.shutdown Shutting down CoreContainer instance=1923341
[junit4:junit4] 2> 30082 T10 oasc.SolrCore.close [collection1] CLOSING SolrCore org.apache.solr.core.SolrCore@77baf4
[junit4:junit4] 2> 30082 T10 oasu.DirectUpdateHandler2.close closing DirectUpdateHandler2{commits=1,autocommits=0,soft autocommits=0,optimizes=0,rollbacks=0,expungeDeletes=0,docsPending=0,adds=0,deletesById=0,deletesByQuery=0,errors=0,cumulative_adds=10,cumulative_deletesById=0,cumulative_deletesByQuery=0,cumulative_errors=0}
[junit4:junit4] 2> 30082 T10 oasc.SolrCore.decrefSolrCoreState Closing SolrCoreState
[junit4:junit4] 2> 30083 T10 oasu.DefaultSolrCoreState.closeIndexWriter SolrCoreState ref count has reached 0 - closing IndexWriter
[junit4:junit4] 2> 30083 T10 oasu.DefaultSolrCoreState.closeIndexWriter closing IndexWriter with IndexWriterCloser
[junit4:junit4] 2> 30087 T10 oasc.SolrCore.closeSearcher [collection1] Closing main searcher on request.
[junit4:junit4] 2> 30127 T10 oejsh.ContextHandler.doStop stopped o.e.j.s.ServletContextHandler{/solr,null}
[junit4:junit4] 2> 30187 T89 C7 REQ [collection1] webapp=/solr path=/select params={wt=javabin&q=*:*&version=2} hits=10 status=0 QTime=1
[junit4:junit4] 2> 31141 T109 C9 REQ [collection1] webapp=/solr path=/select params={wt=javabin&q=*:*&version=2} hits=10 status=0 QTime=1
[junit4:junit4] 2> 31145 T92 C7 REQ [collection1] webapp=/solr path=/select params={wt=javabin&q=*:*&version=2} hits=10 status=0 QTime=0
[junit4:junit4] 2> 31146 T10 oejs.Server.doStart jetty-8.1.2.v20120308
[junit4:junit4] 2> 31203 T10 oejs.AbstractConnector.doStart Started SelectChannelConnector@0.0.0.0:64288
[junit4:junit4] 2> 31203 T10 oasc.SolrResourceLoader.locateSolrHome JNDI not configured for solr (NoInitialContextEx)
[junit4:junit4] 2> 31204 T10 oasc.SolrResourceLoader.locateSolrHome using system property solr.solr.home: .\org.apache.solr.client.solrj.TestLBHttpSolrServer$SolrInstance-1351632239942\solr\collection11
[junit4:junit4] 2> 31204 T10 oasc.SolrResourceLoader.<init> new SolrResourceLoader for deduced Solr Home: '.\org.apache.solr.client.solrj.TestLBHttpSolrServer$SolrInstance-1351632239942\solr\collection11\'
[junit4:junit4] 2> 31283 T10 oass.SolrDispatchFilter.init SolrDispatchFilter.init()
[junit4:junit4] 2> 31284 T10 oasc.SolrResourceLoader.locateSolrHome JNDI not configured for solr (NoInitialContextEx)
[junit4:junit4] 2> 31284 T10 oasc.SolrResourceLoader.locateSolrHome using system property solr.solr.home: .\org.apache.solr.client.solrj.TestLBHttpSolrServer$SolrInstance-1351632239942\solr\collection11
[junit4:junit4] 2> 31284 T10 oasc.CoreContainer$Initializer.initialize looking for solr.xml: <http://sierranevada.servebeer.com:8080/job/slow-io-beasting/ws/solr/build/solr-solrj/test/J0/./org.apache.solr.client.solrj.TestLBHttpSolrServer$SolrInstance-1351632239942/solr/collection11/solr.xml>
[junit4:junit4] 2> 31285 T10 oasc.CoreContainer.<init> New CoreContainer 28914982
[junit4:junit4] 2> 31286 T10 oasc.CoreContainer$Initializer.initialize no solr.xml file found - using default
[junit4:junit4] 2> 31286 T10 oasc.CoreContainer.load Loading CoreContainer using Solr Home: '.\org.apache.solr.client.solrj.TestLBHttpSolrServer$SolrInstance-1351632239942\solr\collection11\'
[junit4:junit4] 2> 31286 T10 oasc.SolrResourceLoader.<init> new SolrResourceLoader for directory: '.\org.apache.solr.client.solrj.TestLBHttpSolrServer$SolrInstance-1351632239942\solr\collection11\'
[junit4:junit4] 2> 31315 T10 oasc.CoreContainer.load Registering Log Listener
[junit4:junit4] 2> 31344 T10 oasc.CoreContainer.create Creating SolrCore 'collection1' using instanceDir: .\org.apache.solr.client.solrj.TestLBHttpSolrServer$SolrInstance-1351632239942\solr\collection11\collection1
[junit4:junit4] 2> 31346 T10 oasc.SolrResourceLoader.<init> new SolrResourceLoader for directory: '.\org.apache.solr.client.solrj.TestLBHttpSolrServer$SolrInstance-1351632239942\solr\collection11\collection1\'
[junit4:junit4] 2> 31407 T10 oasc.SolrConfig.<init> Using Lucene MatchVersion: LUCENE_41
[junit4:junit4] 2> 31484 T10 oasc.SolrConfig.<init> Loaded SolrConfig: solrconfig.xml
[junit4:junit4] 2> 31485 T10 oass.IndexSchema.readSchema Reading Solr Schema
[junit4:junit4] 2> 31489 T10 oass.IndexSchema.readSchema Schema name=test
[junit4:junit4] 2> 31521 T10 oass.IndexSchema.readSchema unique key field: id
[junit4:junit4] 2> 31524 T10 oasc.SolrCore.<init> [collection1] Opening new SolrCore at .\org.apache.solr.client.solrj.TestLBHttpSolrServer$SolrInstance-1351632239942\solr\collection11\collection1\, dataDir=.\org.apache.solr.client.solrj.TestLBHttpSolrServer$SolrInstance-1351632239942\solr\collection11\collection1\data\
[junit4:junit4] 2> 31524 T10 oasc.SolrCore.<init> JMX monitoring not detected for core: collection1
[junit4:junit4] 2> 31526 T10 oasc.SolrCore.getNewIndexDir New index directory detected: old=null new=.\org.apache.solr.client.solrj.TestLBHttpSolrServer$SolrInstance-1351632239942\solr\collection11\collection1\data\index/
[junit4:junit4] 2> 31528 T10 oasc.RequestHandlers.initHandlersFromConfig created standard: solr.StandardRequestHandler
[junit4:junit4] 2> 31528 T10 oasc.RequestHandlers.initHandlersFromConfig created defaults: solr.StandardRequestHandler
[junit4:junit4] 2> 31529 T10 oasc.RequestHandlers.initHandlersFromConfig adding lazy requestHandler: solr.StandardRequestHandler
[junit4:junit4] 2> 31529 T10 oasc.RequestHandlers.initHandlersFromConfig created lazy: solr.StandardRequestHandler
[junit4:junit4] 2> 31529 T10 oasc.RequestHandlers.initHandlersFromConfig created /update: solr.UpdateRequestHandler
[junit4:junit4] 2> 31530 T10 oasc.RequestHandlers.initHandlersFromConfig created /replication: solr.ReplicationHandler
[junit4:junit4] 2> 31538 T10 oashl.XMLLoader.init xsltCacheLifetimeSeconds=60
[junit4:junit4] 2> 31542 T10 oasc.CachingDirectoryFactory.get return new directory for <http://sierranevada.servebeer.com:8080/job/slow-io-beasting/ws/solr/build/solr-solrj/test/J0/./org.apache.solr.client.solrj.TestLBHttpSolrServer$SolrInstance-1351632239942/solr/collection11/collection1/data/index> forceNew:false
[junit4:junit4] 2> 31547 T10 oass.SolrIndexSearcher.<init> Opening Searcher@9c1f2c main
[junit4:junit4] 2> 31547 T10 oass.SolrIndexSearcher.getIndexDir WARNING WARNING: Directory impl does not support setting indexDir: org.apache.lucene.store.MockDirectoryWrapper
[junit4:junit4] 2> 31548 T10 oasu.CommitTracker.<init> Hard AutoCommit: disabled
[junit4:junit4] 2> 31548 T10 oasu.CommitTracker.<init> Soft AutoCommit: disabled
[junit4:junit4] 2> 31549 T10 oashc.HttpShardHandlerFactory.getParameter Setting socketTimeout to: 0
[junit4:junit4] 2> 31549 T10 oashc.HttpShardHandlerFactory.getParameter Setting urlScheme to: http://
[junit4:junit4] 2> 31549 T10 oashc.HttpShardHandlerFactory.getParameter Setting connTimeout to: 0
[junit4:junit4] 2> 31549 T10 oashc.HttpShardHandlerFactory.getParameter Setting maxConnectionsPerHost to: 20
[junit4:junit4] 2> 31550 T10 oashc.HttpShardHandlerFactory.getParameter Setting corePoolSize to: 0
[junit4:junit4] 2> 31550 T10 oashc.HttpShardHandlerFactory.getParameter Setting maximumPoolSize to: 2147483647
[junit4:junit4] 2> 31550 T10 oashc.HttpShardHandlerFactory.getParameter Setting maxThreadIdleTime to: 5
[junit4:junit4] 2> 31551 T10 oashc.HttpShardHandlerFactory.getParameter Setting sizeOfQueue to: -1
[junit4:junit4] 2> 31551 T10 oashc.HttpShardHandlerFactory.getParameter Setting fairnessPolicy to: false
[junit4:junit4] 2> 31551 T10 oascsi.HttpClientUtil.createClient Creating new http client, config:maxConnectionsPerHost=20&maxConnections=10000&socketTimeout=0&connTimeout=0&retry=false
[junit4:junit4] 2> 31580 T10 oash.ReplicationHandler.inform Commits will be reserved for 10000
[junit4:junit4] 2> 31582 T10 oasc.CoreContainer.register registering core: collection1
[junit4:junit4] 2> 31583 T10 oass.SolrDispatchFilter.init user.dir=<http://sierranevada.servebeer.com:8080/job/slow-io-beasting/ws/solr/build/solr-solrj/test/J0>
[junit4:junit4] 2> 31583 T128 oasc.SolrCore.registerSearcher [collection1] Registered new searcher Searcher@9c1f2c main{StandardDirectoryReader(segments_2:3 _0(4.1):C10)}
[junit4:junit4] 2> 31583 T10 oass.SolrDispatchFilter.init SolrDispatchFilter.init() done
[junit4:junit4] 2> ASYNC NEW_CORE C10 name=collection1 org.apache.solr.core.SolrCore@130500f
[junit4:junit4] 2> 31654 T125 C10 REQ [collection1] webapp=/solr path=/select params={wt=javabin&q=*:*&rows=0&version=2} hits=10 status=0 QTime=0
[junit4:junit4] 2> 32784 T116 C9 REQ [collection1] webapp=/solr path=/select params={wt=javabin&q=*:*&version=2} hits=10 status=0 QTime=0
[junit4:junit4] 2> 32787 T127 C10 REQ [collection1] webapp=/solr path=/select params={wt=javabin&q=*:*&version=2} hits=10 status=0 QTime=0
[junit4:junit4] 2> 32789 T89 C7 REQ [collection1] webapp=/solr path=/select params={wt=javabin&q=*:*&version=2} hits=10 status=0 QTime=0
[junit4:junit4] 2> 32801 T10 oasc.CoreContainer.shutdown Shutting down CoreContainer instance=10576215
[junit4:junit4] 2> 32802 T10 oasc.SolrCore.close [collection1] CLOSING SolrCore org.apache.solr.core.SolrCore@14a616
[junit4:junit4] 2> 32802 T10 oasu.DirectUpdateHandler2.close closing DirectUpdateHandler2{commits=1,autocommits=0,soft autocommits=0,optimizes=0,rollbacks=0,expungeDeletes=0,docsPending=0,adds=0,deletesById=0,deletesByQuery=0,errors=0,cumulative_adds=10,cumulative_deletesById=0,cumulative_deletesByQuery=0,cumulative_errors=0}
[junit4:junit4] 2> 32802 T10 oasc.SolrCore.decrefSolrCoreState Closing SolrCoreState
[junit4:junit4] 2> 32803 T10 oasu.DefaultSolrCoreState.closeIndexWriter SolrCoreState ref count has reached 0 - closing IndexWriter
[junit4:junit4] 2> 32803 T10 oasu.DefaultSolrCoreState.closeIndexWriter closing IndexWriter with IndexWriterCloser
[junit4:junit4] 2> 32810 T10 oasc.SolrCore.closeSearcher [collection1] Closing main searcher on request.
[junit4:junit4] 2> 32818 T10 oejsh.ContextHandler.doStop stopped o.e.j.s.ServletContextHandler{/solr,null}
[junit4:junit4] 2> 32941 T10 oasc.CoreContainer.shutdown Shutting down CoreContainer instance=28914982
[junit4:junit4] 2> 32942 T10 oasc.SolrCore.close [collection1] CLOSING SolrCore org.apache.solr.core.SolrCore@130500f
[junit4:junit4] 2> 32942 T10 oasu.DirectUpdateHandler2.close closing DirectUpdateHandler2{commits=0,autocommits=0,soft autocommits=0,optimizes=0,rollbacks=0,expungeDeletes=0,docsPending=0,adds=0,deletesById=0,deletesByQuery=0,errors=0,cumulative_adds=0,cumulative_deletesById=0,cumulative_deletesByQuery=0,cumulative_errors=0}
[junit4:junit4] 2> 32942 T10 oasc.SolrCore.decrefSolrCoreState Closing SolrCoreState
[junit4:junit4] 2> 32942 T10 oasu.DefaultSolrCoreState.closeIndexWriter SolrCoreState ref count has reached 0 - closing IndexWriter
[junit4:junit4] 2> 32943 T10 oasu.DefaultSolrCoreState.closeIndexWriter closing IndexWriter with IndexWriterCloser
[junit4:junit4] 2> 32943 T10 oasc.SolrCore.closeSearcher [collection1] Closing main searcher on request.
[junit4:junit4] 2> 32951 T10 oejsh.ContextHandler.doStop stopped o.e.j.s.ServletContextHandler{/solr,null}
[junit4:junit4] 2> 33225 T10 oasc.CoreContainer.shutdown Shutting down CoreContainer instance=15941745
[junit4:junit4] 2> 33225 T10 oasc.SolrCore.close [collection1] CLOSING SolrCore org.apache.solr.core.SolrCore@1ea763a
[junit4:junit4] 2> 33226 T10 oasu.DirectUpdateHandler2.close closing DirectUpdateHandler2{commits=1,autocommits=0,soft autocommits=0,optimizes=0,rollbacks=0,expungeDeletes=0,docsPending=0,adds=0,deletesById=0,deletesByQuery=0,errors=0,cumulative_adds=10,cumulative_deletesById=0,cumulative_deletesByQuery=0,cumulative_errors=0}
[junit4:junit4] 2> 33227 T10 oasc.SolrCore.decrefSolrCoreState Closing SolrCoreState
[junit4:junit4] 2> 33227 T10 oasu.DefaultSolrCoreState.closeIndexWriter SolrCoreState ref count has reached 0 - closing IndexWriter
[junit4:junit4] 2> 33228 T10 oasu.DefaultSolrCoreState.closeIndexWriter closing IndexWriter with IndexWriterCloser
[junit4:junit4] 2> 33238 T10 oasc.SolrCore.closeSearcher [collection1] Closing main searcher on request.
[junit4:junit4] 2> 33250 T10 oejsh.ContextHandler.doStop stopped o.e.j.s.ServletContextHandler{/solr,null}
[junit4:junit4] 2> NOTE: test params are: codec=Lucene3x, sim=DefaultSimilarity, locale=es_DO, timezone=US/Indiana-Starke
[junit4:junit4] 2> NOTE: Windows Vista 6.0 x86/Sun Microsystems Inc. 1.6.0_23 (32-bit)/cpus=4,threads=4,free=2741056,total=16252928
[junit4:junit4] 2> NOTE: All tests run in this JVM: [TestLBHttpSolrServer]
[junit4:junit4] Completed on J0 in 36.38s, 3 tests, 1 error <<< FAILURES!
[junit4:junit4]
[junit4:junit4] Suite: org.apache.solr.client.solrj.impl.BasicHttpSolrServerTest
[junit4:junit4] Completed on J7 in 8.00s, 9 tests
[junit4:junit4]
[junit4:junit4] Suite: org.apache.solr.common.util.ContentStreamTest
[junit4:junit4] Completed on J7 in 0.09s, 3 tests
[junit4:junit4]
[junit4:junit4] Suite: org.apache.solr.client.solrj.TestBatchUpdate
[junit4:junit4] Completed on J6 in 4.66s, 3 tests
[junit4:junit4]
[junit4:junit4] Suite: org.apache.solr.client.solrj.SolrQueryTest
[junit4:junit4] Completed on J6 in 0.06s, 9 tests
[junit4:junit4]
[junit4:junit4] Suite: org.apache.solr.client.solrj.embedded.LargeVolumeJettyTest
[junit4:junit4] Completed on J6 in 3.02s, 1 test
[junit4:junit4]
[junit4:junit4] Suite: org.apache.solr.client.solrj.SolrExampleBinaryTest
[junit4:junit4] Completed on J5 in 12.59s, 23 tests
[junit4:junit4]
[junit4:junit4] Suite: org.apache.solr.client.solrj.SolrExampleXMLTest
[junit4:junit4] Completed on J3 in 16.73s, 23 tests
[junit4:junit4]
[junit4:junit4] Suite: org.apache.solr.client.solrj.embedded.MultiCoreExampleJettyTest
[junit4:junit4] Completed on J0 in 5.14s, 2 tests
[junit4:junit4]
[junit4:junit4] Suite: org.apache.solr.client.solrj.embedded.SolrExampleJettyTest
[junit4:junit4] Completed on J4 in 12.09s, 24 tests
[junit4:junit4]
[junit4:junit4] Suite: org.apache.solr.client.solrj.beans.TestDocumentObjectBinder
[junit4:junit4] Completed on J5 in 0.04s, 5 tests
[junit4:junit4]
[junit4:junit4] Suite: org.apache.solr.common.util.TestFastInputStream
[junit4:junit4] Completed on J4 in 0.02s, 1 test
[junit4:junit4]
[junit4:junit4] Suite: org.apache.solr.client.solrj.embedded.LargeVolumeBinaryJettyTest
[junit4:junit4] Completed on J7 in 3.41s, 1 test
[junit4:junit4]
[junit4:junit4] Suite: org.apache.solr.common.SolrDocumentTest
[junit4:junit4] Completed on J7 in 0.06s, 5 tests
[junit4:junit4]
[junit4:junit4] Suite: org.apache.solr.common.util.TestJavaBinCodec
[junit4:junit4] Completed on J5 in 0.33s, 1 test
[junit4:junit4]
[junit4:junit4] Suite: org.apache.solr.client.solrj.response.QueryResponseTest
[junit4:junit4] Completed on J0 in 0.33s, 3 tests
[junit4:junit4]
[junit4:junit4] Suite: org.apache.solr.common.util.IteratorChainTest
[junit4:junit4] Completed on J7 in 0.03s, 7 tests
[junit4:junit4]
[junit4:junit4] Suite: org.apache.solr.common.util.TestNamedListCodec
[junit4:junit4] Completed on J4 in 0.58s, 4 tests
[junit4:junit4]
[junit4:junit4] Suite: org.apache.solr.common.params.SolrParamTest
[junit4:junit4] Completed on J5 in 0.05s, 1 test
[junit4:junit4]
[junit4:junit4] Suite: org.apache.solr.client.solrj.impl.HttpClientUtilTest
[junit4:junit4] Completed on J0 in 0.05s, 3 tests
[junit4:junit4]
[junit4:junit4] Suite: org.apache.solr.client.solrj.response.FacetFieldTest
[junit4:junit4] Completed on J7 in 0.02s, 1 test
[junit4:junit4]
[junit4:junit4] Suite: org.apache.solr.common.util.NamedListTest
[junit4:junit4] Completed on J4 in 0.02s, 1 test
[junit4:junit4]
[junit4:junit4] Suite: org.apache.solr.client.solrj.util.ClientUtilsTest
[junit4:junit4] Completed on J5 in 0.03s, 1 test
[junit4:junit4]
[junit4:junit4] Suite: org.apache.solr.client.solrj.response.TermsResponseTest
[junit4:junit4] Completed on J6 in 1.68s, 1 test
[junit4:junit4]
[junit4:junit4] Suite: org.apache.solr.client.solrj.embedded.TestEmbeddedSolrServer
[junit4:junit4] Completed on J3 in 1.92s, 2 tests
[junit4:junit4]
[junit4:junit4] Suite: org.apache.solr.client.solrj.embedded.SolrExampleStreamingTest
[junit4:junit4] Completed on J2 in 44.14s, 24 tests
[junit4:junit4]
[junit4:junit4] Suite: org.apache.solr.client.solrj.embedded.SolrExampleStreamingBinaryTest
[junit4:junit4] Completed on J1 in 46.36s, 24 tests
[junit4:junit4]
[junit4:junit4] Suite: org.apache.solr.client.solrj.impl.CloudSolrServerTest
[junit4:junit4] Completed on J0 in 32.57s, 1 test
[junit4:junit4]
[junit4:junit4]
[junit4:junit4] Tests with failures:
[junit4:junit4] - org.apache.solr.client.solrj.TestLBHttpSolrServer.testReliability
[junit4:junit4]
[junit4:junit4]
[junit4:junit4] JVM J0: 3.43 .. 80.48 = 77.05s
[junit4:junit4] JVM J1: 2.92 .. 51.44 = 48.51s
[junit4:junit4] JVM J2: 3.18 .. 49.17 = 45.99s
[junit4:junit4] JVM J3: 2.92 .. 49.03 = 46.10s
[junit4:junit4] JVM J4: 1.69 .. 48.05 = 46.36s
[junit4:junit4] JVM J5: 3.43 .. 47.81 = 44.38s
[junit4:junit4] JVM J6: 3.18 .. 48.71 = 45.53s
[junit4:junit4] JVM J7: 2.68 .. 47.96 = 45.29s
[junit4:junit4] Execution time total: 1 minute 20 seconds
[junit4:junit4] Tests summary: 43 suites, 239 tests, 1 error
BUILD FAILED
<http://sierranevada.servebeer.com:8080/job/slow-io-beasting/ws/build.xml>:39: The following error occurred while executing this line:
<http://sierranevada.servebeer.com:8080/job/slow-io-beasting/ws/solr/build.xml>:185: The following error occurred while executing this line:
<http://sierranevada.servebeer.com:8080/job/slow-io-beasting/ws/lucene/module-build.xml>:61: The following error occurred while executing this line:
<http://sierranevada.servebeer.com:8080/job/slow-io-beasting/ws/lucene/common-build.xml>:1159: The following error occurred while executing this line:
<http://sierranevada.servebeer.com:8080/job/slow-io-beasting/ws/lucene/common-build.xml>:827: There were test failures: 43 suites, 239 tests, 1 error
Total time: 15 minutes 33 seconds
Build step 'Invoke Ant' marked build as failure
---------------------------------------------------------------------
To unsubscribe, e-mail: dev-unsubscribe@lucene.apache.org
For additional commands, e-mail: dev-help@lucene.apache.org