You are viewing a plain text version of this content. The canonical link for it is here.
Posted to commits@myfaces.apache.org by Apache Jenkins Server <je...@builds.apache.org> on 2020/05/29 12:30:13 UTC
Build failed in Jenkins: myfaces-current-master #481
See <https://builds.apache.org/job/myfaces-current-master/481/display/redirect?page=changes>
Changes:
[tandraschko] switched to web.xml
------------------------------------------
[...truncated 2.27 MB...]
[INFO] --- maven-bundle-plugin:3.0.1:bundle (default-bundle) @ myfaces-bundle ---
[WARNING] Bundle org.apache.myfaces.core:myfaces-bundle:bundle:2.3-next-SNAPSHOT : Export org.apache.myfaces.util.lang, has 1, private references [org.apache.myfaces.core.api.shared],
[INFO]
[INFO] >>> maven-source-plugin:2.2.1:jar (attach-source) > generate-sources @ myfaces-bundle >>>
[INFO]
[INFO] --- maven-enforcer-plugin:1.4.1:enforce (enforce-maven-version) @ myfaces-bundle ---
[INFO]
[INFO] --- maven-checkstyle-plugin:2.17:check (validate) @ myfaces-bundle ---
[INFO] Starting audit...
Audit done.
[WARNING] Failed to getClass for org.apache.maven.plugin.source.SourceJarMojo
[INFO]
[INFO] <<< maven-source-plugin:2.2.1:jar (attach-source) < generate-sources @ myfaces-bundle <<<
[INFO]
[INFO]
[INFO] --- maven-source-plugin:2.2.1:jar (attach-source) @ myfaces-bundle ---
[INFO] Building jar: <https://builds.apache.org/job/myfaces-current-master/ws/bundle/target/myfaces-bundle-2.3-next-SNAPSHOT-sources.jar>
[INFO]
[INFO] --- maven-site-plugin:3.3:attach-descriptor (attach-descriptor) @ myfaces-bundle ---
[INFO]
[INFO] --- maven-checkstyle-plugin:2.17:check (verify-style) @ myfaces-bundle ---
[INFO] Starting audit...
Audit done.
[INFO]
[INFO] --- maven-install-plugin:2.5.2:install (default-install) @ myfaces-bundle ---
[INFO] Installing <https://builds.apache.org/job/myfaces-current-master/ws/bundle/target/myfaces-bundle-2.3-next-SNAPSHOT.jar> to /home/jenkins/jenkins-slave/maven-repositories/1/org/apache/myfaces/core/myfaces-bundle/2.3-next-SNAPSHOT/myfaces-bundle-2.3-next-SNAPSHOT.jar
[INFO] Installing <https://builds.apache.org/job/myfaces-current-master/ws/bundle/pom.xml> to /home/jenkins/jenkins-slave/maven-repositories/1/org/apache/myfaces/core/myfaces-bundle/2.3-next-SNAPSHOT/myfaces-bundle-2.3-next-SNAPSHOT.pom
[INFO] Installing <https://builds.apache.org/job/myfaces-current-master/ws/bundle/target/myfaces-bundle-2.3-next-SNAPSHOT-sources.jar> to /home/jenkins/jenkins-slave/maven-repositories/1/org/apache/myfaces/core/myfaces-bundle/2.3-next-SNAPSHOT/myfaces-bundle-2.3-next-SNAPSHOT-sources.jar
[INFO] Installing <https://builds.apache.org/job/myfaces-current-master/ws/bundle/target/myfaces-bundle-2.3-next-SNAPSHOT-sources.jar> to /home/jenkins/jenkins-slave/maven-repositories/1/org/apache/myfaces/core/myfaces-bundle/2.3-next-SNAPSHOT/myfaces-bundle-2.3-next-SNAPSHOT-sources.jar
[INFO]
[INFO] --- maven-bundle-plugin:3.0.1:install (default-install) @ myfaces-bundle ---
[INFO] Installing org/apache/myfaces/core/myfaces-bundle/2.3-next-SNAPSHOT/myfaces-bundle-2.3-next-SNAPSHOT.jar
[INFO] Writing OBR metadata
[INFO]
[INFO] --- maven-deploy-plugin:2.8.2:deploy (default-deploy) @ myfaces-bundle ---
[INFO] Downloading from apache.snapshots.https: https://repository.apache.org/content/repositories/snapshots/org/apache/myfaces/core/myfaces-bundle/2.3-next-SNAPSHOT/maven-metadata.xml
[INFO] Downloaded from apache.snapshots.https: https://repository.apache.org/content/repositories/snapshots/org/apache/myfaces/core/myfaces-bundle/2.3-next-SNAPSHOT/maven-metadata.xml (1.0 kB at 1.6 kB/s)
[INFO] Uploading to apache.snapshots.https: https://repository.apache.org/content/repositories/snapshots/org/apache/myfaces/core/myfaces-bundle/2.3-next-SNAPSHOT/myfaces-bundle-2.3-next-20200529.122906-243.jar
[INFO] Uploaded to apache.snapshots.https: https://repository.apache.org/content/repositories/snapshots/org/apache/myfaces/core/myfaces-bundle/2.3-next-SNAPSHOT/myfaces-bundle-2.3-next-20200529.122906-243.jar (3.5 MB at 1.6 MB/s)
[INFO] Uploading to apache.snapshots.https: https://repository.apache.org/content/repositories/snapshots/org/apache/myfaces/core/myfaces-bundle/2.3-next-SNAPSHOT/myfaces-bundle-2.3-next-20200529.122906-243.pom
[INFO] Uploaded to apache.snapshots.https: https://repository.apache.org/content/repositories/snapshots/org/apache/myfaces/core/myfaces-bundle/2.3-next-SNAPSHOT/myfaces-bundle-2.3-next-20200529.122906-243.pom (6.5 kB at 6.7 kB/s)
[INFO] Downloading from apache.snapshots.https: https://repository.apache.org/content/repositories/snapshots/org/apache/myfaces/core/myfaces-bundle/maven-metadata.xml
[INFO] Downloaded from apache.snapshots.https: https://repository.apache.org/content/repositories/snapshots/org/apache/myfaces/core/myfaces-bundle/maven-metadata.xml (617 B at 1.9 kB/s)
[INFO] Uploading to apache.snapshots.https: https://repository.apache.org/content/repositories/snapshots/org/apache/myfaces/core/myfaces-bundle/2.3-next-SNAPSHOT/maven-metadata.xml
[INFO] Uploaded to apache.snapshots.https: https://repository.apache.org/content/repositories/snapshots/org/apache/myfaces/core/myfaces-bundle/2.3-next-SNAPSHOT/maven-metadata.xml (1.0 kB at 1.1 kB/s)
[INFO] Uploading to apache.snapshots.https: https://repository.apache.org/content/repositories/snapshots/org/apache/myfaces/core/myfaces-bundle/maven-metadata.xml
[INFO] Uploaded to apache.snapshots.https: https://repository.apache.org/content/repositories/snapshots/org/apache/myfaces/core/myfaces-bundle/maven-metadata.xml (617 B at 649 B/s)
[INFO] Uploading to apache.snapshots.https: https://repository.apache.org/content/repositories/snapshots/org/apache/myfaces/core/myfaces-bundle/2.3-next-SNAPSHOT/myfaces-bundle-2.3-next-20200529.122906-243-sources.jar
[INFO] Uploaded to apache.snapshots.https: https://repository.apache.org/content/repositories/snapshots/org/apache/myfaces/core/myfaces-bundle/2.3-next-SNAPSHOT/myfaces-bundle-2.3-next-20200529.122906-243-sources.jar (4.9 kB at 5.2 kB/s)
[INFO] Uploading to apache.snapshots.https: https://repository.apache.org/content/repositories/snapshots/org/apache/myfaces/core/myfaces-bundle/2.3-next-SNAPSHOT/maven-metadata.xml
[INFO] Uploaded to apache.snapshots.https: https://repository.apache.org/content/repositories/snapshots/org/apache/myfaces/core/myfaces-bundle/2.3-next-SNAPSHOT/maven-metadata.xml (1.0 kB at 1.1 kB/s)
[INFO] Uploading to apache.snapshots.https: https://repository.apache.org/content/repositories/snapshots/org/apache/myfaces/core/myfaces-bundle/2.3-next-SNAPSHOT/myfaces-bundle-2.3-next-20200529.122906-243-sources.jar
[INFO] Uploaded to apache.snapshots.https: https://repository.apache.org/content/repositories/snapshots/org/apache/myfaces/core/myfaces-bundle/2.3-next-SNAPSHOT/myfaces-bundle-2.3-next-20200529.122906-243-sources.jar (4.9 kB at 5.0 kB/s)
[INFO] Uploading to apache.snapshots.https: https://repository.apache.org/content/repositories/snapshots/org/apache/myfaces/core/myfaces-bundle/2.3-next-SNAPSHOT/maven-metadata.xml
[INFO] Uploaded to apache.snapshots.https: https://repository.apache.org/content/repositories/snapshots/org/apache/myfaces/core/myfaces-bundle/2.3-next-SNAPSHOT/maven-metadata.xml (1.0 kB at 1.1 kB/s)
[INFO]
[INFO] --- maven-bundle-plugin:3.0.1:deploy (default-deploy) @ myfaces-bundle ---
[INFO] Remote OBR update disabled (enable with -DremoteOBR)
[INFO]
[INFO] -------------< org.apache.myfaces.core:myfaces-extensions >-------------
[INFO] Building Apache MyFaces Core 2.3-next - Extensions 2.3-next-SNAPSHOT [6/10]
[INFO] --------------------------------[ pom ]---------------------------------
[INFO]
[INFO] --- maven-clean-plugin:3.1.0:clean (default-clean) @ myfaces-extensions ---
[INFO]
[INFO] --- maven-enforcer-plugin:1.4.1:enforce (enforce-maven-version) @ myfaces-extensions ---
[INFO]
[INFO] --- maven-checkstyle-plugin:2.17:check (validate) @ myfaces-extensions ---
[INFO] Starting audit...
Audit done.
[INFO]
[INFO] --- maven-remote-resources-plugin:1.5:process (process-resource-bundles) @ myfaces-extensions ---
[INFO]
[INFO] >>> maven-source-plugin:2.2.1:jar (attach-source) > generate-sources @ myfaces-extensions >>>
[INFO]
[INFO] --- maven-enforcer-plugin:1.4.1:enforce (enforce-maven-version) @ myfaces-extensions ---
[INFO]
[INFO] --- maven-checkstyle-plugin:2.17:check (validate) @ myfaces-extensions ---
[INFO] Starting audit...
Audit done.
[WARNING] Failed to getClass for org.apache.maven.plugin.source.SourceJarMojo
[INFO]
[INFO] <<< maven-source-plugin:2.2.1:jar (attach-source) < generate-sources @ myfaces-extensions <<<
[INFO]
[INFO]
[INFO] --- maven-source-plugin:2.2.1:jar (attach-source) @ myfaces-extensions ---
[INFO]
[INFO] --- maven-site-plugin:3.3:attach-descriptor (attach-descriptor) @ myfaces-extensions ---
[INFO]
[INFO] --- maven-checkstyle-plugin:2.17:check (verify-style) @ myfaces-extensions ---
[INFO] Starting audit...
Audit done.
[INFO]
[INFO] --- maven-install-plugin:2.5.2:install (default-install) @ myfaces-extensions ---
[INFO] Installing <https://builds.apache.org/job/myfaces-current-master/ws/extensions/pom.xml> to /home/jenkins/jenkins-slave/maven-repositories/1/org/apache/myfaces/core/myfaces-extensions/2.3-next-SNAPSHOT/myfaces-extensions-2.3-next-SNAPSHOT.pom
[INFO]
[INFO] --- maven-enforcer-plugin:1.4.1:enforce (enforce-maven-version) @ myfaces-extensions ---
[INFO]
[INFO] --- maven-checkstyle-plugin:2.17:check (validate) @ myfaces-extensions ---
[INFO] Starting audit...
Audit done.
[INFO]
[INFO] --- maven-remote-resources-plugin:1.5:process (process-resource-bundles) @ myfaces-extensions ---
[INFO]
[INFO] >>> maven-source-plugin:2.2.1:jar (attach-source) > generate-sources @ myfaces-extensions >>>
[INFO]
[INFO] --- maven-enforcer-plugin:1.4.1:enforce (enforce-maven-version) @ myfaces-extensions ---
[INFO]
[INFO] --- maven-checkstyle-plugin:2.17:check (validate) @ myfaces-extensions ---
[INFO] Starting audit...
Audit done.
[WARNING] Failed to getClass for org.apache.maven.plugin.source.SourceJarMojo
[INFO]
[INFO] <<< maven-source-plugin:2.2.1:jar (attach-source) < generate-sources @ myfaces-extensions <<<
[INFO]
[INFO]
[INFO] --- maven-source-plugin:2.2.1:jar (attach-source) @ myfaces-extensions ---
[INFO]
[INFO] --- maven-site-plugin:3.3:attach-descriptor (attach-descriptor) @ myfaces-extensions ---
[INFO]
[INFO] --- maven-checkstyle-plugin:2.17:check (verify-style) @ myfaces-extensions ---
[INFO] Starting audit...
Audit done.
[INFO]
[INFO] --- maven-install-plugin:2.5.2:install (default-install) @ myfaces-extensions ---
[INFO] Installing <https://builds.apache.org/job/myfaces-current-master/ws/extensions/pom.xml> to /home/jenkins/jenkins-slave/maven-repositories/1/org/apache/myfaces/core/myfaces-extensions/2.3-next-SNAPSHOT/myfaces-extensions-2.3-next-SNAPSHOT.pom
[INFO]
[INFO] --- maven-deploy-plugin:2.8.2:deploy (default-deploy) @ myfaces-extensions ---
[INFO] Downloading from apache.snapshots.https: https://repository.apache.org/content/repositories/snapshots/org/apache/myfaces/core/myfaces-extensions/2.3-next-SNAPSHOT/maven-metadata.xml
[INFO] Downloaded from apache.snapshots.https: https://repository.apache.org/content/repositories/snapshots/org/apache/myfaces/core/myfaces-extensions/2.3-next-SNAPSHOT/maven-metadata.xml (628 B at 1.9 kB/s)
[INFO] Uploading to apache.snapshots.https: https://repository.apache.org/content/repositories/snapshots/org/apache/myfaces/core/myfaces-extensions/2.3-next-SNAPSHOT/myfaces-extensions-2.3-next-20200529.122925-259.pom
[INFO] Uploaded to apache.snapshots.https: https://repository.apache.org/content/repositories/snapshots/org/apache/myfaces/core/myfaces-extensions/2.3-next-SNAPSHOT/myfaces-extensions-2.3-next-20200529.122925-259.pom (1.7 kB at 1.7 kB/s)
[INFO] Downloading from apache.snapshots.https: https://repository.apache.org/content/repositories/snapshots/org/apache/myfaces/core/myfaces-extensions/maven-metadata.xml
[INFO] Downloaded from apache.snapshots.https: https://repository.apache.org/content/repositories/snapshots/org/apache/myfaces/core/myfaces-extensions/maven-metadata.xml (404 B at 1.2 kB/s)
[INFO] Uploading to apache.snapshots.https: https://repository.apache.org/content/repositories/snapshots/org/apache/myfaces/core/myfaces-extensions/2.3-next-SNAPSHOT/maven-metadata.xml
[INFO] Uploaded to apache.snapshots.https: https://repository.apache.org/content/repositories/snapshots/org/apache/myfaces/core/myfaces-extensions/2.3-next-SNAPSHOT/maven-metadata.xml (628 B at 649 B/s)
[INFO] Uploading to apache.snapshots.https: https://repository.apache.org/content/repositories/snapshots/org/apache/myfaces/core/myfaces-extensions/maven-metadata.xml
[INFO] Uploaded to apache.snapshots.https: https://repository.apache.org/content/repositories/snapshots/org/apache/myfaces/core/myfaces-extensions/maven-metadata.xml (404 B at 424 B/s)
[INFO]
[INFO] ---------< org.apache.myfaces.core.extensions:myfaces-quarkus >---------
[INFO] Building Apache MyFaces Core 2.3-next - Extensions - Quarkus 2.3-next-SNAPSHOT [7/10]
[INFO] --------------------------------[ pom ]---------------------------------
[INFO]
[INFO] --- maven-clean-plugin:3.1.0:clean (default-clean) @ myfaces-quarkus ---
[INFO]
[INFO] --- maven-enforcer-plugin:1.4.1:enforce (enforce-maven-version) @ myfaces-quarkus ---
[INFO]
[INFO] --- maven-checkstyle-plugin:2.17:check (validate) @ myfaces-quarkus ---
[INFO] Starting audit...
Audit done.
[INFO]
[INFO] --- maven-remote-resources-plugin:1.5:process (process-resource-bundles) @ myfaces-quarkus ---
[INFO]
[INFO] >>> maven-source-plugin:2.2.1:jar (attach-source) > generate-sources @ myfaces-quarkus >>>
[INFO]
[INFO] --- maven-enforcer-plugin:1.4.1:enforce (enforce-maven-version) @ myfaces-quarkus ---
[INFO]
[INFO] --- maven-checkstyle-plugin:2.17:check (validate) @ myfaces-quarkus ---
[INFO] Starting audit...
Audit done.
[WARNING] Failed to getClass for org.apache.maven.plugin.source.SourceJarMojo
[INFO]
[INFO] <<< maven-source-plugin:2.2.1:jar (attach-source) < generate-sources @ myfaces-quarkus <<<
[INFO]
[INFO]
[INFO] --- maven-source-plugin:2.2.1:jar (attach-source) @ myfaces-quarkus ---
[INFO]
[INFO] --- maven-site-plugin:3.3:attach-descriptor (attach-descriptor) @ myfaces-quarkus ---
[INFO]
[INFO] --- maven-checkstyle-plugin:2.17:check (verify-style) @ myfaces-quarkus ---
[INFO] Starting audit...
Audit done.
[INFO]
[INFO] --- apache-rat-plugin:0.12:check (default) @ myfaces-quarkus ---
[INFO] Enabled default license matchers.
[INFO] Will parse SCM ignores for exclusions...
[INFO] Finished adding exclusions from SCM ignore files.
[INFO] 63 implicit excludes (use -debug for more details).
[INFO] Exclude: **/*/README.md
[INFO] Exclude: **/*/MANIFEST.MF
[INFO] Exclude: .git
[INFO] Exclude: .gitignore
[INFO] Exclude: **/target/**/*
[INFO] Exclude: src/main/resources/META-INF/services/**
[INFO] 47 resources included (use -debug for more details)
[INFO] Rat check: Summary over all files. Unapproved: 1, unknown: 1, generated: 0, approved: 26 licenses.
[INFO] ------------------------------------------------------------------------
[INFO] Reactor Summary for Apache MyFaces Core 2.3-next 2.3-next-SNAPSHOT:
[INFO]
[INFO] Apache MyFaces Core 2.3-next - Parent .............. SUCCESS [ 21.183 s]
[INFO] Apache MyFaces Core 2.3-next - API ................. SUCCESS [ 54.595 s]
[INFO] Apache MyFaces Core 2.3-next - Test ................ SUCCESS [ 23.478 s]
[INFO] Apache MyFaces Core 2.3-next - Impl ................ SUCCESS [04:32 min]
[INFO] Apache MyFaces Core 2.3-next - OSGi Bundle ......... SUCCESS [ 28.018 s]
[INFO] Apache MyFaces Core 2.3-next - Extensions .......... SUCCESS [ 9.751 s]
[INFO] Apache MyFaces Core 2.3-next - Extensions - Quarkus FAILURE [ 3.224 s]
[INFO] Apache MyFaces Core 2.3-next - Extensions - Quarkus - Runtime SKIPPED
[INFO] Apache MyFaces Core 2.3-next - Extensions - Quarkus - Deployment SKIPPED
[INFO] Apache MyFaces Core 2.3-next ....................... SKIPPED
[INFO] ------------------------------------------------------------------------
[INFO] BUILD FAILURE
[INFO] ------------------------------------------------------------------------
[INFO] Total time: 07:36 min
[INFO] Finished at: 2020-05-29T12:29:50Z
[INFO] ------------------------------------------------------------------------
Waiting for Jenkins to finish collecting data
[ERROR] Failed to execute goal org.apache.rat:apache-rat-plugin:0.12:check (default) on project myfaces-quarkus: Too many files with unapproved license: 1 See RAT report in: <https://builds.apache.org/job/myfaces-current-master/ws/extensions/quarkus/target/rat.txt> -> [Help 1]
[ERROR]
[ERROR] To see the full stack trace of the errors, re-run Maven with the -e switch.
[ERROR] Re-run Maven using the -X switch to enable full debug logging.
[ERROR]
[ERROR] For more information about the errors and possible solutions, please read the following articles:
[ERROR] [Help 1] http://cwiki.apache.org/confluence/display/MAVEN/MojoFailureException
[ERROR]
[ERROR] After correcting the problems, you can resume the build with the command
[ERROR] mvn <goals> -rf :myfaces-quarkus
[JENKINS] Archiving <https://builds.apache.org/job/myfaces-current-master/ws/api/pom.xml> to org.apache.myfaces.core/myfaces-api/2.3-next-SNAPSHOT/myfaces-api-2.3-next-SNAPSHOT.pom
[JENKINS] Archiving <https://builds.apache.org/job/myfaces-current-master/ws/api/target/myfaces-api-2.3-next-SNAPSHOT.jar> to org.apache.myfaces.core/myfaces-api/2.3-next-20200529.122324-244/myfaces-api-2.3-next-20200529.122324-244.jar
[JENKINS] Archiving <https://builds.apache.org/job/myfaces-current-master/ws/api/target/myfaces-api-2.3-next-SNAPSHOT-sources.jar> to org.apache.myfaces.core/myfaces-api/2.3-next-20200529.122324-244/myfaces-api-2.3-next-20200529.122324-244-sources.jar
[JENKINS] Archiving <https://builds.apache.org/job/myfaces-current-master/ws/api/target/myfaces-api-2.3-next-SNAPSHOT-tests.jar> to org.apache.myfaces.core/myfaces-api/2.3-next-20200529.122324-244/myfaces-api-2.3-next-20200529.122324-244-tests.jar
[JENKINS] Archiving <https://builds.apache.org/job/myfaces-current-master/ws/extensions/quarkus/runtime/pom.xml> to org.apache.myfaces.core.extensions.quarkus/myfaces-quarkus/2.3-next-SNAPSHOT/myfaces-quarkus-2.3-next-SNAPSHOT.pom
[JENKINS] Archiving <https://builds.apache.org/job/myfaces-current-master/ws/test/pom.xml> to org.apache.myfaces.core/myfaces-test/2.3-next-SNAPSHOT/myfaces-test-2.3-next-SNAPSHOT.pom
[JENKINS] Archiving <https://builds.apache.org/job/myfaces-current-master/ws/test/target/myfaces-test-2.3-next-SNAPSHOT.jar> to org.apache.myfaces.core/myfaces-test/2.3-next-20200529.122356-244/myfaces-test-2.3-next-20200529.122356-244.jar
[JENKINS] Archiving <https://builds.apache.org/job/myfaces-current-master/ws/test/target/myfaces-test-2.3-next-SNAPSHOT-sources.jar> to org.apache.myfaces.core/myfaces-test/2.3-next-20200529.122356-244/myfaces-test-2.3-next-20200529.122356-244-sources.jar
[JENKINS] Archiving <https://builds.apache.org/job/myfaces-current-master/ws/extensions/pom.xml> to org.apache.myfaces.core/myfaces-extensions/2.3-next-SNAPSHOT/myfaces-extensions-2.3-next-SNAPSHOT.pom
[JENKINS] Archiving <https://builds.apache.org/job/myfaces-current-master/ws/extensions/quarkus/pom.xml> to org.apache.myfaces.core.extensions/myfaces-quarkus/2.3-next-SNAPSHOT/myfaces-quarkus-2.3-next-SNAPSHOT.pom
[JENKINS] Archiving <https://builds.apache.org/job/myfaces-current-master/ws/impl/pom.xml> to org.apache.myfaces.core/myfaces-impl/2.3-next-SNAPSHOT/myfaces-impl-2.3-next-SNAPSHOT.pom
[JENKINS] Archiving <https://builds.apache.org/job/myfaces-current-master/ws/impl/target/myfaces-impl-2.3-next-SNAPSHOT.jar> to org.apache.myfaces.core/myfaces-impl/2.3-next-20200529.122823-243/myfaces-impl-2.3-next-20200529.122823-243.jar
[JENKINS] Archiving <https://builds.apache.org/job/myfaces-current-master/ws/impl/target/myfaces-impl-2.3-next-SNAPSHOT-sources.jar> to org.apache.myfaces.core/myfaces-impl/2.3-next-20200529.122823-243/myfaces-impl-2.3-next-20200529.122823-243-sources.jar
[JENKINS] Archiving <https://builds.apache.org/job/myfaces-current-master/ws/impl/target/myfaces-impl-2.3-next-SNAPSHOT-test-sources.jar> to org.apache.myfaces.core/myfaces-impl/2.3-next-20200529.122823-243/myfaces-impl-2.3-next-20200529.122823-243-test-sources.jar
[JENKINS] Archiving <https://builds.apache.org/job/myfaces-current-master/ws/impl/target/myfaces-impl-2.3-next-SNAPSHOT-tests.jar> to org.apache.myfaces.core/myfaces-impl/2.3-next-20200529.122823-243/myfaces-impl-2.3-next-20200529.122823-243-tests.jar
[JENKINS] Archiving <https://builds.apache.org/job/myfaces-current-master/ws/bundle/pom.xml> to org.apache.myfaces.core/myfaces-bundle/2.3-next-SNAPSHOT/myfaces-bundle-2.3-next-SNAPSHOT.pom
[JENKINS] Archiving <https://builds.apache.org/job/myfaces-current-master/ws/bundle/target/myfaces-bundle-2.3-next-SNAPSHOT.jar> to org.apache.myfaces.core/myfaces-bundle/2.3-next-20200529.122906-243/myfaces-bundle-2.3-next-20200529.122906-243.jar
[JENKINS] Archiving <https://builds.apache.org/job/myfaces-current-master/ws/bundle/target/myfaces-bundle-2.3-next-SNAPSHOT-sources.jar> to org.apache.myfaces.core/myfaces-bundle/2.3-next-20200529.122906-243/myfaces-bundle-2.3-next-20200529.122906-243-sources.jar
[JENKINS] Archiving <https://builds.apache.org/job/myfaces-current-master/ws/extensions/quarkus/deployment/pom.xml> to org.apache.myfaces.core.extensions.quarkus/myfaces-quarkus-deployment/2.3-next-SNAPSHOT/myfaces-quarkus-deployment-2.3-next-SNAPSHOT.pom
[JENKINS] Archiving <https://builds.apache.org/job/myfaces-current-master/ws/pom.xml> to org.apache.myfaces.core/myfaces-core-module/2.3-next-SNAPSHOT/myfaces-core-module-2.3-next-SNAPSHOT.pom
[JENKINS] Archiving <https://builds.apache.org/job/myfaces-current-master/ws/parent/pom.xml> to org.apache.myfaces.core/myfaces-core-project/2.3-next-SNAPSHOT/myfaces-core-project-2.3-next-SNAPSHOT.pom
[JENKINS] Archiving <https://builds.apache.org/job/myfaces-current-master/ws/parent/target/myfaces-core-project-2.3-next-SNAPSHOT-site.xml> to org.apache.myfaces.core/myfaces-core-project/2.3-next-20200529.122231-263/myfaces-core-project-2.3-next-20200529.122231-263-site.xml
No mail will be sent out, as 'myfaces-current-master » Apache MyFaces Core 2.3-next - API #481' does not have a result yet. Please make sure you set a proper result in case of pipeline/build scripts.
No mail will be sent out, as 'myfaces-current-master » Apache MyFaces Core 2.3-next - Extensions - Quarkus - Runtime #481' does not have a result yet. Please make sure you set a proper result in case of pipeline/build scripts.
No mail will be sent out, as 'myfaces-current-master » Apache MyFaces Core 2.3-next - Test #481' does not have a result yet. Please make sure you set a proper result in case of pipeline/build scripts.
No mail will be sent out, as 'myfaces-current-master » Apache MyFaces Core 2.3-next - Extensions #481' does not have a result yet. Please make sure you set a proper result in case of pipeline/build scripts.
Sending e-mails to: commits@myfaces.apache.org grantsmith@apache.org
No mail will be sent out, as 'myfaces-current-master » Apache MyFaces Core 2.3-next - Impl #481' does not have a result yet. Please make sure you set a proper result in case of pipeline/build scripts.
No mail will be sent out, as 'myfaces-current-master » Apache MyFaces Core 2.3-next - OSGi Bundle #481' does not have a result yet. Please make sure you set a proper result in case of pipeline/build scripts.
No mail will be sent out, as 'myfaces-current-master » Apache MyFaces Core 2.3-next - Extensions - Quarkus - Deployment #481' does not have a result yet. Please make sure you set a proper result in case of pipeline/build scripts.
No mail will be sent out, as 'myfaces-current-master » Apache MyFaces Core 2.3-next #481' does not have a result yet. Please make sure you set a proper result in case of pipeline/build scripts.
No mail will be sent out, as 'myfaces-current-master » Apache MyFaces Core 2.3-next - Parent #481' does not have a result yet. Please make sure you set a proper result in case of pipeline/build scripts.
channel stopped
Jenkins build is back to normal : myfaces-current-master #482
Posted by Apache Jenkins Server <je...@builds.apache.org>.
See <https://builds.apache.org/job/myfaces-current-master/482/display/redirect?page=changes>