You are viewing a plain text version of this content. The canonical link for it is here.
Posted to builds@beam.apache.org by Apache Jenkins Server <je...@builds.apache.org> on 2021/11/08 12:13:01 UTC
Build failed in Jenkins: beam_PreCommit_Java_Cron #4719
See <https://ci-beam.apache.org/job/beam_PreCommit_Java_Cron/4719/display/redirect>
Changes:
------------------------------------------
[...truncated 613.77 KB...]
> Task :sdks:java:io:google-cloud-platform:expansion-service:buildDependents
> Task :sdks:java:io:kinesis:expansion-service:distZip
> Task :sdks:java:io:kinesis:expansion-service:compileTestJava NO-SOURCE
> Task :sdks:java:io:kinesis:expansion-service:testClasses UP-TO-DATE
> Task :sdks:java:io:kinesis:expansion-service:packageTests
> Task :sdks:java:io:kinesis:expansion-service:assemble
> Task :sdks:java:io:kinesis:expansion-service:analyzeClassesDependencies FROM-CACHE
> Task :sdks:java:io:kinesis:expansion-service:analyzeTestClassesDependencies SKIPPED
> Task :sdks:java:io:kinesis:expansion-service:analyzeDependencies UP-TO-DATE
> Task :sdks:java:io:kinesis:expansion-service:checkstyleMain NO-SOURCE
> Task :sdks:java:io:kinesis:expansion-service:checkstyleTest NO-SOURCE
> Task :sdks:java:io:kinesis:expansion-service:javadoc NO-SOURCE
> Task :sdks:java:io:kinesis:expansion-service:spotbugsMain NO-SOURCE
> Task :sdks:java:io:kinesis:expansion-service:spotbugsTest SKIPPED
> Task :sdks:java:io:kinesis:expansion-service:test NO-SOURCE
> Task :sdks:java:io:kinesis:expansion-service:check UP-TO-DATE
> Task :sdks:java:io:snowflake:expansion-service:distZip
> Task :sdks:java:io:snowflake:expansion-service:compileTestJava NO-SOURCE
> Task :sdks:java:io:snowflake:expansion-service:testClasses UP-TO-DATE
> Task :sdks:java:io:snowflake:expansion-service:packageTests
> Task :sdks:java:io:snowflake:expansion-service:assemble
> Task :sdks:java:io:snowflake:expansion-service:analyzeClassesDependencies FROM-CACHE
> Task :sdks:java:io:snowflake:expansion-service:analyzeTestClassesDependencies SKIPPED
> Task :sdks:java:io:snowflake:expansion-service:analyzeDependencies UP-TO-DATE
> Task :sdks:java:io:snowflake:expansion-service:checkstyleMain NO-SOURCE
> Task :sdks:java:io:snowflake:expansion-service:checkstyleTest NO-SOURCE
> Task :sdks:java:io:snowflake:expansion-service:javadoc NO-SOURCE
> Task :sdks:java:io:snowflake:expansion-service:spotbugsMain NO-SOURCE
> Task :sdks:java:io:snowflake:expansion-service:spotbugsTest SKIPPED
> Task :sdks:java:io:snowflake:expansion-service:test NO-SOURCE
> Task :sdks:java:io:snowflake:expansion-service:check UP-TO-DATE
> Task :sdks:java:io:kinesis:expansion-service:shadowJar FROM-CACHE
> Task :sdks:java:io:kinesis:expansion-service:build
> Task :sdks:java:io:kinesis:expansion-service:buildDependents
> Task :sdks:java:container:pullLicenses
done.
DEPRECATION: Python 3.5 reached the end of its life on September 13th, 2020. Please upgrade your Python as Python 3.5 is no longer maintained. pip 21.0 will drop support for Python 3.5 in January 2021. pip 21.0 will remove support for this functionality.
> Task :runners:flink:1.12:job-server:distZip
> Task :runners:flink:1.11:job-server:distZip
> Task :sdks:java:io:snowflake:expansion-service:shadowJar FROM-CACHE
> Task :sdks:java:io:snowflake:expansion-service:build
> Task :sdks:java:io:snowflake:expansion-service:buildDependents
> Task :sdks:java:io:snowflake:buildDependents
> Task :sdks:java:container:pullLicenses
Collecting beautifulsoup4<5.0,>=4.9.0
Using cached beautifulsoup4-4.10.0-py3-none-any.whl (97 kB)
Collecting future<1.0.0,>=0.16.0
Using cached future-0.18.2-py3-none-any.whl
Collecting pyyaml<6.0.0,>=3.12
Using cached PyYAML-5.3.1-cp35-cp35m-linux_x86_64.whl
Collecting tenacity<6.0,>=5.0.2
Using cached tenacity-5.1.5-py2.py3-none-any.whl (34 kB)
Collecting soupsieve>1.2
Using cached soupsieve-2.1-py3-none-any.whl (32 kB)
Collecting six>=1.9.0
Using cached six-1.16.0-py2.py3-none-any.whl (11 kB)
Installing collected packages: soupsieve, six, tenacity, pyyaml, future, beautifulsoup4
> Task :runners:flink:1.13:job-server:distZip
> Task :runners:flink:1.11:job-server:assemble
> Task :runners:flink:1.11:job-server:analyzeTestClassesDependencies SKIPPED
> Task :runners:flink:1.11:job-server:analyzeDependencies UP-TO-DATE
> Task :runners:flink:1.11:job-server:test NO-SOURCE
> Task :runners:flink:1.11:job-server:check UP-TO-DATE
> Task :runners:flink:1.12:job-server:assemble
> Task :runners:flink:1.12:job-server:analyzeTestClassesDependencies SKIPPED
> Task :runners:flink:1.12:job-server:analyzeDependencies UP-TO-DATE
> Task :runners:flink:1.12:job-server:test NO-SOURCE
> Task :runners:flink:1.12:job-server:check UP-TO-DATE
> Task :runners:flink:1.13:job-server:assemble
> Task :runners:flink:1.13:job-server:analyzeTestClassesDependencies SKIPPED
> Task :runners:flink:1.13:job-server:analyzeDependencies UP-TO-DATE
> Task :runners:flink:1.13:job-server:test NO-SOURCE
> Task :runners:flink:1.13:job-server:check UP-TO-DATE
> Task :runners:samza:job-server:distZip
> Task :runners:samza:job-server:compileTestJava NO-SOURCE
> Task :runners:samza:job-server:testClasses UP-TO-DATE
> Task :runners:samza:job-server:packageTests
> Task :runners:samza:job-server:assemble
> Task :runners:samza:job-server:analyzeClassesDependencies FROM-CACHE
> Task :runners:samza:job-server:analyzeTestClassesDependencies SKIPPED
> Task :runners:samza:job-server:analyzeDependencies UP-TO-DATE
> Task :runners:samza:job-server:checkstyleMain NO-SOURCE
> Task :runners:samza:job-server:checkstyleTest NO-SOURCE
> Task :runners:samza:job-server:javadoc NO-SOURCE
> Task :runners:samza:job-server:spotbugsMain NO-SOURCE
> Task :runners:samza:job-server:spotbugsTest SKIPPED
> Task :runners:samza:job-server:test NO-SOURCE
> Task :runners:samza:job-server:check UP-TO-DATE
> Task :sdks:java:container:pullLicenses
Successfully installed beautifulsoup4-4.10.0 future-0.18.2 pyyaml-5.3.1 six-1.16.0 soupsieve-2.1 tenacity-5.1.5
Executing <https://ci-beam.apache.org/job/beam_PreCommit_Java_Cron/ws/src/sdks/java/container/build/virtualenv/bin/python> <https://ci-beam.apache.org/job/beam_PreCommit_Java_Cron/ws/src/sdks/java/container/license_scripts/pull_licenses_java.py> --license_index=<https://ci-beam.apache.org/job/beam_PreCommit_Java_Cron/ws/src/sdks/java/container/build/reports/dependency-license/index.json> --output_dir=<https://ci-beam.apache.org/job/beam_PreCommit_Java_Cron/ws/src/sdks/java/container/build/target/java_third_party_licenses> --dep_url_yaml=<https://ci-beam.apache.org/job/beam_PreCommit_Java_Cron/ws/src/sdks/java/container/license_scripts/dep_urls_java.yaml>
INFO:root:Pulling license for 209 dependencies using 16 threads.
INFO:root:pull_licenses_java.py succeed. It took 2.015869 seconds with 16 threads.
Copying licenses from <https://ci-beam.apache.org/job/beam_PreCommit_Java_Cron/ws/src/sdks/java/container/build/target/java_third_party_licenses> to <https://ci-beam.apache.org/job/beam_PreCommit_Java_Cron/ws/src/sdks/java/container/build/target/third_party_licenses.>
Finished license_scripts.sh
> Task :sdks:java:container:goBuild
> Task :sdks:java:container:java8:copyJavaThirdPartyLicenses
> Task :runners:flink:1.11:job-server:shadowJar FROM-CACHE
> Task :runners:flink:1.11:job-server:build
> Task :runners:flink:1.11:job-server:buildDependents
> Task :runners:flink:1.11:buildDependents
> Task :runners:samza:job-server:shadowJar FROM-CACHE
> Task :runners:samza:job-server:build
> Task :runners:samza:job-server:buildDependents
> Task :runners:samza:buildDependents
> Task :runners:flink:1.12:job-server:shadowJar FROM-CACHE
> Task :runners:flink:1.12:job-server:build
> Task :runners:flink:1.12:job-server:buildDependents
> Task :runners:flink:1.12:buildDependents
> Task :runners:flink:1.13:job-server:shadowJar FROM-CACHE
> Task :runners:flink:1.13:job-server:build
> Task :runners:flink:1.13:job-server:buildDependents
> Task :sdks:java:extensions:sql:expansion-service:buildDependents
> Task :runners:flink:1.13:buildDependents
> Task :sdks:java:io:amazon-web-services2:buildDependents
> Task :sdks:java:extensions:sql:zetasql:buildDependents
> Task :runners:java-job-service:buildDependents
> Task :sdks:java:extensions:sql:buildDependents
> Task :sdks:java:extensions:join-library:buildDependents
> Task :sdks:java:io:mongodb:buildDependents
> Task :sdks:java:io:thrift:buildDependents
> Task :sdks:java:io:kinesis:buildDependents
> Task :sdks:java:container:java8:copySdkHarnessLauncher
> Task :sdks:java:extensions:sql:jdbc:shadowJarTest
> Task :sdks:java:extensions:sql:jdbc:preCommit
> Task :release:go-licenses:java:dockerRun
+ rm -rf '/output/*'
+ export GO111MODULE=off
+ GO111MODULE=off
+ go get github.com/apache/beam/sdks/java/container
> Task :sdks:java:io:debezium:check
> Task :sdks:java:io:debezium:build
> Task :sdks:java:io:debezium:buildDependents
> Task :runners:google-cloud-dataflow-java:buildDependents
> Task :sdks:java:io:google-cloud-platform:buildDependents
> Task :sdks:java:extensions:arrow:buildDependents
> Task :sdks:java:io:kafka:buildDependents
> Task :sdks:java:extensions:protobuf:buildDependents
> Task :sdks:java:io:synthetic:buildDependents
> Task :sdks:java:testing:test-utils:buildDependents
> Task :sdks:java:expansion-service:buildDependents
> Task :sdks:java:io:common:buildDependents
> Task :runners:direct-java:needsRunnerTests
org.apache.beam.sdk.transforms.ParDoTest$TimerFamilyTests > testTimerFamilyEventTimeBounded STANDARD_OUT
timer Id : timer1
timerMap : org.apache.beam.repackaged.direct_java.runners.core.SimpleDoFnRunner$TimerInternalsTimerMap@7373917
timer Id : timer2
timerMap : org.apache.beam.repackaged.direct_java.runners.core.SimpleDoFnRunner$TimerInternalsTimerMap@479a6bd2
org.apache.beam.sdk.transforms.ParDoTest$TimerFamilyTests > testTimerFamilyEventTimeUnbounded STANDARD_OUT
timer Id : timer1
timerMap : org.apache.beam.repackaged.direct_java.runners.core.SimpleDoFnRunner$TimerInternalsTimerMap@70c4c9da
timer Id : timer2
timerMap : org.apache.beam.repackaged.direct_java.runners.core.SimpleDoFnRunner$TimerInternalsTimerMap@4ed52630
> Task :release:go-licenses:java:dockerRun
+ go-licenses save github.com/apache/beam/sdks/java/container --save_path=/output/licenses
+ go-licenses csv github.com/apache/beam/sdks/java/container
+ tee /output/licenses/list.csv
google.golang.org/grpc,https://github.com/grpc/grpc-go/blob/master/LICENSE,Apache-2.0
github.com/golang/protobuf,https://github.com/golang/protobuf/blob/master/LICENSE,BSD-3-Clause
google.golang.org/genproto/googleapis/rpc/status,https://github.com/googleapis/go-genproto/blob/master/LICENSE,Apache-2.0
golang.org/x/text,https://go.googlesource.com/text/+/refs/heads/master/LICENSE,BSD-3-Clause
github.com/apache/beam/sdks/go/pkg/beam,https://github.com/apache/beam/blob/master/sdks/go/README.md,Apache-2.0
golang.org/x/net,https://go.googlesource.com/net/+/refs/heads/master/LICENSE,BSD-3-Clause
google.golang.org/protobuf,https://go.googlesource.com/protobuf/+/refs/heads/master/LICENSE,BSD-3-Clause
golang.org/x/sys,https://go.googlesource.com/sys/+/refs/heads/master/LICENSE,BSD-3-Clause
github.com/apache/beam/sdks/java/container,https://github.com/apache/beam/blob/master/LICENSE,Apache-2.0
+ chmod -R a+w /output/licenses
> Task :release:go-licenses:java:createLicenses
> Task :sdks:java:container:java8:copyGolangLicenses
> Task :sdks:java:container:java8:dockerPrepare
> Task :runners:direct-java:needsRunnerTests
org.apache.beam.sdk.transforms.ParDoLifecycleTest > testTeardownCalledAfterExceptionInFinishBundleStateful FAILED
java.lang.AssertionError at ParDoLifecycleTest.java:300
org.apache.beam.sdk.transforms.ParDoTest$LifecycleTests > testWindowingInStartAndFinishBundle STANDARD_OUT
Process: elem:1
Finish: 3
> Task :sdks:java:container:java8:docker
> Task :runners:direct-java:needsRunnerTests
909 tests completed, 1 failed, 6 skipped
> Task :runners:direct-java:needsRunnerTests FAILED
> Task :runners:direct-java:jar
> Task :runners:direct-java:packageTests
> Task :runners:direct-java:assemble
> Task :runners:direct-java:analyzeClassesDependencies FROM-CACHE
> Task :runners:direct-java:analyzeTestClassesDependencies SKIPPED
> Task :runners:direct-java:analyzeDependencies UP-TO-DATE
> Task :runners:direct-java:checkstyleMain FROM-CACHE
> Task :runners:direct-java:checkstyleTest FROM-CACHE
> Task :runners:direct-java:javadoc FROM-CACHE
> Task :sdks:java:javadoc:allJavadoc UP-TO-DATE
> Task :runners:direct-java:spotbugsMain FROM-CACHE
> Task :runners:direct-java:spotbugsTest SKIPPED
> Task :runners:direct-java:test FROM-CACHE
> Task :runners:direct-java:validateShadedJarDoesntLeakNonProjectClasses
> Task :runners:direct-java:check
> Task :runners:direct-java:build
> Task :runners:direct-java:buildDependents
> Task :runners:java-fn-execution:buildDependents
> Task :sdks:java:harness:buildDependents
> Task :runners:local-java:buildDependents
> Task :sdks:java:extensions:google-cloud-platform-core:buildDependents
> Task :runners:core-java:buildDependents
> Task :runners:core-construction-java:buildDependents
> Task :sdks:java:fn-execution:buildDependents
> Task :sdks:java:core:buildDependents
FAILURE: Build failed with an exception.
* What went wrong:
Execution failed for task ':runners:direct-java:needsRunnerTests'.
> There were failing tests. See the report at: file://<https://ci-beam.apache.org/job/beam_PreCommit_Java_Cron/ws/src/runners/direct-java/build/reports/tests/needsRunnerTests/index.html>
* Try:
Run with --stacktrace option to get the stack trace. Run with --info or --debug option to get more log output. Run with --scan to get full insights.
* Get more help at https://help.gradle.org
Deprecated Gradle features were used in this build, making it incompatible with Gradle 7.0.
Use '--warning-mode all' to show the individual deprecation warnings.
See https://docs.gradle.org/6.9.1/userguide/command_line_interface.html#sec:command_line_warnings
BUILD FAILED in 10m 35s
1141 actionable tasks: 418 executed, 721 from cache, 2 up-to-date
Publishing build scan...
https://gradle.com/s/ixyhdyei5mm2a
Build step 'Invoke Gradle script' changed build result to FAILURE
Build step 'Invoke Gradle script' marked build as failure
---------------------------------------------------------------------
To unsubscribe, e-mail: builds-unsubscribe@beam.apache.org
For additional commands, e-mail: builds-help@beam.apache.org
Jenkins build is back to normal : beam_PreCommit_Java_Cron #4721
Posted by Apache Jenkins Server <je...@builds.apache.org>.
See <https://ci-beam.apache.org/job/beam_PreCommit_Java_Cron/4721/display/redirect?page=changes>
---------------------------------------------------------------------
To unsubscribe, e-mail: builds-unsubscribe@beam.apache.org
For additional commands, e-mail: builds-help@beam.apache.org
Build failed in Jenkins: beam_PreCommit_Java_Cron #4720
Posted by Apache Jenkins Server <je...@builds.apache.org>.
See <https://ci-beam.apache.org/job/beam_PreCommit_Java_Cron/4720/display/redirect?page=changes>
Changes:
[25622840+adude3141] [BEAM-13157] add regression test for hadoop configuration on
------------------------------------------
[...truncated 705.42 KB...]
^
symbol: class ProcessElement
location: class ConvertCoGbkResult
> Task :sdks:java:harness:test
> Task :sdks:java:io:hadoop-common:javadoc
> Task :sdks:java:io:elasticsearch:javadoc
> Task :sdks:java:core:javadoc
<https://ci-beam.apache.org/job/beam_PreCommit_Java_Cron/ws/src/sdks/java/core/src/main/java/org/apache/beam/sdk/transforms/CombineFns.java>:123: warning - Tag @link: can't find with(SimpleFunction, CombineFn, TupleTag) in org.apache.beam.sdk.transforms.CombineFns.ComposeCombineFnBuilder
<https://ci-beam.apache.org/job/beam_PreCommit_Java_Cron/ws/src/sdks/java/core/src/main/java/org/apache/beam/sdk/transforms/CombineFns.java>:149: warning - Tag @link: can't find with(SimpleFunction, CombineFnWithContext, TupleTag) in org.apache.beam.sdk.transforms.CombineFns.ComposeCombineFnBuilder
> Task :sdks:java:io:hadoop-common:spotbugsMain
> Task :sdks:java:io:elasticsearch:spotbugsTest SKIPPED
> Task :sdks:java:io:elasticsearch:test NO-SOURCE
> Task :sdks:java:io:hadoop-common:spotbugsTest SKIPPED
> Task :sdks:java:extensions:protobuf:test
> Task :sdks:java:extensions:protobuf:check
> Task :sdks:java:extensions:protobuf:build
> Task :sdks:java:core:javadoc
<https://ci-beam.apache.org/job/beam_PreCommit_Java_Cron/ws/src/sdks/java/core/src/main/java/org/apache/beam/sdk/io/AvroIO.java>:334: warning - Tag @link: can't find continuously(Duration, TerminationCondition) in org.apache.beam.sdk.io.FileIO.Match
<https://ci-beam.apache.org/job/beam_PreCommit_Java_Cron/ws/src/sdks/java/core/src/main/java/org/apache/beam/sdk/io/AvroIO.java>:1034: warning - Tag @link: can't find watchForNewFiles in org.apache.beam.sdk.io.Read
<https://ci-beam.apache.org/job/beam_PreCommit_Java_Cron/ws/src/sdks/java/core/src/main/java/org/apache/beam/sdk/io/AvroIO.java>:1029: warning - Tag @link: can't find withEmptyMatchTreatment in org.apache.beam.sdk.io.Read
<https://ci-beam.apache.org/job/beam_PreCommit_Java_Cron/ws/src/sdks/java/core/src/main/java/org/apache/beam/sdk/io/AvroIO.java>:1046: warning - Tag @link: can't find withHintMatchesManyFiles() in org.apache.beam.sdk.io.Read
<https://ci-beam.apache.org/job/beam_PreCommit_Java_Cron/ws/src/sdks/java/core/src/main/java/org/apache/beam/sdk/io/AvroIO.java>:1240: warning - Tag @link: can't find watchForNewFiles in org.apache.beam.sdk.io.Read
<https://ci-beam.apache.org/job/beam_PreCommit_Java_Cron/ws/src/sdks/java/core/src/main/java/org/apache/beam/sdk/io/AvroIO.java>:1235: warning - Tag @link: can't find withEmptyMatchTreatment in org.apache.beam.sdk.io.Read
<https://ci-beam.apache.org/job/beam_PreCommit_Java_Cron/ws/src/sdks/java/core/src/main/java/org/apache/beam/sdk/io/AvroIO.java>:903: warning - Tag @link: can't find watchForNewFiles in org.apache.beam.sdk.io.Read
<https://ci-beam.apache.org/job/beam_PreCommit_Java_Cron/ws/src/sdks/java/core/src/main/java/org/apache/beam/sdk/io/AvroIO.java>:898: warning - Tag @link: can't find withEmptyMatchTreatment in org.apache.beam.sdk.io.Read
<https://ci-beam.apache.org/job/beam_PreCommit_Java_Cron/ws/src/sdks/java/core/src/main/java/org/apache/beam/sdk/io/AvroIO.java>:1400: warning - Tag @link: can't find to(FilenamePolicy) in org.apache.beam.sdk.io.AvroIO.TypedWrite
<https://ci-beam.apache.org/job/beam_PreCommit_Java_Cron/ws/src/sdks/java/core/src/main/java/org/apache/beam/sdk/io/AvroIO.java>:1400: warning - Tag @link: can't find to(FilenamePolicy) in org.apache.beam.sdk.io.AvroIO.TypedWrite
<https://ci-beam.apache.org/job/beam_PreCommit_Java_Cron/ws/src/sdks/java/core/src/main/java/org/apache/beam/sdk/io/AvroIO.java>:1377: warning - Tag @link: can't find to(FilenamePolicy) in org.apache.beam.sdk.io.AvroIO.TypedWrite
<https://ci-beam.apache.org/job/beam_PreCommit_Java_Cron/ws/src/sdks/java/core/src/main/java/org/apache/beam/sdk/io/AvroIO.java>:1708: warning - Tag @link: can't find to(FilenamePolicy) in org.apache.beam.sdk.io.AvroIO.TypedWrite
<https://ci-beam.apache.org/job/beam_PreCommit_Java_Cron/ws/src/sdks/java/core/src/main/java/org/apache/beam/sdk/io/DynamicFileDestinations.java>:136: warning - Tag @link: can't find constant(FilenamePolicy, SerializableFunction) in org.apache.beam.sdk.io.DynamicFileDestinations
<https://ci-beam.apache.org/job/beam_PreCommit_Java_Cron/ws/src/sdks/java/core/src/main/java/org/apache/beam/sdk/io/FileBasedSource.java>:207: warning - Tag @link: can't find FileBasedSource(Metadata, long, long, long) in org.apache.beam.sdk.io.FileBasedSource
<https://ci-beam.apache.org/job/beam_PreCommit_Java_Cron/ws/src/sdks/java/core/src/main/java/org/apache/beam/sdk/io/FileIO.java>:314: warning - Tag @link: can't find withNaming(Write.FileNaming) in org.apache.beam.sdk.io.FileIO.Write
<https://ci-beam.apache.org/job/beam_PreCommit_Java_Cron/ws/src/sdks/java/core/src/main/java/org/apache/beam/sdk/io/FileIO.java>:314: warning - Tag @link: can't find via(Contextful, Sink) in org.apache.beam.sdk.io.FileIO.Write
<https://ci-beam.apache.org/job/beam_PreCommit_Java_Cron/ws/src/sdks/java/core/src/main/java/org/apache/beam/sdk/io/FileIO.java>:334: warning - Tag @link: can't find continuously(Duration,
TerminationCondition) in org.apache.beam.sdk.io.FileIO.MatchAll
> Task :sdks:java:container:java8:copyDockerfileDependencies
> Task :release:go-licenses:java:createLicenses
> Task :sdks:java:container:java8:copyGolangLicenses
> Task :sdks:java:io:elasticsearch:spotbugsMain
> Task :sdks:java:io:elasticsearch:check
> Task :sdks:java:io:elasticsearch:build
> Task :sdks:java:extensions:sql:hcatalog:compileJava
> Task :sdks:java:extensions:sql:hcatalog:classes
> Task :sdks:java:core:javadoc
<https://ci-beam.apache.org/job/beam_PreCommit_Java_Cron/ws/src/sdks/java/core/src/main/java/org/apache/beam/sdk/io/TextIO.java>:185: warning - Tag @link: can't find continuously(Duration, TerminationCondition) in org.apache.beam.sdk.io.FileIO.Match
<https://ci-beam.apache.org/job/beam_PreCommit_Java_Cron/ws/src/sdks/java/core/src/main/java/org/apache/beam/sdk/io/TextIO.java>:185: warning - Tag @link: can't find to(FilenamePolicy) in org.apache.beam.sdk.io.TextIO.Write
<https://ci-beam.apache.org/job/beam_PreCommit_Java_Cron/ws/src/sdks/java/core/src/main/java/org/apache/beam/sdk/io/TextIO.java>:185: warning - Tag @link: can't find to(DynamicDestinations) in org.apache.beam.sdk.io.TextIO.Write
<https://ci-beam.apache.org/job/beam_PreCommit_Java_Cron/ws/src/sdks/java/core/src/main/java/org/apache/beam/sdk/io/TextIO.java>:260: warning - Tag @link: can't find to(DynamicDestinations) in org.apache.beam.sdk.io.TextIO.Write
<https://ci-beam.apache.org/job/beam_PreCommit_Java_Cron/ws/src/sdks/java/core/src/main/java/org/apache/beam/sdk/io/TextIO.java>:499: warning - Tag @link: can't find watchForNewFiles(Duration, TerminationCondition) in org.apache.beam.sdk.io.Read
<https://ci-beam.apache.org/job/beam_PreCommit_Java_Cron/ws/src/sdks/java/core/src/main/java/org/apache/beam/sdk/io/TextIO.java>:494: warning - Tag @link: can't find withEmptyMatchTreatment in org.apache.beam.sdk.io.Read
<https://ci-beam.apache.org/job/beam_PreCommit_Java_Cron/ws/src/sdks/java/core/src/main/java/org/apache/beam/sdk/io/TextIO.java>:560: warning - Tag @link: can't find withDelimiter in org.apache.beam.sdk.io.Read
<https://ci-beam.apache.org/job/beam_PreCommit_Java_Cron/ws/src/sdks/java/core/src/main/java/org/apache/beam/sdk/io/TextIO.java>:721: warning - Tag @link: can't find to(FilenamePolicy) in org.apache.beam.sdk.io.TextIO.TypedWrite
<https://ci-beam.apache.org/job/beam_PreCommit_Java_Cron/ws/src/sdks/java/core/src/main/java/org/apache/beam/sdk/io/TextIO.java>:795: warning - Tag @link: can't find to(DynamicDestinations) in org.apache.beam.sdk.io.TextIO.TypedWrite
<https://ci-beam.apache.org/job/beam_PreCommit_Java_Cron/ws/src/sdks/java/core/src/main/java/org/apache/beam/sdk/io/TextIO.java>:821: warning - Tag @link: can't find to(FilenamePolicy) in org.apache.beam.sdk.io.TextIO.TypedWrite
<https://ci-beam.apache.org/job/beam_PreCommit_Java_Cron/ws/src/sdks/java/core/src/main/java/org/apache/beam/sdk/io/TextIO.java>:821: warning - Tag @link: can't find to(DynamicDestinations) in org.apache.beam.sdk.io.TextIO.TypedWrite
<https://ci-beam.apache.org/job/beam_PreCommit_Java_Cron/ws/src/sdks/java/core/src/main/java/org/apache/beam/sdk/io/TextIO.java>:833: warning - Tag @link: can't find to(FilenamePolicy) in org.apache.beam.sdk.io.TextIO.TypedWrite
<https://ci-beam.apache.org/job/beam_PreCommit_Java_Cron/ws/src/sdks/java/core/src/main/java/org/apache/beam/sdk/io/TextIO.java>:833: warning - Tag @link: can't find to(DynamicDestinations) in org.apache.beam.sdk.io.TextIO.TypedWrite
<https://ci-beam.apache.org/job/beam_PreCommit_Java_Cron/ws/src/sdks/java/core/src/main/java/org/apache/beam/sdk/io/TextIO.java>:1109: warning - Tag @link: can't find to(DynamicDestinations) in org.apache.beam.sdk.io.TextIO.TypedWrite
<https://ci-beam.apache.org/job/beam_PreCommit_Java_Cron/ws/src/sdks/java/core/src/main/java/org/apache/beam/sdk/io/TextIO.java>:1096: warning - Tag @link: can't find to(FilenamePolicy) in org.apache.beam.sdk.io.TextIO.TypedWrite
<https://ci-beam.apache.org/job/beam_PreCommit_Java_Cron/ws/src/sdks/java/core/src/main/java/org/apache/beam/sdk/io/TextIO.java>:1122: warning - Tag @link: can't find to(SerializableFunction, Params) in org.apache.beam.sdk.io.TextIO.TypedWrite
<https://ci-beam.apache.org/job/beam_PreCommit_Java_Cron/ws/src/sdks/java/core/src/main/java/org/apache/beam/sdk/io/TextIO.java>:1215: warning - Tag @link: can't find to(DynamicDestinations) in org.apache.beam.sdk.io.TextIO.Write
<https://ci-beam.apache.org/job/beam_PreCommit_Java_Cron/ws/src/sdks/java/core/src/main/java/org/apache/beam/sdk/io/TextIO.java>:1215: warning - Tag @link: can't find to(SerializableFunction, Params) in org.apache.beam.sdk.io.TextIO.Write
<https://ci-beam.apache.org/job/beam_PreCommit_Java_Cron/ws/src/sdks/java/core/src/main/java/org/apache/beam/sdk/io/TextIO.java>:1183: warning - Tag @link: can't find withWritableByteChannelFactory(WritableByteChannelFactory) in org.apache.beam.sdk.io.TextIO.TypedWrite
> Task :sdks:java:io:common:test
> Task :sdks:java:io:common:check
> Task :sdks:java:io:common:build
> Task :sdks:java:container:pullLicenses
Copying already-fetched licenses from <https://ci-beam.apache.org/job/beam_PreCommit_Java_Cron/ws/src/sdks/java/container/build/reports/dependency-license> to <https://ci-beam.apache.org/job/beam_PreCommit_Java_Cron/ws/src/sdks/java/container/build/target/java_third_party_licenses>
> Task :sdks:java:extensions:sql:hcatalog:javadoc
> Task :sdks:java:core:javadoc
<https://ci-beam.apache.org/job/beam_PreCommit_Java_Cron/ws/src/sdks/java/core/src/main/java/org/apache/beam/sdk/values/PCollection.java>:310: warning - Tag @link:illegal character: "60" in "PCollection<Row>"
<https://ci-beam.apache.org/job/beam_PreCommit_Java_Cron/ws/src/sdks/java/core/src/main/java/org/apache/beam/sdk/values/PCollection.java>:310: warning - Tag @link:illegal character: "62" in "PCollection<Row>"
> Task :sdks:java:io:hadoop-common:test
> Task :sdks:java:io:hadoop-common:check
> Task :sdks:java:io:hadoop-common:build
> Task :sdks:java:io:hadoop-common:buildDependents
> Task :sdks:java:container:pullLicenses
Already using interpreter /usr/bin/python3
Using base prefix '/usr'
New python executable in <https://ci-beam.apache.org/job/beam_PreCommit_Java_Cron/ws/src/sdks/java/container/build/virtualenv/bin/python3>
Also creating executable in <https://ci-beam.apache.org/job/beam_PreCommit_Java_Cron/ws/src/sdks/java/container/build/virtualenv/bin/python>
Installing setuptools, pip, wheel...
> Task :sdks:java:io:azure:test
> Task :sdks:java:io:azure:check
> Task :sdks:java:io:azure:build
> Task :sdks:java:io:azure:buildDependents
> Task :sdks:java:core:javadoc
<https://ci-beam.apache.org/job/beam_PreCommit_Java_Cron/ws/src/sdks/java/core/src/main/java/org/apache/beam/sdk/schemas/SchemaRegistry.java>:291: warning - Tag @link:illegal character: "42" in "* NoSuchSchemaException"
<https://ci-beam.apache.org/job/beam_PreCommit_Java_Cron/ws/src/sdks/java/core/src/main/java/org/apache/beam/sdk/schemas/SchemaRegistry.java>:299: warning - Tag @link:illegal character: "42" in "* NoSuchSchemaException"
<https://ci-beam.apache.org/job/beam_PreCommit_Java_Cron/ws/src/sdks/java/core/src/main/java/org/apache/beam/sdk/options/SdkHarnessOptions.java>:127: warning - Tag @link: can't find addOverrideForName(String, LogLevel) in org.apache.beam.sdk.options.SdkHarnessOptions.SdkHarnessLogLevelOverrides
<https://ci-beam.apache.org/job/beam_PreCommit_Java_Cron/ws/src/sdks/java/core/src/main/java/org/apache/beam/sdk/options/SdkHarnessOptions.java>:139: warning - Tag @link: can't find addOverrideForName(String, LogLevel) in org.apache.beam.sdk.options.SdkHarnessOptions.SdkHarnessLogLevelOverrides
<https://ci-beam.apache.org/job/beam_PreCommit_Java_Cron/ws/src/sdks/java/core/src/main/java/org/apache/beam/sdk/state/StateSpecs.java>:89: warning - Tag @see: can't find combining(Coder, CombineFn) in org.apache.beam.sdk.state.StateSpecs
<https://ci-beam.apache.org/job/beam_PreCommit_Java_Cron/ws/src/sdks/java/core/src/main/java/org/apache/beam/sdk/state/StateSpecs.java>:107: warning - Tag @see: can't find combining(Coder, CombineFnWithContext) in org.apache.beam.sdk.state.StateSpecs
<https://ci-beam.apache.org/job/beam_PreCommit_Java_Cron/ws/src/sdks/java/core/src/main/java/org/apache/beam/sdk/state/StateSpecs.java>:118: warning - Tag @link: can't find combining(CombineFn) in org.apache.beam.sdk.state.StateSpecs
<https://ci-beam.apache.org/job/beam_PreCommit_Java_Cron/ws/src/sdks/java/core/src/main/java/org/apache/beam/sdk/state/StateSpecs.java>:137: warning - Tag @link: can't find combining(CombineFnWithContext) in org.apache.beam.sdk.state.StateSpecs
59 warnings
> Task :sdks:java:javadoc:allJavadoc
> Task :sdks:java:core:spotbugsTest SKIPPED
> Task :sdks:java:io:elasticsearch-tests:elasticsearch-tests-5:test
org.apache.beam.sdk.io.elasticsearch.ElasticsearchIOTest > testSplit FAILED
java.lang.AssertionError at ElasticsearchIOTest.java:162
> Task :sdks:java:harness:check
> Task :sdks:java:harness:build
> Task :sdks:java:container:pullLicenses
done.
DEPRECATION: Python 3.5 reached the end of its life on September 13th, 2020. Please upgrade your Python as Python 3.5 is no longer maintained. pip 21.0 will drop support for Python 3.5 in January 2021. pip 21.0 will remove support for this functionality.
Collecting beautifulsoup4<5.0,>=4.9.0
Using cached beautifulsoup4-4.10.0-py3-none-any.whl (97 kB)
Collecting future<1.0.0,>=0.16.0
Using cached future-0.18.2-py3-none-any.whl
Collecting pyyaml<6.0.0,>=3.12
Using cached PyYAML-5.3.1-cp35-cp35m-linux_x86_64.whl
Collecting tenacity<6.0,>=5.0.2
Using cached tenacity-5.1.5-py2.py3-none-any.whl (34 kB)
Collecting soupsieve>1.2
Using cached soupsieve-2.1-py3-none-any.whl (32 kB)
Collecting six>=1.9.0
Using cached six-1.16.0-py2.py3-none-any.whl (11 kB)
Installing collected packages: soupsieve, six, tenacity, pyyaml, future, beautifulsoup4
Successfully installed beautifulsoup4-4.10.0 future-0.18.2 pyyaml-5.3.1 six-1.16.0 soupsieve-2.1 tenacity-5.1.5
Executing <https://ci-beam.apache.org/job/beam_PreCommit_Java_Cron/ws/src/sdks/java/container/build/virtualenv/bin/python> <https://ci-beam.apache.org/job/beam_PreCommit_Java_Cron/ws/src/sdks/java/container/license_scripts/pull_licenses_java.py> --license_index=<https://ci-beam.apache.org/job/beam_PreCommit_Java_Cron/ws/src/sdks/java/container/build/reports/dependency-license/index.json> --output_dir=<https://ci-beam.apache.org/job/beam_PreCommit_Java_Cron/ws/src/sdks/java/container/build/target/java_third_party_licenses> --dep_url_yaml=<https://ci-beam.apache.org/job/beam_PreCommit_Java_Cron/ws/src/sdks/java/container/license_scripts/dep_urls_java.yaml>
INFO:root:Pulling license for 209 dependencies using 16 threads.
INFO:root:pull_licenses_java.py succeed. It took 2.197662 seconds with 16 threads.
Copying licenses from <https://ci-beam.apache.org/job/beam_PreCommit_Java_Cron/ws/src/sdks/java/container/build/target/java_third_party_licenses> to <https://ci-beam.apache.org/job/beam_PreCommit_Java_Cron/ws/src/sdks/java/container/build/target/third_party_licenses.>
Finished license_scripts.sh
> Task :sdks:java:container:goBuild
> Task :sdks:java:container:java8:copyJavaThirdPartyLicenses
> Task :sdks:java:container:java8:copySdkHarnessLauncher
> Task :sdks:java:container:java8:dockerPrepare
> Task :sdks:java:extensions:sql:jdbc:shadowJarTest
> Task :sdks:java:extensions:sql:jdbc:preCommit
> Task :sdks:java:container:java8:docker
---> fba919889f78
Step 6/18 : ADD target/slf4j-jdk14.jar /opt/apache/beam/jars/
---> 94427f9fb877
Step 7/18 : ADD target/beam-sdks-java-harness.jar /opt/apache/beam/jars/
---> a7b7f97aa6bc
Step 8/18 : ADD target/beam-sdks-java-io-kafka.jar /opt/apache/beam/jars/
> Task :sdks:java:core:spotbugsMain
> Task :sdks:java:core:test
> Task :sdks:java:container:java8:docker
---> ba33971a406c
Step 9/18 : ADD target/kafka-clients.jar /opt/apache/beam/jars/
---> 75cd7d168f00
Step 10/18 : ADD target/linux_amd64/boot /opt/apache/beam/
---> da15cc807ccb
Step 11/18 : COPY target/LICENSE /opt/apache/beam/
---> 78671df2fe5b
Step 12/18 : COPY target/NOTICE /opt/apache/beam/
---> 83b0b1d65291
Step 13/18 : ADD target/third_party_licenses /opt/apache/beam/third_party_licenses/
---> b2923e810f8b
Step 14/18 : COPY target/LICENSE target/go-licenses/* /opt/apache/beam/third_party_licenses/golang/
---> 7ab815d02aa6
Step 15/18 : RUN rm /opt/apache/beam/third_party_licenses/golang/LICENSE
---> Running in 7a4c1278f570
Removing intermediate container 7a4c1278f570
---> 5075e89bf62c
Step 16/18 : RUN if [ "${pull_licenses}" = "false" ] ; then rm -rf /opt/apache/beam/third_party_licenses ; fi
---> Running in 378e7fce3620
Removing intermediate container 378e7fce3620
---> 8f7eadac91f9
Step 17/18 : COPY target/profiler/* /opt/google_cloud_profiler/
---> 53c7b5249aa3
Step 18/18 : ENTRYPOINT ["/opt/apache/beam/boot"]
---> Running in 5538a8a2f230
Removing intermediate container 5538a8a2f230
---> a8f8ee8a4d07
Successfully built a8f8ee8a4d07
Successfully tagged apache/beam_java8_sdk:2.35.0.dev
> Task :sdks:java:io:elasticsearch-tests:elasticsearch-tests-7:check
> Task :sdks:java:io:elasticsearch-tests:elasticsearch-tests-7:build
> Task :sdks:java:io:elasticsearch-tests:elasticsearch-tests-7:buildDependents
> Task :sdks:java:io:elasticsearch-tests:elasticsearch-tests-5:test
30 tests completed, 1 failed
> Task :sdks:java:io:elasticsearch-tests:elasticsearch-tests-5:test FAILED
> Task :sdks:java:io:elasticsearch-tests:elasticsearch-tests-6:check
> Task :sdks:java:io:elasticsearch-tests:elasticsearch-tests-6:build
> Task :sdks:java:io:elasticsearch-tests:elasticsearch-tests-6:buildDependents
> Task :sdks:java:core:validateShadedJarDoesntLeakNonProjectClasses
> Task :sdks:java:core:check
> Task :sdks:java:core:build
> Task :sdks:java:core:buildNeeded
> Task :sdks:java:testing:nexmark:check
> Task :sdks:java:testing:nexmark:build
> Task :sdks:java:testing:nexmark:buildDependents
> Task :sdks:java:extensions:sql:zetasql:buildDependents
> Task :sdks:java:extensions:sql:buildDependents
> Task :sdks:java:io:google-cloud-platform:buildDependents
> Task :sdks:java:io:kafka:buildDependents
> Task :sdks:java:io:synthetic:buildDependents
> Task :sdks:java:expansion-service:buildDependents
> Task :sdks:java:extensions:arrow:buildDependents
> Task :sdks:java:extensions:join-library:buildDependents
> Task :sdks:java:io:mongodb:buildDependents
> Task :sdks:java:io:thrift:buildDependents
> Task :sdks:java:testing:test-utils:buildDependents
> Task :sdks:java:extensions:protobuf:buildDependents
FAILURE: Build failed with an exception.
* What went wrong:
Execution failed for task ':sdks:java:io:elasticsearch-tests:elasticsearch-tests-5:test'.
> There were failing tests. See the report at: file://<https://ci-beam.apache.org/job/beam_PreCommit_Java_Cron/ws/src/sdks/java/io/elasticsearch-tests/elasticsearch-tests-5/build/reports/tests/test/index.html>
* Try:
Run with --stacktrace option to get the stack trace. Run with --info or --debug option to get more log output. Run with --scan to get full insights.
* Get more help at https://help.gradle.org
Deprecated Gradle features were used in this build, making it incompatible with Gradle 7.0.
Use '--warning-mode all' to show the individual deprecation warnings.
See https://docs.gradle.org/6.9.1/userguide/command_line_interface.html#sec:command_line_warnings
BUILD FAILED in 39m 6s
1141 actionable tasks: 947 executed, 192 from cache, 2 up-to-date
Publishing build scan...
https://gradle.com/s/7dc2m2itldjly
Build step 'Invoke Gradle script' changed build result to FAILURE
Build step 'Invoke Gradle script' marked build as failure
---------------------------------------------------------------------
To unsubscribe, e-mail: builds-unsubscribe@beam.apache.org
For additional commands, e-mail: builds-help@beam.apache.org