You are viewing a plain text version of this content. The canonical link for it is here.
Posted to issues@maven.apache.org by "Guillaume Nodet (Jira)" <ji...@apache.org> on 2024/04/26 16:41:00 UTC
[jira] [Created] (MNG-8108) Failure to create the consumer POM
Guillaume Nodet created MNG-8108:
------------------------------------
Summary: Failure to create the consumer POM
Key: MNG-8108
URL: https://issues.apache.org/jira/browse/MNG-8108
Project: Maven
Issue Type: Bug
Reporter: Guillaume Nodet
Assignee: Guillaume Nodet
Fix For: 4.0.0-beta-1
{code}
[INFO] Camel :: Integration Tests ........................................................................... SKIPPED
[INFO] Camel :: Docs ........................................................................................ SKIPPED
[INFO] Camel :: Assembly .................................................................................... SKIPPED
[INFO] --------------------------------------------------------------------------------------------------------------------------
[INFO] BUILD FAILURE
[INFO] --------------------------------------------------------------------------------------------------------------------------
[INFO] Total time: 02:53 min
[INFO] Finished at: 2024-04-26T15:34:00+02:00
[INFO] --------------------------------------------------------------------------------------------------------------------------
[ERROR] Failed to execute goal org.apache.maven.plugins:maven-install-plugin:3.1.1:install (default-install) on project camel-debezium-common-parent: Execution default-install of goal org.apache.maven.plugins:maven-install-plugin:3.1.1:install failed: 2 problems were encountered while building the effective model for /Users/gnodet/work/git/camel/components/camel-debezium/camel-debezium-common/target/camel-debezium-common-parent-4.6.0-SNAPSHOT.pom
[ERROR] - [WARNING] 'parent.relativePath' points at org.apache.camel:camel-debezium-common-parent instead of org.apache.camel:camel-debezium-parent, please verify your project structure @ line 22, column 3
[ERROR] - [FATAL] Non-parseable POM org.apache.camel:camel-debezium-parent:4.6.0-SNAPSHOT: Unable to read model: Is a directory
[ERROR] -> [Help 1]org.apache.maven.lifecycle.LifecycleExecutionException: Failed to execute goal org.apache.maven.plugins:maven-install-plugin:3.1.1:install (default-install) on project camel-debezium-common-parent: Execution default-install of goal org.apache.maven.plugins:maven-install-plugin:3.1.1:install failed: 2 problems were encountered while building the effective model for /Users/gnodet/work/git/camel/components/camel-debezium/camel-debezium-common/target/camel-debezium-common-parent-4.6.0-SNAPSHOT.pom
- [WARNING] 'parent.relativePath' points at org.apache.camel:camel-debezium-common-parent instead of org.apache.camel:camel-debezium-parent, please verify your project structure @ line 22, column 3
- [FATAL] Non-parseable POM org.apache.camel:camel-debezium-parent:4.6.0-SNAPSHOT: Unable to read model: Is a directory
[ERROR]
[ERROR] Re-run Maven using the -X switch to enable full debug logging.
[ERROR]
[ERROR] For more information about the errors and possible solutions, please read the following articles:
[ERROR] [Help 1] http://cwiki.apache.org/confluence/display/MAVEN/PluginExecutionException
[ERROR]
[ERROR] After correcting the problems, you can resume the build with the command
[ERROR] mvn <args> -r
➜ camel git:(code-cleanup)
{code}
--
This message was sent by Atlassian Jira
(v8.20.10#820010)