You are viewing a plain text version of this content. The canonical link for it is here.
Posted to dev@lucene.apache.org by Apache Jenkins Server <je...@builds.apache.org> on 2014/10/05 21:22:37 UTC
[JENKINS] Lucene-Solr-Tests-trunk-Java7 - Build # 4907 - Still
Failing
Build: https://builds.apache.org/job/Lucene-Solr-Tests-trunk-Java7/4907/
3 tests failed.
REGRESSION: org.apache.solr.cloud.ChaosMonkeySafeLeaderTest.testDistribSearch
Error Message:
expected:<0> but was:<1>
Stack Trace:
java.lang.AssertionError: expected:<0> but was:<1>
at __randomizedtesting.SeedInfo.seed([71871D6926824D6E:F061937151DD2D52]:0)
at org.junit.Assert.fail(Assert.java:93)
at org.junit.Assert.failNotEquals(Assert.java:647)
at org.junit.Assert.assertEquals(Assert.java:128)
at org.junit.Assert.assertEquals(Assert.java:472)
at org.junit.Assert.assertEquals(Assert.java:456)
at org.apache.solr.cloud.ChaosMonkeySafeLeaderTest.doTest(ChaosMonkeySafeLeaderTest.java:153)
at org.apache.solr.BaseDistributedSearchTestCase.testDistribSearch(BaseDistributedSearchTestCase.java:869)
at sun.reflect.NativeMethodAccessorImpl.invoke0(Native Method)
at sun.reflect.NativeMethodAccessorImpl.invoke(NativeMethodAccessorImpl.java:57)
at sun.reflect.DelegatingMethodAccessorImpl.invoke(DelegatingMethodAccessorImpl.java:43)
at java.lang.reflect.Method.invoke(Method.java:606)
at com.carrotsearch.randomizedtesting.RandomizedRunner.invoke(RandomizedRunner.java:1618)
at com.carrotsearch.randomizedtesting.RandomizedRunner$6.evaluate(RandomizedRunner.java:827)
at com.carrotsearch.randomizedtesting.RandomizedRunner$7.evaluate(RandomizedRunner.java:863)
at com.carrotsearch.randomizedtesting.RandomizedRunner$8.evaluate(RandomizedRunner.java:877)
at com.carrotsearch.randomizedtesting.rules.SystemPropertiesRestoreRule$1.evaluate(SystemPropertiesRestoreRule.java:53)
at org.apache.lucene.util.TestRuleSetupTeardownChained$1.evaluate(TestRuleSetupTeardownChained.java:50)
at org.apache.lucene.util.AbstractBeforeAfterRule$1.evaluate(AbstractBeforeAfterRule.java:46)
at com.carrotsearch.randomizedtesting.rules.SystemPropertiesInvariantRule$1.evaluate(SystemPropertiesInvariantRule.java:55)
at org.apache.lucene.util.TestRuleThreadAndTestName$1.evaluate(TestRuleThreadAndTestName.java:49)
at org.apache.lucene.util.TestRuleIgnoreAfterMaxFailures$1.evaluate(TestRuleIgnoreAfterMaxFailures.java:65)
at org.apache.lucene.util.TestRuleMarkFailure$1.evaluate(TestRuleMarkFailure.java:48)
at com.carrotsearch.randomizedtesting.rules.StatementAdapter.evaluate(StatementAdapter.java:36)
at com.carrotsearch.randomizedtesting.ThreadLeakControl$StatementRunner.run(ThreadLeakControl.java:365)
at com.carrotsearch.randomizedtesting.ThreadLeakControl.forkTimeoutingTask(ThreadLeakControl.java:798)
at com.carrotsearch.randomizedtesting.ThreadLeakControl$3.evaluate(ThreadLeakControl.java:458)
at com.carrotsearch.randomizedtesting.RandomizedRunner.runSingleTest(RandomizedRunner.java:836)
at com.carrotsearch.randomizedtesting.RandomizedRunner$3.evaluate(RandomizedRunner.java:738)
at com.carrotsearch.randomizedtesting.RandomizedRunner$4.evaluate(RandomizedRunner.java:772)
at com.carrotsearch.randomizedtesting.RandomizedRunner$5.evaluate(RandomizedRunner.java:783)
at com.carrotsearch.randomizedtesting.rules.StatementAdapter.evaluate(StatementAdapter.java:36)
at com.carrotsearch.randomizedtesting.rules.SystemPropertiesRestoreRule$1.evaluate(SystemPropertiesRestoreRule.java:53)
at org.apache.lucene.util.AbstractBeforeAfterRule$1.evaluate(AbstractBeforeAfterRule.java:46)
at org.apache.lucene.util.TestRuleStoreClassName$1.evaluate(TestRuleStoreClassName.java:42)
at com.carrotsearch.randomizedtesting.rules.SystemPropertiesInvariantRule$1.evaluate(SystemPropertiesInvariantRule.java:55)
at com.carrotsearch.randomizedtesting.rules.NoShadowingOrOverridesOnMethodsRule$1.evaluate(NoShadowingOrOverridesOnMethodsRule.java:39)
at com.carrotsearch.randomizedtesting.rules.NoShadowingOrOverridesOnMethodsRule$1.evaluate(NoShadowingOrOverridesOnMethodsRule.java:39)
at com.carrotsearch.randomizedtesting.rules.StatementAdapter.evaluate(StatementAdapter.java:36)
at com.carrotsearch.randomizedtesting.rules.StatementAdapter.evaluate(StatementAdapter.java:36)
at com.carrotsearch.randomizedtesting.rules.StatementAdapter.evaluate(StatementAdapter.java:36)
at org.apache.lucene.util.TestRuleAssertionsRequired$1.evaluate(TestRuleAssertionsRequired.java:43)
at org.apache.lucene.util.TestRuleMarkFailure$1.evaluate(TestRuleMarkFailure.java:48)
at org.apache.lucene.util.TestRuleIgnoreAfterMaxFailures$1.evaluate(TestRuleIgnoreAfterMaxFailures.java:65)
at org.apache.lucene.util.TestRuleIgnoreTestSuites$1.evaluate(TestRuleIgnoreTestSuites.java:55)
at com.carrotsearch.randomizedtesting.rules.StatementAdapter.evaluate(StatementAdapter.java:36)
at com.carrotsearch.randomizedtesting.ThreadLeakControl$StatementRunner.run(ThreadLeakControl.java:365)
at java.lang.Thread.run(Thread.java:745)
FAILED: junit.framework.TestSuite.org.apache.solr.handler.TestReplicationHandlerBackup
Error Message:
1 thread leaked from SUITE scope at org.apache.solr.handler.TestReplicationHandlerBackup: 1) Thread[id=10359, name=Thread-3034, state=RUNNABLE, group=TGRP-TestReplicationHandlerBackup] at java.net.PlainSocketImpl.socketConnect(Native Method) at java.net.AbstractPlainSocketImpl.doConnect(AbstractPlainSocketImpl.java:339) at java.net.AbstractPlainSocketImpl.connectToAddress(AbstractPlainSocketImpl.java:200) at java.net.AbstractPlainSocketImpl.connect(AbstractPlainSocketImpl.java:182) at java.net.SocksSocketImpl.connect(SocksSocketImpl.java:392) at java.net.Socket.connect(Socket.java:579) at java.net.Socket.connect(Socket.java:528) at sun.net.NetworkClient.doConnect(NetworkClient.java:180) at sun.net.www.http.HttpClient.openServer(HttpClient.java:432) at sun.net.www.http.HttpClient.openServer(HttpClient.java:527) at sun.net.www.http.HttpClient.parseHTTP(HttpClient.java:652) at sun.net.www.protocol.http.HttpURLConnection.getInputStream(HttpURLConnection.java:1323) at java.net.URL.openStream(URL.java:1037) at org.apache.solr.handler.TestReplicationHandlerBackup$BackupThread.run(TestReplicationHandlerBackup.java:318)
Stack Trace:
com.carrotsearch.randomizedtesting.ThreadLeakError: 1 thread leaked from SUITE scope at org.apache.solr.handler.TestReplicationHandlerBackup:
1) Thread[id=10359, name=Thread-3034, state=RUNNABLE, group=TGRP-TestReplicationHandlerBackup]
at java.net.PlainSocketImpl.socketConnect(Native Method)
at java.net.AbstractPlainSocketImpl.doConnect(AbstractPlainSocketImpl.java:339)
at java.net.AbstractPlainSocketImpl.connectToAddress(AbstractPlainSocketImpl.java:200)
at java.net.AbstractPlainSocketImpl.connect(AbstractPlainSocketImpl.java:182)
at java.net.SocksSocketImpl.connect(SocksSocketImpl.java:392)
at java.net.Socket.connect(Socket.java:579)
at java.net.Socket.connect(Socket.java:528)
at sun.net.NetworkClient.doConnect(NetworkClient.java:180)
at sun.net.www.http.HttpClient.openServer(HttpClient.java:432)
at sun.net.www.http.HttpClient.openServer(HttpClient.java:527)
at sun.net.www.http.HttpClient.parseHTTP(HttpClient.java:652)
at sun.net.www.protocol.http.HttpURLConnection.getInputStream(HttpURLConnection.java:1323)
at java.net.URL.openStream(URL.java:1037)
at org.apache.solr.handler.TestReplicationHandlerBackup$BackupThread.run(TestReplicationHandlerBackup.java:318)
at __randomizedtesting.SeedInfo.seed([71871D6926824D6E]:0)
FAILED: junit.framework.TestSuite.org.apache.solr.handler.TestReplicationHandlerBackup
Error Message:
There are still zombie threads that couldn't be terminated: 1) Thread[id=10359, name=Thread-3034, state=RUNNABLE, group=TGRP-TestReplicationHandlerBackup] at java.net.PlainSocketImpl.socketConnect(Native Method) at java.net.AbstractPlainSocketImpl.doConnect(AbstractPlainSocketImpl.java:339) at java.net.AbstractPlainSocketImpl.connectToAddress(AbstractPlainSocketImpl.java:200) at java.net.AbstractPlainSocketImpl.connect(AbstractPlainSocketImpl.java:182) at java.net.SocksSocketImpl.connect(SocksSocketImpl.java:392) at java.net.Socket.connect(Socket.java:579) at java.net.Socket.connect(Socket.java:528) at sun.net.NetworkClient.doConnect(NetworkClient.java:180) at sun.net.www.http.HttpClient.openServer(HttpClient.java:432) at sun.net.www.http.HttpClient.openServer(HttpClient.java:527) at sun.net.www.http.HttpClient.parseHTTP(HttpClient.java:652) at sun.net.www.protocol.http.HttpURLConnection.getInputStream(HttpURLConnection.java:1323) at java.net.URL.openStream(URL.java:1037) at org.apache.solr.handler.TestReplicationHandlerBackup$BackupThread.run(TestReplicationHandlerBackup.java:318)
Stack Trace:
com.carrotsearch.randomizedtesting.ThreadLeakError: There are still zombie threads that couldn't be terminated:
1) Thread[id=10359, name=Thread-3034, state=RUNNABLE, group=TGRP-TestReplicationHandlerBackup]
at java.net.PlainSocketImpl.socketConnect(Native Method)
at java.net.AbstractPlainSocketImpl.doConnect(AbstractPlainSocketImpl.java:339)
at java.net.AbstractPlainSocketImpl.connectToAddress(AbstractPlainSocketImpl.java:200)
at java.net.AbstractPlainSocketImpl.connect(AbstractPlainSocketImpl.java:182)
at java.net.SocksSocketImpl.connect(SocksSocketImpl.java:392)
at java.net.Socket.connect(Socket.java:579)
at java.net.Socket.connect(Socket.java:528)
at sun.net.NetworkClient.doConnect(NetworkClient.java:180)
at sun.net.www.http.HttpClient.openServer(HttpClient.java:432)
at sun.net.www.http.HttpClient.openServer(HttpClient.java:527)
at sun.net.www.http.HttpClient.parseHTTP(HttpClient.java:652)
at sun.net.www.protocol.http.HttpURLConnection.getInputStream(HttpURLConnection.java:1323)
at java.net.URL.openStream(URL.java:1037)
at org.apache.solr.handler.TestReplicationHandlerBackup$BackupThread.run(TestReplicationHandlerBackup.java:318)
at __randomizedtesting.SeedInfo.seed([71871D6926824D6E]:0)
Build Log:
[...truncated 11467 lines...]
[junit4] Suite: org.apache.solr.cloud.ChaosMonkeySafeLeaderTest
[junit4] 2> Creating dataDir: /usr/home/jenkins/jenkins-slave/workspace/Lucene-Solr-Tests-trunk-Java7/solr/build/solr-core/test/J1/temp/solr.cloud.ChaosMonkeySafeLeaderTest-71871D6926824D6E-001/init-core-data-001
[junit4] 2> 713878 T2028 oas.SolrTestCaseJ4.buildSSLConfig Randomized ssl (false) and clientAuth (false)
[junit4] 2> 713878 T2028 oas.BaseDistributedSearchTestCase.initHostContext Setting hostContext system property: /
[junit4] 2> 713884 T2028 oas.SolrTestCaseJ4.setUp ###Starting testDistribSearch
[junit4] 2> 713885 T2028 oasc.ZkTestServer.run STARTING ZK TEST SERVER
[junit4] 1> client port:0.0.0.0/0.0.0.0:0
[junit4] 2> 713885 T2029 oasc.ZkTestServer$ZKServerMain.runFromConfig Starting server
[junit4] 2> 713985 T2028 oasc.ZkTestServer.run start zk server on port:20524
[junit4] 2> 713986 T2028 oascc.SolrZkClient.createZkCredentialsToAddAutomatically Using default ZkCredentialsProvider
[junit4] 2> 713987 T2028 oascc.ConnectionManager.waitForConnected Waiting for client to connect to ZooKeeper
[junit4] 2> 713990 T2035 oascc.ConnectionManager.process Watcher org.apache.solr.common.cloud.ConnectionManager@101ffe6d name:ZooKeeperConnection Watcher:127.0.0.1:20524 got event WatchedEvent state:SyncConnected type:None path:null path:null type:None
[junit4] 2> 713990 T2028 oascc.ConnectionManager.waitForConnected Client is connected to ZooKeeper
[junit4] 2> 713991 T2028 oascc.SolrZkClient.createZkACLProvider Using default ZkACLProvider
[junit4] 2> 713991 T2028 oascc.SolrZkClient.makePath makePath: /solr
[junit4] 2> 713993 T2028 oascc.SolrZkClient.createZkCredentialsToAddAutomatically Using default ZkCredentialsProvider
[junit4] 2> 713994 T2028 oascc.ConnectionManager.waitForConnected Waiting for client to connect to ZooKeeper
[junit4] 2> 713995 T2037 oascc.ConnectionManager.process Watcher org.apache.solr.common.cloud.ConnectionManager@255c949c name:ZooKeeperConnection Watcher:127.0.0.1:20524/solr got event WatchedEvent state:SyncConnected type:None path:null path:null type:None
[junit4] 2> 713995 T2028 oascc.ConnectionManager.waitForConnected Client is connected to ZooKeeper
[junit4] 2> 713996 T2028 oascc.SolrZkClient.createZkACLProvider Using default ZkACLProvider
[junit4] 2> 713996 T2028 oascc.SolrZkClient.makePath makePath: /collections/collection1
[junit4] 2> 713998 T2028 oascc.SolrZkClient.makePath makePath: /collections/collection1/shards
[junit4] 2> 713999 T2028 oascc.SolrZkClient.makePath makePath: /collections/control_collection
[junit4] 2> 714001 T2028 oascc.SolrZkClient.makePath makePath: /collections/control_collection/shards
[junit4] 2> 714003 T2028 oasc.AbstractZkTestCase.putConfig put /usr/home/jenkins/jenkins-slave/workspace/Lucene-Solr-Tests-trunk-Java7/solr/core/src/test-files/solr/collection1/conf/solrconfig-tlog.xml to /configs/conf1/solrconfig.xml
[junit4] 2> 714003 T2028 oascc.SolrZkClient.makePath makePath: /configs/conf1/solrconfig.xml
[junit4] 2> 714006 T2028 oasc.AbstractZkTestCase.putConfig put /usr/home/jenkins/jenkins-slave/workspace/Lucene-Solr-Tests-trunk-Java7/solr/core/src/test-files/solr/collection1/conf/schema15.xml to /configs/conf1/schema.xml
[junit4] 2> 714007 T2028 oascc.SolrZkClient.makePath makePath: /configs/conf1/schema.xml
[junit4] 2> 714109 T2028 oasc.AbstractZkTestCase.putConfig put /usr/home/jenkins/jenkins-slave/workspace/Lucene-Solr-Tests-trunk-Java7/solr/core/src/test-files/solr/collection1/conf/solrconfig.snippet.randomindexconfig.xml to /configs/conf1/solrconfig.snippet.randomindexconfig.xml
[junit4] 2> 714110 T2028 oascc.SolrZkClient.makePath makePath: /configs/conf1/solrconfig.snippet.randomindexconfig.xml
[junit4] 2> 714112 T2028 oasc.AbstractZkTestCase.putConfig put /usr/home/jenkins/jenkins-slave/workspace/Lucene-Solr-Tests-trunk-Java7/solr/core/src/test-files/solr/collection1/conf/stopwords.txt to /configs/conf1/stopwords.txt
[junit4] 2> 714112 T2028 oascc.SolrZkClient.makePath makePath: /configs/conf1/stopwords.txt
[junit4] 2> 714114 T2028 oasc.AbstractZkTestCase.putConfig put /usr/home/jenkins/jenkins-slave/workspace/Lucene-Solr-Tests-trunk-Java7/solr/core/src/test-files/solr/collection1/conf/protwords.txt to /configs/conf1/protwords.txt
[junit4] 2> 714115 T2028 oascc.SolrZkClient.makePath makePath: /configs/conf1/protwords.txt
[junit4] 2> 714117 T2028 oasc.AbstractZkTestCase.putConfig put /usr/home/jenkins/jenkins-slave/workspace/Lucene-Solr-Tests-trunk-Java7/solr/core/src/test-files/solr/collection1/conf/currency.xml to /configs/conf1/currency.xml
[junit4] 2> 714117 T2028 oascc.SolrZkClient.makePath makePath: /configs/conf1/currency.xml
[junit4] 2> 714119 T2028 oasc.AbstractZkTestCase.putConfig put /usr/home/jenkins/jenkins-slave/workspace/Lucene-Solr-Tests-trunk-Java7/solr/core/src/test-files/solr/collection1/conf/enumsConfig.xml to /configs/conf1/enumsConfig.xml
[junit4] 2> 714120 T2028 oascc.SolrZkClient.makePath makePath: /configs/conf1/enumsConfig.xml
[junit4] 2> 714122 T2028 oasc.AbstractZkTestCase.putConfig put /usr/home/jenkins/jenkins-slave/workspace/Lucene-Solr-Tests-trunk-Java7/solr/core/src/test-files/solr/collection1/conf/open-exchange-rates.json to /configs/conf1/open-exchange-rates.json
[junit4] 2> 714122 T2028 oascc.SolrZkClient.makePath makePath: /configs/conf1/open-exchange-rates.json
[junit4] 2> 714124 T2028 oasc.AbstractZkTestCase.putConfig put /usr/home/jenkins/jenkins-slave/workspace/Lucene-Solr-Tests-trunk-Java7/solr/core/src/test-files/solr/collection1/conf/mapping-ISOLatin1Accent.txt to /configs/conf1/mapping-ISOLatin1Accent.txt
[junit4] 2> 714125 T2028 oascc.SolrZkClient.makePath makePath: /configs/conf1/mapping-ISOLatin1Accent.txt
[junit4] 2> 714127 T2028 oasc.AbstractZkTestCase.putConfig put /usr/home/jenkins/jenkins-slave/workspace/Lucene-Solr-Tests-trunk-Java7/solr/core/src/test-files/solr/collection1/conf/old_synonyms.txt to /configs/conf1/old_synonyms.txt
[junit4] 2> 714127 T2028 oascc.SolrZkClient.makePath makePath: /configs/conf1/old_synonyms.txt
[junit4] 2> 714129 T2028 oasc.AbstractZkTestCase.putConfig put /usr/home/jenkins/jenkins-slave/workspace/Lucene-Solr-Tests-trunk-Java7/solr/core/src/test-files/solr/collection1/conf/synonyms.txt to /configs/conf1/synonyms.txt
[junit4] 2> 714130 T2028 oascc.SolrZkClient.makePath makePath: /configs/conf1/synonyms.txt
[junit4] 2> 715554 T2028 oejs.Server.doStart jetty-8.1.10.v20130312
[junit4] 2> 715557 T2028 oejs.AbstractConnector.doStart Started SocketConnector@127.0.0.1:20530
[junit4] 2> 715558 T2028 oass.SolrDispatchFilter.init SolrDispatchFilter.init()
[junit4] 2> 715558 T2028 oasc.SolrResourceLoader.locateSolrHome JNDI not configured for solr (NoInitialContextEx)
[junit4] 2> 715558 T2028 oasc.SolrResourceLoader.locateSolrHome using system property solr.solr.home: /usr/home/jenkins/jenkins-slave/workspace/Lucene-Solr-Tests-trunk-Java7/solr/build/solr-core/test/J1/temp/solr.cloud.ChaosMonkeySafeLeaderTest-71871D6926824D6E-001/tempDir-002
[junit4] 2> 715559 T2028 oasc.SolrResourceLoader.<init> new SolrResourceLoader for directory: '/usr/home/jenkins/jenkins-slave/workspace/Lucene-Solr-Tests-trunk-Java7/solr/build/solr-core/test/J1/temp/solr.cloud.ChaosMonkeySafeLeaderTest-71871D6926824D6E-001/tempDir-002/'
[junit4] 2> 715587 T2028 oasc.ConfigSolr.fromFile Loading container configuration from /usr/home/jenkins/jenkins-slave/workspace/Lucene-Solr-Tests-trunk-Java7/solr/build/solr-core/test/J1/temp/solr.cloud.ChaosMonkeySafeLeaderTest-71871D6926824D6E-001/tempDir-002/solr.xml
[junit4] 2> 715641 T2028 oasc.CoreContainer.<init> New CoreContainer 2116592079
[junit4] 2> 715642 T2028 oasc.CoreContainer.load Loading cores into CoreContainer [instanceDir=/usr/home/jenkins/jenkins-slave/workspace/Lucene-Solr-Tests-trunk-Java7/solr/build/solr-core/test/J1/temp/solr.cloud.ChaosMonkeySafeLeaderTest-71871D6926824D6E-001/tempDir-002/]
[junit4] 2> 715643 T2028 oashc.HttpShardHandlerFactory.getParameter Setting socketTimeout to: 90000
[junit4] 2> 715643 T2028 oashc.HttpShardHandlerFactory.getParameter Setting urlScheme to:
[junit4] 2> 715643 T2028 oashc.HttpShardHandlerFactory.getParameter Setting connTimeout to: 15000
[junit4] 2> 715643 T2028 oashc.HttpShardHandlerFactory.getParameter Setting maxConnectionsPerHost to: 20
[junit4] 2> 715643 T2028 oashc.HttpShardHandlerFactory.getParameter Setting corePoolSize to: 0
[junit4] 2> 715644 T2028 oashc.HttpShardHandlerFactory.getParameter Setting maximumPoolSize to: 2147483647
[junit4] 2> 715644 T2028 oashc.HttpShardHandlerFactory.getParameter Setting maxThreadIdleTime to: 5
[junit4] 2> 715644 T2028 oashc.HttpShardHandlerFactory.getParameter Setting sizeOfQueue to: -1
[junit4] 2> 715644 T2028 oashc.HttpShardHandlerFactory.getParameter Setting fairnessPolicy to: false
[junit4] 2> 715645 T2028 oasu.UpdateShardHandler.<init> Creating UpdateShardHandler HTTP client with params: socketTimeout=340000&connTimeout=45000&retry=false
[junit4] 2> 715645 T2028 oasl.LogWatcher.createWatcher SLF4J impl is org.slf4j.impl.Log4jLoggerFactory
[junit4] 2> 715645 T2028 oasl.LogWatcher.newRegisteredLogWatcher Registering Log Listener [Log4j (org.slf4j.impl.Log4jLoggerFactory)]
[junit4] 2> 715646 T2028 oasc.CoreContainer.load Host Name: 127.0.0.1
[junit4] 2> 715646 T2028 oasc.ZkContainer.initZooKeeper Zookeeper client=127.0.0.1:20524/solr
[junit4] 2> 715646 T2028 oasc.ZkController.checkChrootPath zkHost includes chroot
[junit4] 2> 715646 T2028 oascc.SolrZkClient.createZkCredentialsToAddAutomatically Using default ZkCredentialsProvider
[junit4] 2> 715647 T2028 oascc.ConnectionManager.waitForConnected Waiting for client to connect to ZooKeeper
[junit4] 2> 715648 T2048 oascc.ConnectionManager.process Watcher org.apache.solr.common.cloud.ConnectionManager@1d975dbe name:ZooKeeperConnection Watcher:127.0.0.1:20524 got event WatchedEvent state:SyncConnected type:None path:null path:null type:None
[junit4] 2> 715649 T2028 oascc.ConnectionManager.waitForConnected Client is connected to ZooKeeper
[junit4] 2> 715649 T2028 oascc.SolrZkClient.createZkACLProvider Using default ZkACLProvider
[junit4] 2> 715651 T2028 oascc.ConnectionManager.waitForConnected Waiting for client to connect to ZooKeeper
[junit4] 2> 715652 T2050 oascc.ConnectionManager.process Watcher org.apache.solr.common.cloud.ConnectionManager@25fb7dcd name:ZooKeeperConnection Watcher:127.0.0.1:20524/solr got event WatchedEvent state:SyncConnected type:None path:null path:null type:None
[junit4] 2> 715652 T2028 oascc.ConnectionManager.waitForConnected Client is connected to ZooKeeper
[junit4] 2> 715653 T2028 oascc.SolrZkClient.makePath makePath: /overseer/queue
[junit4] 2> 715655 T2028 oascc.SolrZkClient.makePath makePath: /overseer/collection-queue-work
[junit4] 2> 715656 T2028 oascc.SolrZkClient.makePath makePath: /overseer/collection-map-running
[junit4] 2> 715658 T2028 oascc.SolrZkClient.makePath makePath: /overseer/collection-map-completed
[junit4] 2> 715660 T2028 oascc.SolrZkClient.makePath makePath: /overseer/collection-map-failure
[junit4] 2> 715662 T2028 oascc.SolrZkClient.makePath makePath: /live_nodes
[junit4] 2> 715662 T2028 oasc.ZkController.createEphemeralLiveNode Register node as live in ZooKeeper:/live_nodes/127.0.0.1:20530_
[junit4] 2> 715663 T2028 oascc.SolrZkClient.makePath makePath: /live_nodes/127.0.0.1:20530_
[junit4] 2> 715665 T2028 oascc.SolrZkClient.makePath makePath: /overseer_elect
[junit4] 2> 715666 T2028 oascc.SolrZkClient.makePath makePath: /overseer_elect/election
[junit4] 2> 715667 T2028 oasc.Overseer.close Overseer (id=null) closing
[junit4] 2> 715668 T2028 oasc.OverseerElectionContext.runLeaderProcess I am going to be the leader 127.0.0.1:20530_
[junit4] 2> 715668 T2028 oascc.SolrZkClient.makePath makePath: /overseer_elect/leader
[junit4] 2> 715669 T2028 oasc.Overseer.start Overseer (id=92571874760261635-127.0.0.1:20530_-n_0000000000) starting
[junit4] 2> 715671 T2028 oascc.SolrZkClient.makePath makePath: /overseer/queue-work
[junit4] 2> 715675 T2028 oasc.OverseerAutoReplicaFailoverThread.<init> Starting OverseerAutoReplicaFailoverThread autoReplicaFailoverWorkLoopDelay=10000 autoReplicaFailoverWaitAfterExpiration=30000 autoReplicaFailoverBadNodeExpiration=60000
[junit4] 2> 715676 T2052 oasc.OverseerCollectionProcessor.run Process current queue of collection creations
[junit4] 2> 715676 T2028 oascc.SolrZkClient.makePath makePath: /clusterstate.json
[junit4] 2> 715677 T2028 oascc.SolrZkClient.makePath makePath: /aliases.json
[junit4] 2> 715678 T2028 oascc.ZkStateReader.createClusterStateWatchersAndUpdate Updating cluster state from ZooKeeper...
[junit4] 2> 715680 T2051 oasc.Overseer$ClusterStateUpdater.run Starting to work on the main queue
[junit4] 2> 715684 T2054 oasc.ZkController.publish publishing core=collection1 state=down collection=control_collection
[junit4] 2> 715684 T2054 oasc.ZkController.publish numShards not found on descriptor - reading it from system property
[junit4] 2> 715685 T2054 oasc.ZkController.waitForCoreNodeName look for our core node name
[junit4] 2> 715685 T2055 oasc.DistributedQueue$LatchChildWatcher.process LatchChildWatcher fired on path: /overseer/queue state: SyncConnected type NodeChildrenChanged
[junit4] 2> 715687 T2051 oasc.Overseer$ClusterStateUpdater.updateState Update state numShards=1 message={
[junit4] 2> "shard":null,
[junit4] 2> "node_name":"127.0.0.1:20530_",
[junit4] 2> "operation":"state",
[junit4] 2> "roles":null,
[junit4] 2> "collection":"control_collection",
[junit4] 2> "state":"down",
[junit4] 2> "numShards":"1",
[junit4] 2> "base_url":"http://127.0.0.1:20530",
[junit4] 2> "core":"collection1"}
[junit4] 2> 715687 T2051 oasc.Overseer$ClusterStateUpdater.createCollection Create collection control_collection with shards [shard1]
[junit4] 2> 715687 T2051 oasc.Overseer$ClusterStateUpdater.createCollection state version control_collection 1
[junit4] 2> 715688 T2051 oasc.Overseer$ClusterStateUpdater.updateState Assigning new node to shard shard=shard1
[junit4] 2> 715689 T2055 oascc.ZkStateReader$2.process A cluster state change: WatchedEvent state:SyncConnected type:NodeDataChanged path:/clusterstate.json, has occurred - updating... (live nodes size: 1)
[junit4] 2> 716685 T2054 oasc.ZkController.waitForShardId waiting to find shard id in clusterstate for collection1
[junit4] 2> 716686 T2054 oasc.ZkController.createCollectionZkNode Check for collection zkNode:control_collection
[junit4] 2> 716686 T2054 oasc.ZkController.createCollectionZkNode Collection zkNode exists
[junit4] 2> 716687 T2054 oascc.ZkStateReader.readConfigName Load collection config from:/collections/control_collection
[junit4] 2> 716687 T2054 oascc.ZkStateReader.readConfigName path=/collections/control_collection configName=conf1 specified config exists in ZooKeeper
[junit4] 2> 716688 T2054 oasc.SolrResourceLoader.<init> new SolrResourceLoader for directory: '/usr/home/jenkins/jenkins-slave/workspace/Lucene-Solr-Tests-trunk-Java7/solr/build/solr-core/test/J1/temp/solr.cloud.ChaosMonkeySafeLeaderTest-71871D6926824D6E-001/tempDir-002/collection1/'
[junit4] 2> 716689 T2054 oasc.SolrResourceLoader.replaceClassLoader Adding 'file:/usr/home/jenkins/jenkins-slave/workspace/Lucene-Solr-Tests-trunk-Java7/solr/build/solr-core/test/J1/temp/solr.cloud.ChaosMonkeySafeLeaderTest-71871D6926824D6E-001/tempDir-002/collection1/lib/classes/' to classloader
[junit4] 2> 716690 T2054 oasc.SolrResourceLoader.replaceClassLoader Adding 'file:/usr/home/jenkins/jenkins-slave/workspace/Lucene-Solr-Tests-trunk-Java7/solr/build/solr-core/test/J1/temp/solr.cloud.ChaosMonkeySafeLeaderTest-71871D6926824D6E-001/tempDir-002/collection1/lib/.svn/' to classloader
[junit4] 2> 716690 T2054 oasc.SolrResourceLoader.replaceClassLoader Adding 'file:/usr/home/jenkins/jenkins-slave/workspace/Lucene-Solr-Tests-trunk-Java7/solr/build/solr-core/test/J1/temp/solr.cloud.ChaosMonkeySafeLeaderTest-71871D6926824D6E-001/tempDir-002/collection1/lib/README' to classloader
[junit4] 2> 716752 T2054 oasc.SolrConfig.<init> Using Lucene MatchVersion: 6.0.0
[junit4] 2> 716799 T2054 oasc.SolrConfig.<init> Loaded SolrConfig: solrconfig.xml
[junit4] 2> 716900 T2054 oass.IndexSchema.readSchema Reading Solr Schema from schema.xml
[junit4] 2> 716909 T2054 oass.IndexSchema.readSchema [collection1] Schema name=test
[junit4] 2> 717268 T2054 oass.IndexSchema.readSchema default search field in schema is text
[junit4] 2> 717271 T2054 oass.IndexSchema.readSchema unique key field: id
[junit4] 2> 717273 T2054 oass.FileExchangeRateProvider.reload Reloading exchange rates from file currency.xml
[junit4] 2> 717278 T2054 oass.FileExchangeRateProvider.reload Reloading exchange rates from file currency.xml
[junit4] 2> 717295 T2054 oasc.CoreContainer.create Creating SolrCore 'collection1' using configuration from collection control_collection
[junit4] 2> 717295 T2054 oasc.SolrCore.initDirectoryFactory solr.StandardDirectoryFactory
[junit4] 2> 717373 T2054 oasc.SolrCore.<init> [collection1] Opening new SolrCore at /usr/home/jenkins/jenkins-slave/workspace/Lucene-Solr-Tests-trunk-Java7/solr/build/solr-core/test/J1/temp/solr.cloud.ChaosMonkeySafeLeaderTest-71871D6926824D6E-001/tempDir-002/collection1/, dataDir=/usr/home/jenkins/jenkins-slave/workspace/Lucene-Solr-Tests-trunk-Java7/solr/build/solr-core/test/J1/temp/solr.cloud.ChaosMonkeySafeLeaderTest-71871D6926824D6E-001/tempDir-001/control/data/
[junit4] 2> 717373 T2054 oasc.JmxMonitoredMap.<init> JMX monitoring is enabled. Adding Solr mbeans to JMX Server: com.sun.jmx.mbeanserver.JmxMBeanServer@1a178ca0
[junit4] 2> 717377 T2054 oasc.CachingDirectoryFactory.get return new directory for /usr/home/jenkins/jenkins-slave/workspace/Lucene-Solr-Tests-trunk-Java7/solr/build/solr-core/test/J1/temp/solr.cloud.ChaosMonkeySafeLeaderTest-71871D6926824D6E-001/tempDir-001/control/data
[junit4] 2> 717378 T2054 oasc.SolrCore.getNewIndexDir New index directory detected: old=null new=/usr/home/jenkins/jenkins-slave/workspace/Lucene-Solr-Tests-trunk-Java7/solr/build/solr-core/test/J1/temp/solr.cloud.ChaosMonkeySafeLeaderTest-71871D6926824D6E-001/tempDir-001/control/data/index/
[junit4] 2> 717379 T2054 oasc.SolrCore.initIndex WARN [collection1] Solr index directory '/usr/home/jenkins/jenkins-slave/workspace/Lucene-Solr-Tests-trunk-Java7/solr/build/solr-core/test/J1/temp/solr.cloud.ChaosMonkeySafeLeaderTest-71871D6926824D6E-001/tempDir-001/control/data/index' doesn't exist. Creating new index...
[junit4] 2> 717379 T2054 oasc.CachingDirectoryFactory.get return new directory for /usr/home/jenkins/jenkins-slave/workspace/Lucene-Solr-Tests-trunk-Java7/solr/build/solr-core/test/J1/temp/solr.cloud.ChaosMonkeySafeLeaderTest-71871D6926824D6E-001/tempDir-001/control/data/index
[junit4] 2> 717380 T2054 oasu.RandomMergePolicy.<init> RandomMergePolicy wrapping class org.apache.lucene.index.LogDocMergePolicy: [LogDocMergePolicy: minMergeSize=1000, mergeFactor=35, maxMergeSize=9223372036854775807, maxMergeSizeForForcedMerge=9223372036854775807, calibrateSizeByDeletes=false, maxMergeDocs=2147483647, maxCFSSegmentSizeMB=8.796093022207999E12, noCFSRatio=0.0]
[junit4] 2> 717404 T2054 oasc.SolrDeletionPolicy.onCommit SolrDeletionPolicy.onCommit: commits: num=1
[junit4] 2> commit{dir=/usr/home/jenkins/jenkins-slave/workspace/Lucene-Solr-Tests-trunk-Java7/solr/build/solr-core/test/J1/temp/solr.cloud.ChaosMonkeySafeLeaderTest-71871D6926824D6E-001/tempDir-001/control/data/index,segFN=segments_1,generation=1}
[junit4] 2> 717404 T2054 oasc.SolrDeletionPolicy.updateCommits newest commit generation = 1
[junit4] 2> 717408 T2054 oasup.UpdateRequestProcessorChain.init creating updateRequestProcessorChain "nodistrib"
[junit4] 2> 717409 T2054 oasup.UpdateRequestProcessorChain.init creating updateRequestProcessorChain "dedupe"
[junit4] 2> 717409 T2054 oasup.UpdateRequestProcessorChain.init inserting DistributedUpdateProcessorFactory into updateRequestProcessorChain "dedupe"
[junit4] 2> 717409 T2054 oasup.UpdateRequestProcessorChain.init creating updateRequestProcessorChain "stored_sig"
[junit4] 2> 717410 T2054 oasup.UpdateRequestProcessorChain.init inserting DistributedUpdateProcessorFactory into updateRequestProcessorChain "stored_sig"
[junit4] 2> 717410 T2054 oasup.UpdateRequestProcessorChain.init creating updateRequestProcessorChain "distrib-dup-test-chain-explicit"
[junit4] 2> 717410 T2054 oasup.UpdateRequestProcessorChain.init creating updateRequestProcessorChain "distrib-dup-test-chain-implicit"
[junit4] 2> 717411 T2054 oasup.UpdateRequestProcessorChain.init inserting DistributedUpdateProcessorFactory into updateRequestProcessorChain "distrib-dup-test-chain-implicit"
[junit4] 2> 717411 T2054 oasc.SolrCore.loadUpdateProcessorChains no updateRequestProcessorChain defined as default, creating implicit default
[junit4] 2> 717411 T2054 oasc.RequestHandlers.initHandlersFromConfig created /update/json: org.apache.solr.handler.UpdateRequestHandler
[junit4] 2> 717412 T2054 oasc.RequestHandlers.initHandlersFromConfig created /update/json/docs: org.apache.solr.handler.UpdateRequestHandler
[junit4] 2> 717412 T2054 oasc.RequestHandlers.initHandlersFromConfig created /update/csv: org.apache.solr.handler.UpdateRequestHandler
[junit4] 2> 717413 T2054 oasc.RequestHandlers.initHandlersFromConfig created standard: solr.StandardRequestHandler
[junit4] 2> 717413 T2054 oasc.RequestHandlers.initHandlersFromConfig created /get: solr.RealTimeGetHandler
[junit4] 2> 717413 T2054 oasc.RequestHandlers.initHandlersFromConfig adding lazy requestHandler: solr.ReplicationHandler
[junit4] 2> 717413 T2054 oasc.RequestHandlers.initHandlersFromConfig created /replication: solr.ReplicationHandler
[junit4] 2> 717414 T2054 oasc.RequestHandlers.initHandlersFromConfig created /update: solr.UpdateRequestHandler
[junit4] 2> 717414 T2054 oasc.RequestHandlers.initHandlersFromConfig created /admin/: org.apache.solr.handler.admin.AdminHandlers
[junit4] 2> 717415 T2054 oasc.RequestHandlers.initHandlersFromConfig created /admin/file: solr.admin.ShowFileRequestHandler
[junit4] 2> 717415 T2054 oasc.RequestHandlers.initHandlersFromConfig created /admin/fileedit: solr.admin.EditFileRequestHandler
[junit4] 2> 717437 T2054 oashl.XMLLoader.init xsltCacheLifetimeSeconds=60
[junit4] 2> 717439 T2054 oashl.XMLLoader.init xsltCacheLifetimeSeconds=60
[junit4] 2> 717441 T2054 oashl.XMLLoader.init xsltCacheLifetimeSeconds=60
[junit4] 2> 717443 T2054 oashl.XMLLoader.init xsltCacheLifetimeSeconds=60
[junit4] 2> 717446 T2054 oasu.CommitTracker.<init> Hard AutoCommit: disabled
[junit4] 2> 717447 T2054 oasu.CommitTracker.<init> Soft AutoCommit: disabled
[junit4] 2> 717447 T2054 oasu.RandomMergePolicy.<init> RandomMergePolicy wrapping class org.apache.lucene.index.TieredMergePolicy: [TieredMergePolicy: maxMergeAtOnce=30, maxMergeAtOnceExplicit=35, maxMergedSegmentMB=98.1103515625, floorSegmentMB=1.1923828125, forceMergeDeletesPctAllowed=29.172334513895375, segmentsPerTier=27.0, maxCFSSegmentSizeMB=8.796093022207999E12, noCFSRatio=0.42233847442015227
[junit4] 2> 717449 T2054 oasc.SolrDeletionPolicy.onInit SolrDeletionPolicy.onInit: commits: num=1
[junit4] 2> commit{dir=/usr/home/jenkins/jenkins-slave/workspace/Lucene-Solr-Tests-trunk-Java7/solr/build/solr-core/test/J1/temp/solr.cloud.ChaosMonkeySafeLeaderTest-71871D6926824D6E-001/tempDir-001/control/data/index,segFN=segments_1,generation=1}
[junit4] 2> 717449 T2054 oasc.SolrDeletionPolicy.updateCommits newest commit generation = 1
[junit4] 2> 717450 T2054 oass.SolrIndexSearcher.<init> Opening Searcher@24698caa[collection1] main
[junit4] 2> 717450 T2054 oascc.ZkStateReader.readConfigName Load collection config from:/collections/control_collection
[junit4] 2> 717451 T2054 oascc.ZkStateReader.readConfigName path=/collections/control_collection configName=conf1 specified config exists in ZooKeeper
[junit4] 2> 717451 T2054 oasr.ManagedResourceStorage.newStorageIO Setting up ZooKeeper-based storage for the RestManager with znodeBase: /configs/conf1
[junit4] 2> 717451 T2054 oasr.ManagedResourceStorage$ZooKeeperStorageIO.configure Configured ZooKeeperStorageIO with znodeBase: /configs/conf1
[junit4] 2> 717452 T2054 oasr.RestManager.init Initializing RestManager with initArgs: {}
[junit4] 2> 717452 T2054 oasr.ManagedResourceStorage.load Reading _rest_managed.json using ZooKeeperStorageIO:path=/configs/conf1
[junit4] 2> 717452 T2054 oasr.ManagedResourceStorage$ZooKeeperStorageIO.openInputStream No data found for znode /configs/conf1/_rest_managed.json
[junit4] 2> 717453 T2054 oasr.ManagedResourceStorage.load Loaded null at path _rest_managed.json using ZooKeeperStorageIO:path=/configs/conf1
[junit4] 2> 717453 T2054 oascc.SolrZkClient.makePath makePath: /configs/conf1/_rest_managed.json
[junit4] 2> 717455 T2054 oasr.ManagedResourceStorage$ZooKeeperStorageIO$1.close Wrote 38 bytes to new znode /configs/conf1/_rest_managed.json
[junit4] 2> 717455 T2054 oasr.ManagedResourceStorage$JsonStorage.store Saved JSON object to path _rest_managed.json using ZooKeeperStorageIO:path=/configs/conf1
[junit4] 2> 717455 T2054 oasr.RestManager.init Initializing 0 registered ManagedResources
[junit4] 2> 717458 T2056 oasc.SolrCore.registerSearcher [collection1] Registered new searcher Searcher@24698caa[collection1] main{ExitableDirectoryReader(UninvertingDirectoryReader())}
[junit4] 2> 717460 T2054 oasc.CoreContainer.registerCore registering core: collection1
[junit4] 2> 717461 T2059 oasc.ZkController.register Register replica - core:collection1 address:http://127.0.0.1:20530 collection:control_collection shard:shard1
[junit4] 2> 717461 T2028 oass.SolrDispatchFilter.init user.dir=/usr/home/jenkins/jenkins-slave/workspace/Lucene-Solr-Tests-trunk-Java7/solr/build/solr-core/test/J1
[junit4] 2> 717461 T2059 oascc.SolrZkClient.makePath makePath: /collections/control_collection/leader_elect/shard1/election
[junit4] 2> 717461 T2028 oass.SolrDispatchFilter.init SolrDispatchFilter.init() done
[junit4] 2> 717462 T2028 oascc.SolrZkClient.createZkCredentialsToAddAutomatically Using default ZkCredentialsProvider
[junit4] 2> 717463 T2028 oascc.ConnectionManager.waitForConnected Waiting for client to connect to ZooKeeper
[junit4] 2> 717464 T2061 oascc.ConnectionManager.process Watcher org.apache.solr.common.cloud.ConnectionManager@5d455063 name:ZooKeeperConnection Watcher:127.0.0.1:20524/solr got event WatchedEvent state:SyncConnected type:None path:null path:null type:None
[junit4] 2> 717465 T2028 oascc.ConnectionManager.waitForConnected Client is connected to ZooKeeper
[junit4] 2> 717465 T2028 oascc.SolrZkClient.createZkACLProvider Using default ZkACLProvider
[junit4] 2> 717467 T2059 oasc.ShardLeaderElectionContext.runLeaderProcess Running the leader process for shard shard1
[junit4] 2> 717467 T2028 oascc.ZkStateReader.createClusterStateWatchersAndUpdate Updating cluster state from ZooKeeper...
[junit4] 2> 717468 T2055 oasc.DistributedQueue$LatchChildWatcher.process LatchChildWatcher fired on path: /overseer/queue state: SyncConnected type NodeChildrenChanged
[junit4] 2> 717468 T2059 oasc.ShardLeaderElectionContext.waitForReplicasToComeUp Enough replicas found to continue.
[junit4] 2> 717469 T2059 oasc.ShardLeaderElectionContext.runLeaderProcess I may be the new leader - try and sync
[junit4] 2> ASYNC NEW_CORE C367 name=collection1 org.apache.solr.core.SolrCore@15df684f url=http://127.0.0.1:20530/collection1 node=127.0.0.1:20530_ C367_STATE=coll:control_collection core:collection1 props:{node_name=127.0.0.1:20530_, state=down, base_url=http://127.0.0.1:20530, core=collection1}
[junit4] 2> 717469 T2059 C367 P20530 oasc.SyncStrategy.sync Sync replicas to http://127.0.0.1:20530/collection1/
[junit4] 2> 717469 T2059 C367 P20530 oasc.SyncStrategy.syncReplicas Sync Success - now sync replicas to me
[junit4] 2> 717469 T2059 C367 P20530 oasc.SyncStrategy.syncToMe http://127.0.0.1:20530/collection1/ has no replicas
[junit4] 2> 717469 T2028 oasc.ChaosMonkey.monkeyLog monkey: init - expire sessions:false cause connection loss:false
[junit4] 2> 717469 T2059 oasc.ShardLeaderElectionContext.runLeaderProcess I am the new leader: http://127.0.0.1:20530/collection1/ shard1
[junit4] 2> 717470 T2028 oasc.AbstractFullDistribZkTestBase.createJettys Creating collection1 with stateFormat=2
[junit4] 2> 717470 T2059 oascc.SolrZkClient.makePath makePath: /collections/control_collection/leaders/shard1
[junit4] 2> 717470 T2028 oascc.SolrZkClient.createZkCredentialsToAddAutomatically Using default ZkCredentialsProvider
[junit4] 2> 717471 T2028 oascc.ConnectionManager.waitForConnected Waiting for client to connect to ZooKeeper
[junit4] 2> 717472 T2063 oascc.ConnectionManager.process Watcher org.apache.solr.common.cloud.ConnectionManager@5d41296e name:ZooKeeperConnection Watcher:127.0.0.1:20524/solr got event WatchedEvent state:SyncConnected type:None path:null path:null type:None
[junit4] 2> 717473 T2055 oascc.ZkStateReader$2.process A cluster state change: WatchedEvent state:SyncConnected type:NodeDataChanged path:/clusterstate.json, has occurred - updating... (live nodes size: 1)
[junit4] 2> 717473 T2028 oascc.ConnectionManager.waitForConnected Client is connected to ZooKeeper
[junit4] 2> 717473 T2064 oascc.ZkStateReader$2.process A cluster state change: WatchedEvent state:SyncConnected type:NodeDataChanged path:/clusterstate.json, has occurred - updating... (live nodes size: 1)
[junit4] 2> 717473 T2028 oascc.SolrZkClient.createZkACLProvider Using default ZkACLProvider
[junit4] 2> 717476 T2065 oasc.DistributedQueue$LatchChildWatcher.process LatchChildWatcher fired on path: /overseer/queue state: SyncConnected type NodeChildrenChanged
[junit4] 2> 717479 T2051 oasc.Overseer$ClusterStateUpdater.buildCollection building a new collection: collection1
[junit4] 2> 717480 T2051 oasc.Overseer$ClusterStateUpdater.createCollection Create collection collection1 with shards [shard1]
[junit4] 2> 717480 T2051 oasc.Overseer$ClusterStateUpdater.createCollection state version collection1 2
[junit4] 2> 717481 T2065 oasc.DistributedQueue$LatchChildWatcher.process LatchChildWatcher fired on path: /overseer/queue state: SyncConnected type NodeChildrenChanged
[junit4] 2> 717481 T2051 oasc.Overseer$ClusterStateUpdater.updateZkStates going to create_collection /collections/collection1/state.json
[junit4] 2> 717483 T2065 oascc.ZkStateReader$2.process A cluster state change: WatchedEvent state:SyncConnected type:NodeDataChanged path:/clusterstate.json, has occurred - updating... (live nodes size: 1)
[junit4] 2> 717483 T2064 oascc.ZkStateReader$2.process A cluster state change: WatchedEvent state:SyncConnected type:NodeDataChanged path:/clusterstate.json, has occurred - updating... (live nodes size: 1)
[junit4] 2> 717526 T2059 oasc.ZkController.register We are http://127.0.0.1:20530/collection1/ and leader is http://127.0.0.1:20530/collection1/
[junit4] 2> 717527 T2059 oasc.ZkController.register No LogReplay needed for core=collection1 baseURL=http://127.0.0.1:20530
[junit4] 2> 717527 T2059 oasc.ZkController.checkRecovery I am the leader, no recovery necessary
[junit4] 2> 717527 T2059 oasc.ZkController.publish publishing core=collection1 state=active collection=control_collection
[junit4] 2> 717527 T2059 oasc.ZkController.publish numShards not found on descriptor - reading it from system property
[junit4] 2> 717529 T2065 oasc.DistributedQueue$LatchChildWatcher.process LatchChildWatcher fired on path: /overseer/queue state: SyncConnected type NodeChildrenChanged
[junit4] 2> 717531 T2051 oasc.Overseer$ClusterStateUpdater.updateState Update state numShards=1 message={
[junit4] 2> "shard":"shard1",
[junit4] 2> "node_name":"127.0.0.1:20530_",
[junit4] 2> "operation":"state",
[junit4] 2> "roles":null,
[junit4] 2> "collection":"control_collection",
[junit4] 2> "state":"active",
[junit4] 2> "numShards":"1",
[junit4] 2> "base_url":"http://127.0.0.1:20530",
[junit4] 2> "core_node_name":"core_node1",
[junit4] 2> "core":"collection1"}
[junit4] 2> 717634 T2064 oascc.ZkStateReader$2.process A cluster state change: WatchedEvent state:SyncConnected type:NodeDataChanged path:/clusterstate.json, has occurred - updating... (live nodes size: 1)
[junit4] 2> 717634 T2065 oascc.ZkStateReader$2.process A cluster state change: WatchedEvent state:SyncConnected type:NodeDataChanged path:/clusterstate.json, has occurred - updating... (live nodes size: 1)
[junit4] 2> 719356 T2028 oasc.AbstractFullDistribZkTestBase.createJettys create jetty 1
[junit4] 2> 719356 T2028 oejs.Server.doStart jetty-8.1.10.v20130312
[junit4] 2> 719360 T2028 oejs.AbstractConnector.doStart Started SocketConnector@127.0.0.1:20537
[junit4] 2> 719360 T2028 oass.SolrDispatchFilter.init SolrDispatchFilter.init()
[junit4] 2> 719361 T2028 oasc.SolrResourceLoader.locateSolrHome JNDI not configured for solr (NoInitialContextEx)
[junit4] 2> 719361 T2028 oasc.SolrResourceLoader.locateSolrHome using system property solr.solr.home: /usr/home/jenkins/jenkins-slave/workspace/Lucene-Solr-Tests-trunk-Java7/solr/build/solr-core/test/J1/temp/solr.cloud.ChaosMonkeySafeLeaderTest-71871D6926824D6E-001/tempDir-003
[junit4] 2> 719361 T2028 oasc.SolrResourceLoader.<init> new SolrResourceLoader for directory: '/usr/home/jenkins/jenkins-slave/workspace/Lucene-Solr-Tests-trunk-Java7/solr/build/solr-core/test/J1/temp/solr.cloud.ChaosMonkeySafeLeaderTest-71871D6926824D6E-001/tempDir-003/'
[junit4] 2> 719416 T2028 oasc.ConfigSolr.fromFile Loading container configuration from /usr/home/jenkins/jenkins-slave/workspace/Lucene-Solr-Tests-trunk-Java7/solr/build/solr-core/test/J1/temp/solr.cloud.ChaosMonkeySafeLeaderTest-71871D6926824D6E-001/tempDir-003/solr.xml
[junit4] 2> 719515 T2028 oasc.CoreContainer.<init> New CoreContainer 1174243693
[junit4] 2> 719515 T2028 oasc.CoreContainer.load Loading cores into CoreContainer [instanceDir=/usr/home/jenkins/jenkins-slave/workspace/Lucene-Solr-Tests-trunk-Java7/solr/build/solr-core/test/J1/temp/solr.cloud.ChaosMonkeySafeLeaderTest-71871D6926824D6E-001/tempDir-003/]
[junit4] 2> 719517 T2028 oashc.HttpShardHandlerFactory.getParameter Setting socketTimeout to: 90000
[junit4] 2> 719517 T2028 oashc.HttpShardHandlerFactory.getParameter Setting urlScheme to:
[junit4] 2> 719517 T2028 oashc.HttpShardHandlerFactory.getParameter Setting connTimeout to: 15000
[junit4] 2> 719517 T2028 oashc.HttpShardHandlerFactory.getParameter Setting maxConnectionsPerHost to: 20
[junit4] 2> 719518 T2028 oashc.HttpShardHandlerFactory.getParameter Setting corePoolSize to: 0
[junit4] 2> 719518 T2028 oashc.HttpShardHandlerFactory.getParameter Setting maximumPoolSize to: 2147483647
[junit4] 2> 719518 T2028 oashc.HttpShardHandlerFactory.getParameter Setting maxThreadIdleTime to: 5
[junit4] 2> 719519 T2028 oashc.HttpShardHandlerFactory.getParameter Setting sizeOfQueue to: -1
[junit4] 2> 719519 T2028 oashc.HttpShardHandlerFactory.getParameter Setting fairnessPolicy to: false
[junit4] 2> 719520 T2028 oasu.UpdateShardHandler.<init> Creating UpdateShardHandler HTTP client with params: socketTimeout=340000&connTimeout=45000&retry=false
[junit4] 2> 719520 T2028 oasl.LogWatcher.createWatcher SLF4J impl is org.slf4j.impl.Log4jLoggerFactory
[junit4] 2> 719520 T2028 oasl.LogWatcher.newRegisteredLogWatcher Registering Log Listener [Log4j (org.slf4j.impl.Log4jLoggerFactory)]
[junit4] 2> 719521 T2028 oasc.CoreContainer.load Host Name: 127.0.0.1
[junit4] 2> 719521 T2028 oasc.ZkContainer.initZooKeeper Zookeeper client=127.0.0.1:20524/solr
[junit4] 2> 719521 T2028 oasc.ZkController.checkChrootPath zkHost includes chroot
[junit4] 2> 719522 T2028 oascc.SolrZkClient.createZkCredentialsToAddAutomatically Using default ZkCredentialsProvider
[junit4] 2> 719522 T2028 oascc.ConnectionManager.waitForConnected Waiting for client to connect to ZooKeeper
[junit4] 2> 719524 T2076 oascc.ConnectionManager.process Watcher org.apache.solr.common.cloud.ConnectionManager@8497701 name:ZooKeeperConnection Watcher:127.0.0.1:20524 got event WatchedEvent state:SyncConnected type:None path:null path:null type:None
[junit4] 2> 719525 T2028 oascc.ConnectionManager.waitForConnected Client is connected to ZooKeeper
[junit4] 2> 719525 T2028 oascc.SolrZkClient.createZkACLProvider Using default ZkACLProvider
[junit4] 2> 719527 T2028 oascc.ConnectionManager.waitForConnected Waiting for client to connect to ZooKeeper
[junit4] 2> 719528 T2078 oascc.ConnectionManager.process Watcher org.apache.solr.common.cloud.ConnectionManager@5ecb03ac name:ZooKeeperConnection Watcher:127.0.0.1:20524/solr got event WatchedEvent state:SyncConnected type:None path:null path:null type:None
[junit4] 2> 719528 T2028 oascc.ConnectionManager.waitForConnected Client is connected to ZooKeeper
[junit4] 2> 719532 T2028 oascc.ZkStateReader.createClusterStateWatchersAndUpdate Updating cluster state from ZooKeeper...
[junit4] 2> 720536 T2028 oasc.ZkController.createEphemeralLiveNode Register node as live in ZooKeeper:/live_nodes/127.0.0.1:20537_
[junit4] 2> 720537 T2028 oascc.SolrZkClient.makePath makePath: /live_nodes/127.0.0.1:20537_
[junit4] 2> 720540 T2028 oasc.Overseer.close Overseer (id=null) closing
[junit4] 2> 720547 T2080 oasc.ZkController.publish publishing core=collection1 state=down collection=collection1
[junit4] 2> 720548 T2080 oasc.ZkController.publish numShards not found on descriptor - reading it from system property
[junit4] 2> 720549 T2065 oasc.DistributedQueue$LatchChildWatcher.process LatchChildWatcher fired on path: /overseer/queue state: SyncConnected type NodeChildrenChanged
[junit4] 2> 720549 T2080 oasc.ZkController.preRegister Registering watch for external collection collection1
[junit4] 2> 720550 T2080 oascc.ZkStateReader.addZkWatch addZkWatch collection1
[junit4] 2> 720550 T2080 oascc.ZkStateReader.addZkWatch Updating collection state at /collections/collection1/state.json from ZooKeeper...
[junit4] 2> 720551 T2051 oasc.Overseer$ClusterStateUpdater.updateState Update state numShards=1 message={
[junit4] 2> "shard":null,
[junit4] 2> "node_name":"127.0.0.1:20537_",
[junit4] 2> "operation":"state",
[junit4] 2> "roles":null,
[junit4] 2> "collection":"collection1",
[junit4] 2> "state":"down",
[junit4] 2> "numShards":"1",
[junit4] 2> "base_url":"http://127.0.0.1:20537",
[junit4] 2> "core":"collection1"}
[junit4] 2> 720551 T2080 oascc.ZkStateReader.updateWatchedCollection Updating data for collection1 to ver 0
[junit4] 2> 720551 T2080 oasc.ZkController.waitForCoreNodeName look for our core node name
[junit4] 2> 720553 T2051 oasc.Overseer$ClusterStateUpdater.updateState Collection already exists with numShards=1
[junit4] 2> 720553 T2051 oasc.Overseer$ClusterStateUpdater.updateState Assigning new node to shard shard=shard1
[junit4] 2> 720557 T2051 oasc.Overseer$ClusterStateUpdater.updateZkStates going to update_collection /collections/collection1/state.json
[junit4] 2> 720557 T2079 oascc.ZkStateReader$7.process A cluster state change: WatchedEvent state:SyncConnected type:NodeDataChanged path:/collections/collection1/state.json, has occurred - updating...
[junit4] 2> 720558 T2079 oascc.ZkStateReader.updateWatchedCollection Updating data for collection1 to ver 1
[junit4] 2> 721552 T2080 oasc.ZkController.waitForShardId waiting to find shard id in clusterstate for collection1
[junit4] 2> 721553 T2080 oasc.ZkController.createCollectionZkNode Check for collection zkNode:collection1
[junit4] 2> 721553 T2080 oasc.ZkController.createCollectionZkNode Collection zkNode exists
[junit4] 2> 721554 T2080 oascc.ZkStateReader.readConfigName Load collection config from:/collections/collection1
[junit4] 2> 721554 T2080 oascc.ZkStateReader.readConfigName path=/collections/collection1 configName=conf1 specified config exists in ZooKeeper
[junit4] 2> 721555 T2080 oasc.SolrResourceLoader.<init> new SolrResourceLoader for directory: '/usr/home/jenkins/jenkins-slave/workspace/Lucene-Solr-Tests-trunk-Java7/solr/build/solr-core/test/J1/temp/solr.cloud.ChaosMonkeySafeLeaderTest-71871D6926824D6E-001/tempDir-003/collection1/'
[junit4] 2> 721556 T2080 oasc.SolrResourceLoader.replaceClassLoader Adding 'file:/usr/home/jenkins/jenkins-slave/workspace/Lucene-Solr-Tests-trunk-Java7/solr/build/solr-core/test/J1/temp/solr.cloud.ChaosMonkeySafeLeaderTest-71871D6926824D6E-001/tempDir-003/collection1/lib/.svn/' to classloader
[junit4] 2> 721557 T2080 oasc.SolrResourceLoader.replaceClassLoader Adding 'file:/usr/home/jenkins/jenkins-slave/workspace/Lucene-Solr-Tests-trunk-Java7/solr/build/solr-core/test/J1/temp/solr.cloud.ChaosMonkeySafeLeaderTest-71871D6926824D6E-001/tempDir-003/collection1/lib/classes/' to classloader
[junit4] 2> 721558 T2080 oasc.SolrResourceLoader.replaceClassLoader Adding 'file:/usr/home/jenkins/jenkins-slave/workspace/Lucene-Solr-Tests-trunk-Java7/solr/build/solr-core/test/J1/temp/solr.cloud.ChaosMonkeySafeLeaderTest-71871D6926824D6E-001/tempDir-003/collection1/lib/README' to classloader
[junit4] 2> 721640 T2080 oasc.SolrConfig.<init> Using Lucene MatchVersion: 6.0.0
[junit4] 2> 721687 T2080 oasc.SolrConfig.<init> Loaded SolrConfig: solrconfig.xml
[junit4] 2> 721788 T2080 oass.IndexSchema.readSchema Reading Solr Schema from schema.xml
[junit4] 2> 721798 T2080 oass.IndexSchema.readSchema [collection1] Schema name=test
[junit4] 2> 722178 T2080 oass.IndexSchema.readSchema default search field in schema is text
[junit4] 2> 722181 T2080 oass.IndexSchema.readSchema unique key field: id
[junit4] 2> 722183 T2080 oass.FileExchangeRateProvider.reload Reloading exchange rates from file currency.xml
[junit4] 2> 722188 T2080 oass.FileExchangeRateProvider.reload Reloading exchange rates from file currency.xml
[junit4] 2> 722203 T2080 oasc.CoreContainer.create Creating SolrCore 'collection1' using configuration from collection collection1
[junit4] 2> 722204 T2080 oasc.SolrCore.initDirectoryFactory solr.StandardDirectoryFactory
[junit4] 2> 722204 T2080 oasc.SolrCore.<init> [collection1] Opening new SolrCore at /usr/home/jenkins/jenkins-slave/workspace/Lucene-Solr-Tests-trunk-Java7/solr/build/solr-core/test/J1/temp/solr.cloud.ChaosMonkeySafeLeaderTest-71871D6926824D6E-001/tempDir-003/collection1/, dataDir=/usr/home/jenkins/jenkins-slave/workspace/Lucene-Solr-Tests-trunk-Java7/solr/build/solr-core/test/J1/temp/solr.cloud.ChaosMonkeySafeLeaderTest-71871D6926824D6E-001/tempDir-001/jetty1/
[junit4] 2> 722204 T2080 oasc.JmxMonitoredMap.<init> JMX monitoring is enabled. Adding Solr mbeans to JMX Server: com.sun.jmx.mbeanserver.JmxMBeanServer@1a178ca0
[junit4] 2> 722206 T2080 oasc.CachingDirectoryFactory.get return new directory for /usr/home/jenkins/jenkins-slave/workspace/Lucene-Solr-Tests-trunk-Java7/solr/build/solr-core/test/J1/temp/solr.cloud.ChaosMonkeySafeLeaderTest-71871D6926824D6E-001/tempDir-001/jetty1
[junit4] 2> 722207 T2080 oasc.SolrCore.getNewIndexDir New index directory detected: old=null new=/usr/home/jenkins/jenkins-slave/workspace/Lucene-Solr-Tests-trunk-Java7/solr/build/solr-core/test/J1/temp/solr.cloud.ChaosMonkeySafeLeaderTest-71871D6926824D6E-001/tempDir-001/jetty1/index/
[junit4] 2> 722208 T2080 oasc.SolrCore.initIndex WARN [collection1] Solr index directory '/usr/home/jenkins/jenkins-slave/workspace/Lucene-Solr-Tests-trunk-Java7/solr/build/solr-core/test/J1/temp/solr.cloud.ChaosMonkeySafeLeaderTest-71871D6926824D6E-001/tempDir-001/jetty1/index' doesn't exist. Creating new index...
[junit4] 2> 722210 T2080 oasc.CachingDirectoryFactory.get return new directory for /usr/home/jenkins/jenkins-slave/workspace/Lucene-Solr-Tests-trunk-Java7/solr/build/solr-core/test/J1/temp/solr.cloud.ChaosMonkeySafeLeaderTest-71871D6926824D6E-001/tempDir-001/jetty1/index
[junit4] 2> 722210 T2080 oasu.RandomMergePolicy.<init> RandomMergePolicy wrapping class org.apache.lucene.index.LogDocMergePolicy: [LogDocMergePolicy: minMergeSize=1000, mergeFactor=35, maxMergeSize=9223372036854775807, maxMergeSizeForForcedMerge=9223372036854775807, calibrateSizeByDeletes=false, maxMergeDocs=2147483647, maxCFSSegmentSizeMB=8.796093022207999E12, noCFSRatio=0.0]
[junit4] 2> 722240 T2080 oasc.SolrDeletionPolicy.onCommit SolrDeletionPolicy.onCommit: commits: num=1
[junit4] 2> commit{dir=/usr/home/jenkins/jenkins-slave/workspace/Lucene-Solr-Tests-trunk-Java7/solr/build/solr-core/test/J1/temp/solr.cloud.ChaosMonkeySafeLeaderTest-71871D6926824D6E-001/tempDir-001/jetty1/index,segFN=segments_1,generation=1}
[junit4] 2> 722240 T2080 oasc.SolrDeletionPolicy.updateCommits newest commit generation = 1
[junit4] 2> 722245 T2080 oasup.UpdateRequestProcessorChain.init creating updateRequestProcessorChain "nodistrib"
[junit4] 2> 722245 T2080 oasup.UpdateRequestProcessorChain.init creating updateRequestProcessorChain "dedupe"
[junit4] 2> 722246 T2080 oasup.UpdateRequestProcessorChain.init inserting DistributedUpdateProcessorFactory into updateRequestProcessorChain "dedupe"
[junit4] 2> 722246 T2080 oasup.UpdateRequestProcessorChain.init creating updateRequestProcessorChain "stored_sig"
[junit4] 2> 722246 T2080 oasup.UpdateRequestProcessorChain.init inserting DistributedUpdateProcessorFactory into updateRequestProcessorChain "stored_sig"
[junit4] 2> 722246 T2080 oasup.UpdateRequestProcessorChain.init creating updateRequestProcessorChain "distrib-dup-test-chain-explicit"
[junit4] 2> 722247 T2080 oasup.UpdateRequestProcessorChain.init creating updateRequestProcessorChain "distrib-dup-test-chain-implicit"
[junit4] 2> 722247 T2080 oasup.UpdateRequestProcessorChain.init inserting DistributedUpdateProcessorFactory into updateRequestProcessorChain "distrib-dup-test-chain-implicit"
[junit4] 2> 722247 T2080 oasc.SolrCore.loadUpdateProcessorChains no updateRequestProcessorChain defined as default, creating implicit default
[junit4] 2> 722248 T2080 oasc.RequestHandlers.initHandlersFromConfig created /update/json: org.apache.solr.handler.UpdateRequestHandler
[junit4] 2> 722249 T2080 oasc.RequestHandlers.initHandlersFromConfig created /update/json/docs: org.apache.solr.handler.UpdateRequestHandler
[junit4] 2> 722249 T2080 oasc.RequestHandlers.initHandlersFromConfig created /update/csv: org.apache.solr.handler.UpdateRequestHandler
[junit4] 2> 722250 T2080 oasc.RequestHandlers.initHandlersFromConfig created standard: solr.StandardRequestHandler
[junit4] 2> 722250 T2080 oasc.RequestHandlers.initHandlersFromConfig created /get: solr.RealTimeGetHandler
[junit4] 2> 722251 T2080 oasc.RequestHandlers.initHandlersFromConfig adding lazy requestHandler: solr.ReplicationHandler
[junit4] 2> 722251 T2080 oasc.RequestHandlers.initHandlersFromConfig created /replication: solr.ReplicationHandler
[junit4] 2> 722251 T2080 oasc.RequestHandlers.initHandlersFromConfig created /update: solr.UpdateRequestHandler
[junit4] 2> 722252 T2080 oasc.RequestHandlers.initHandlersFromConfig created /admin/: org.apache.solr.handler.admin.AdminHandlers
[junit4] 2> 722252 T2080 oasc.RequestHandlers.initHandlersFromConfig created /admin/file: solr.admin.ShowFileRequestHandler
[junit4] 2> 722253 T2080 oasc.RequestHandlers.initHandlersFromConfig created /admin/fileedit: solr.admin.EditFileRequestHandler
[junit4] 2> 722276 T2080 oashl.XMLLoader.init xsltCacheLifetimeSeconds=60
[junit4] 2> 722278 T2080 oashl.XMLLoader.init xsltCacheLifetimeSeconds=60
[junit4] 2> 722280 T2080 oashl.XMLLoader.init xsltCacheLifetimeSeconds=60
[junit4] 2> 722282 T2080 oashl.XMLLoader.init xsltCacheLifetimeSeconds=60
[junit4] 2> 722286 T2080 oasu.CommitTracker.<init> Hard AutoCommit: disabled
[junit4] 2> 722286 T2080 oasu.CommitTracker.<init> Soft AutoCommit: disabled
[junit4] 2> 722287 T2080 oasu.RandomMergePolicy.<init> RandomMergePolicy wrapping class org.apache.lucene.index.TieredMergePolicy: [TieredMergePolicy: maxMergeAtOnce=30, maxMergeAtOnceExplicit=35, maxMergedSegmentMB=98.1103515625, floorSegmentMB=1.1923828125, forceMergeDeletesPctAllowed=29.172334513895375, segmentsPerTier=27.0, maxCFSSegmentSizeMB=8.796093022207999E12, noCFSRatio=0.42233847442015227
[junit4] 2> 722290 T2080 oasc.SolrDeletionPolicy.onInit SolrDeletionPolicy.onInit: commits: num=1
[junit4] 2> commit{dir=/usr/home/jenkins/jenkins-slave/workspace/Lucene-Solr-Tests-trunk-Java7/solr/build/solr-core/test/J1/temp/solr.cloud.ChaosMonkeySafeLeaderTest-71871D6926824D6E-001/tempDir-001/jetty1/index,segFN=segments_1,generation=1}
[junit4] 2> 722290 T2080 oasc.SolrDeletionPolicy.updateCommits newest commit generation = 1
[junit4] 2> 722291 T2080 oass.SolrIndexSearcher.<init> Opening Searcher@45de04c0[collection1] main
[junit4] 2> 722291 T2080 oascc.ZkStateReader.readConfigName Load collection config from:/collections/collection1
[junit4] 2> 722292 T2080 oascc.ZkStateReader.readConfigName path=/collections/collection1 configName=conf1 specified config exists in ZooKeeper
[junit4] 2> 722292 T2080 oasr.ManagedResourceStorage.newStorageIO Setting up ZooKeeper-based storage for the RestManager with znodeBase: /configs/conf1
[junit4] 2> 722292 T2080 oasr.ManagedResourceStorage$ZooKeeperStorageIO.configure Configured ZooKeeperStorageIO with znodeBase: /configs/conf1
[junit4] 2> 722293 T2080 oasr.RestManager.init Initializing RestManager with initArgs: {}
[junit4] 2> 722293 T2080 oasr.ManagedResourceStorage.load Reading _rest_managed.json using ZooKeeperStorageIO:path=/configs/conf1
[junit4] 2> 722294 T2080 oasr.ManagedResourceStorage$ZooKeeperStorageIO.openInputStream Read 38 bytes from znode /configs/conf1/_rest_managed.json
[junit4] 2> 722294 T2080 oasr.ManagedResourceStorage.load Loaded LinkedHashMap at path _rest_managed.json using ZooKeeperStorageIO:path=/configs/conf1
[junit4] 2> 722294 T2080 oasr.ManagedResource.reloadFromStorage Loaded initArgs {} for /rest/managed
[junit4] 2> 722294 T2080 oasr.RestManager.init Initializing 0 registered ManagedResources
[junit4] 2> 722298 T2081 oasc.SolrCore.registerSearcher [collection1] Registered new searcher Searcher@45de04c0[collection1] main{ExitableDirectoryReader(UninvertingDirectoryReader())}
[junit4] 2> 722302 T2080 oasc.CoreContainer.registerCore registering core: collection1
[junit4] 2> 722302 T2084 oasc.ZkController.register Register replica - core:collection1 address:http://127.0.0.1:20537 collection:collection1 shard:shard1
[junit4] 2> 722303 T2028 oass.SolrDispatchFilter.init user.dir=/usr/home/jenkins/jenkins-slave/workspace/Lucene-Solr-Tests-trunk-Java7/solr/build/solr-core/test/J1
[junit4] 2> 722303 T2028 oass.SolrDispatchFilter.init SolrDispatchFilter.init() done
[junit4] 2> 722303 T2084 oascc.SolrZkClient.makePath makePath: /collections/collection1/leader_elect/shard1/election
[junit4] 2> 722308 T2084 oasc.ShardLeaderElectionContext.runLeaderProcess Running the leader process for shard shard1
[junit4] 2> 722309 T2065 oasc.DistributedQueue$LatchChildWatcher.process LatchChildWatcher fired on path: /overseer/queue state: SyncConnected type NodeChildrenChanged
[junit4] 2> 722309 T2084 oasc.ShardLeaderElectionContext.waitForReplicasToComeUp Enough replicas found to continue.
[junit4] 2> 722309 T2084 oasc.ShardLeaderElectionContext.runLeaderProcess I may be the new leader - try and sync
[junit4] 2> ASYNC NEW_CORE C368 name=collection1 org.apache.solr.core.SolrCore@7622e45f url=http://127.0.0.1:20537/collection1 node=127.0.0.1:20537_ C368_STATE=coll:collection1 core:collection1 props:{node_name=127.0.0.1:20537_, state=down, base_url=http://127.0.0.1:20537, core=collection1}
[junit4] 2> 722310 T2084 C368 P20537 oasc.SyncStrategy.sync Sync replicas to http://127.0.0.1:20537/collection1/
[junit4] 2> 722310 T2084 C368 P20537 oasc.SyncStrategy.syncReplicas Sync Success - now sync replicas to me
[junit4] 2> 722310 T2084 C368 P20537 oasc.SyncStrategy.syncToMe http://127.0.0.1:20537/collection1/ has no replicas
[junit4] 2> 722310 T2084 oasc.ShardLeaderElectionContext.runLeaderProcess I am the new leader: http://127.0.0.1:20537/collection1/ shard1
[junit4] 2> 722311 T2084 oascc.SolrZkClient.makePath makePath: /collections/collection1/leaders/shard1
[junit4] 2> 722313 T2051 oasc.Overseer$ClusterStateUpdater.updateZkStates going to update_collection /collections/collection1/state.json
[junit4] 2> 722314 T2079 oascc.ZkStateReader$7.process A cluster state change: WatchedEvent state:SyncConnected type:NodeDataChanged path:/collections/collection1/state.json, has occurred - updating...
[junit4] 2> 722315 T2079 oascc.ZkStateReader.updateWatchedCollection Updating data for collection1 to ver 2
[junit4] 2> 722319 T2065 oasc.DistributedQueue$LatchChildWatcher.process LatchChildWatcher fired on path: /overseer/queue state: SyncConnected type NodeChildrenChanged
[junit4] 2> 722319 T2051 oasc.Overseer$ClusterStateUpdater.updateZkStates going to update_collection /collections/collection1/state.json
[junit4] 2> 722320 T2079 oascc.ZkStateReader$7.process A cluster state change: WatchedEvent state:SyncConnected type:NodeDataChanged path:/collections/collection1/state.json, has occurred - updating...
[junit4] 2> 722321 T2079 oascc.ZkStateReader.updateWatchedCollection Updating data for collection1 to ver 3
[junit4] 2> 722365 T2084 oasc.ZkController.register We are http://127.0.0.1:20537/collection1/ and leader is http://127.0.0.1:20537/collection1/
[junit4] 2> 722366 T2084 oasc.ZkController.register No LogReplay needed for core=collection1 baseURL=http://127.0.0.1:20537
[junit4] 2> 722366 T2084 oasc.ZkController.checkRecovery I am the leader, no recovery necessary
[junit4] 2> 722366 T2084 oasc.ZkController.publish publishing core=collection1 state=active collection=collection1
[junit4] 2> 722366 T2084 oasc.ZkController.publish numShards not found on descriptor - reading it from system property
[junit4] 2> 722368 T2065 oasc.DistributedQueue$LatchChildWatcher.process LatchChildWatcher fired on path: /overseer/queue state: SyncConnected type NodeChildrenChanged
[junit4] 2> 722373 T2084 oascc.ZkStateReader.updateWatchedCollection Updating data for collection1 to ver 3
[junit4] 2> 722373 T2051 oasc.Overseer$ClusterStateUpdater.updateState Update state numShards=1 message={
[junit4] 2> "shard":"shard1",
[junit4] 2> "node_name":"127.0.0.1:20537_",
[junit4] 2> "operation":"state",
[junit4] 2> "roles":null,
[junit4] 2> "collection":"collection1",
[junit4] 2> "state":"active",
[junit4] 2> "numShards":"1",
[junit4] 2> "base_url":"http://127.0.0.1:20537",
[junit4] 2> "core_node_name":"core_node1",
[junit4] 2> "core":"collection1"}
[junit4] 2> 722377 T2051 oasc.Overseer$ClusterStateUpdater.updateZkStates going to update_collection /collections/collection1/state.json
[junit4] 2> 722378 T2079 oascc.ZkStateReader$7.process A cluster state change: WatchedEvent state:SyncConnected type:NodeDataChanged path:/collections/collection1/state.json, has occurred - updating...
[junit4] 2> 722378 T2079 oascc.ZkStateReader.updateWatchedCollection Updating data for collection1 to ver 4
[junit4] 2> 723920 T2028 oasc.AbstractFullDistribZkTestBase.createJettys create jetty 2
[junit4] 2> 723921 T2028 oejs.Server.doStart jetty-8.1.10.v20130312
[junit4] 2> 723924 T2028 oejs.AbstractConnector.doStart Started SocketConnector@127.0.0.1:20550
[junit4] 2> 723924 T2028 oass.SolrDispatchFilter.init SolrDispatchFilter.init()
[junit4] 2> 723924 T2028 oasc.SolrResourceLoader.locateSolrHome JNDI not configured for solr (NoInitialContextEx)
[junit4] 2> 723925 T2028 oasc.SolrResourceLoader.locateSolrHome using system property solr.solr.home: ../../../../../../../../../../../usr/home/jenkins/jenkins-slave/workspace/Lucene-Solr-Tests-trunk-Java7/solr/build/solr-core/test/J1/temp/solr.cloud.ChaosMonkeySafeLeaderTest-71871D6926824D6E-001/tempDir-004
[junit4] 2> 723925 T2028 oasc.SolrResourceLoader.<init> new SolrResourceLoader for directory: '../../../../../../../../../../../usr/home/jenkins/jenkins-slave/workspace/Lucene-Solr-Tests-trunk-Java7/solr/build/solr-core/test/J1/temp/solr.cloud.ChaosMonkeySafeLeaderTest-71871D6926824D6E-001/tempDir-004/'
[junit4] 2> 723957 T2028 oasc.ConfigSolr.fromFile Loading container configuration from /usr/home/jenkins/jenkins-slave/workspace/Lucene-Solr-Tests-trunk-Java7/solr/build/solr-core/test/J1/../../../../../../../../../../../usr/home/jenkins/jenkins-slave/workspace/Lucene-Solr-Tests-trunk-Java7/solr/build/solr-core/test/J1/temp/solr.cloud.ChaosMonkeySafeLeaderTest-71871D6926824D6E-001/tempDir-004/solr.xml
[junit4] 2> 724009 T2028 oasc.CoreContainer.<init> New CoreContainer 895196585
[junit4] 2> 724010 T2028 oasc.CoreContainer.load Loading cores into CoreContainer [instanceDir=../../../../../../../../../../../usr/home/jenkins/jenkins-slave/workspace/Lucene-Solr-Tests-trunk-Java7/solr/build/solr-core/test/J1/temp/solr.cloud.ChaosMonkeySafeLeaderTest-71871D6926824D6E-001/tempDir-004/]
[junit4] 2> 724010 T2028 oashc.HttpShardHandlerFactory.getParameter Setting socketTimeout to: 90000
[junit4] 2> 724011 T2028 oashc.HttpShardHandlerFactory.getParameter Setting urlScheme to:
[junit4] 2> 724011 T2028 oashc.HttpShardHandlerFactory.getParameter Setting connTimeout to: 15000
[junit4] 2> 724011 T2028 oashc.HttpShardHandlerFactory.getParameter Setting maxConnectionsPerHost to: 20
[junit4] 2> 724011 T2028 oashc.HttpShardHandlerFactory.getParameter Setting corePoolSize to: 0
[junit4] 2> 724011 T2028 oashc.HttpShardHandlerFactory.getParameter Setting maximumPoolSize to: 2147483647
[junit4] 2> 724012 T2028 oashc.HttpShardHandlerFactory.getParameter Setting maxThreadIdleTime to: 5
[junit4] 2> 724012 T2028 oashc.HttpShardHandlerFactory.getParameter Setting sizeOfQueue to: -1
[junit4] 2> 724012 T2028 oashc.HttpShardHandlerFactory.getParameter Setting fairnessPolicy to: false
[junit4] 2> 724013 T2028 oasu.UpdateShardHandler.<init> Creating UpdateShardHandler HTTP client with params: socketTimeout=340000&connTimeout=45000&retry=false
[junit4] 2> 724013 T2028 oasl.LogWatcher.createWatcher SLF4J impl is org.slf4j.impl.Log4jLoggerFactory
[junit4] 2> 724013 T2028 oasl.LogWatcher.newRegisteredLogWatcher Registering Log Listener [Log4j (org.slf4j.impl.Log4jLoggerFactory)]
[junit4] 2> 724013 T2028 oasc.CoreContainer.load Host Name: 127.0.0.1
[junit4] 2> 724014 T2028 oasc.ZkContainer.initZooKeeper Zookeeper client=127.0.0.1:20524/solr
[junit4] 2> 724014 T2028 oasc.ZkController.checkChrootPath zkHost includes chroot
[junit4] 2> 724014 T2028 oascc.SolrZkClient.createZkCredentialsToAddAutomatically Using default ZkCredentialsProvider
[junit4] 2> 724015 T2028 oascc.ConnectionManager.waitForConnected Waiting for client to connect to ZooKeeper
[junit4] 2> 724016 T2095 oascc.ConnectionManager.process Watcher org.apache.solr.common.cloud.ConnectionManager@11cbdd9d name:ZooKeeperConnection Watcher:127.0.0.1:20524 got event WatchedEvent state:SyncConnected type:None path:null path:null type:None
[junit4] 2> 724017 T2028 oascc.ConnectionManager.waitForConnected Client is connected to ZooKeeper
[junit4] 2> 724017 T2028 oascc.SolrZkClient.createZkACLProvider Using default ZkACLProvider
[junit4] 2> 724019 T2028 oascc.ConnectionManager.waitForConnected Waiting for client to connect to ZooKeeper
[junit4] 2> 724020 T2097 oascc.ConnectionManager.process Watcher org.apache.solr.common.cloud.ConnectionManager@3bf1fc4f name:ZooKeeperConnection Watcher:127.0.0.1:20524/solr got event WatchedEvent state:SyncConnected type:None path:null path:null type:None
[junit4] 2> 724021 T2028 oascc.ConnectionManager.waitForConnected Client is connected to ZooKeeper
[junit4] 2> 724025 T2028 oascc.ZkStateReader.createClusterStateWatchersAndUpdate Updating cluster state from ZooKeeper...
[junit4] 2> 725029 T2028 oasc.ZkController.createEphemeralLiveNode Register node as live in ZooKeeper:/live_nodes/127.0.0.1:20550_
[junit4] 2> 725030 T2028 oascc.SolrZkClient.makePath makePath: /live_nodes/127.0.0.1:20550_
[junit4] 2> 725033 T2028 oasc.Overseer.close Overseer (id=null) closing
[junit4] 2> 725039 T2099 oasc.ZkController.publish publishing core=collection1 state=down collection=collection1
[junit4] 2> 725040 T2099 oasc.ZkController.publish numShards not found on descriptor - reading it from system property
[junit4] 2> 725041 T2065 oasc.DistributedQueue$LatchChildWatcher.process LatchChildWatcher fired on path: /overseer/queue state: SyncConnected type NodeChildrenChanged
[junit4] 2> 725041 T2099 oasc.ZkController.preRegister Registering watch for external collection collection1
[junit4] 2> 725041 T2099 oascc.ZkStateReader.addZkWatch addZkWatch collection1
[junit4] 2> 725042 T2099 oascc.ZkStateReader.addZkWatch Updating collection state at /collections/collection1/state.json from ZooKeeper...
[junit4] 2> 725043 T2051 oasc.Overseer$ClusterStateUpdater.updateState Update state numShards=1 message={
[junit4] 2> "shard":null,
[junit4] 2> "node_name":"127.0.0.1:20550_",
[junit4] 2> "operation":"state",
[junit4] 2> "roles":null,
[junit4] 2> "collection":"collection1",
[junit4] 2> "state":"down",
[junit4] 2> "numShards":"1",
[junit4] 2> "base_url":"http://127.0.0.1:20550",
[junit4] 2> "core":"collection1"}
[junit4] 2> 725043 T2099 oascc.ZkStateReader.updateWatchedCollection Updating data for collection1 to ver 4
[junit4] 2> 725043 T2099 oasc.ZkController.waitForCoreNodeName look for our core node name
[junit4] 2> 725045 T2051 oasc.Overseer$ClusterStateUpdater.updateState Collection already exists with numShards=1
[junit4] 2> 725045 T2051 oasc.Overseer$ClusterStateUpdater.updateState Assigning new node to shard shard=shard1
[junit4] 2> 725049 T2051 oasc.Overseer$ClusterStateUpdater.updateZkStates going to update_collection /collections/collection1/state.json
[junit4] 2> 725049 T2098 oascc.ZkStateReader$7.process A cluster state change: WatchedEvent state:SyncConnected type:NodeDataChanged path:/collections/collection1/state.json, has occurred - updating...
[junit4] 2> 725049 T2079 oascc.ZkStateReader$7.process A cluster state change: WatchedEvent state:SyncConnected type:NodeDataChanged path:/collections/collection1/state.json, has occurred - updating...
[junit4] 2> 725050 T2098 oascc.ZkStateReader.updateWatchedCollection Updating data for collection1 to ver 5
[junit4] 2> 725050 T2079 oascc.ZkStateReader.updateWatchedCollection Updating data for collection1 to ver 5
[junit4] 2> 726043 T2099 oasc.ZkController.waitForShardId waiting to find shard id in clusterstate for collection1
[junit4] 2> 726044 T2099 oasc.ZkController.createCollectionZkNode Check for collection zkNode:collection1
[junit4] 2> 726044 T2099 oasc.ZkController.createCollectionZkNode Collection zkNode exists
[junit4] 2> 726045 T2099 oascc.ZkStateReader.readConfigName Load collection config from:/collections/collection1
[junit4] 2> 726045 T2099 oascc.ZkStateReader.readConfigName path=/collections/collection1 configName=conf1 specified config exists in ZooKeeper
[junit4] 2> 726045 T2099 oasc.SolrResourceLoader.<init> new SolrResourceLoader for directory: '../../../../../../../../../../../usr/home/jenkins/jenkins-slave/workspace/Lucene-Solr-Tests-trunk-Java7/solr/build/solr-core/test/J1/temp/solr.cloud.ChaosMonkeySafeLeaderTest-71871D6926824D6E-001/tempDir-004/collection1/'
[junit4] 2> 726048 T2099 oasc.SolrResourceLoader.replaceClassLoader Adding 'file:/usr/home/jenkins/jenkins-slave/workspace/Lucene-Solr-Tests-trunk-Java7/solr/build/solr-core/test/J1/temp/solr.cloud.ChaosMonkeySafeLeaderTest-71871D6926824D6E-001/tempDir-004/collection1/lib/classes/' to classloader
[junit4] 2> 726048 T2099 oasc.SolrResourceLoader.replaceClassLoader Adding 'file:/usr/home/jenkins/jenkins-slave/workspace/Lucene-Solr-Tests-trunk-Java7/solr/build/solr-core/test/J1/temp/solr.cloud.ChaosMonkeySafeLeaderTest-71871D6926824D6E-001/tempDir-004/collection1/lib/.svn/' to classloader
[junit4] 2> 726049 T2099 oasc.SolrResourceLoader.replaceClassLoader Adding 'file:/usr/home/jenkins/jenkins-slave/workspace/Lucene-Solr-Tests-trunk-Java7/solr/build/solr-core/test/J1/temp/solr.cloud.ChaosMonkeySafeLeaderTest-71871D6926824D6E-001/tempDir-004/collection1/lib/README' to classloader
[junit4] 2> 726112 T2099 oasc.SolrConfig.<init> Using Lucene MatchVersion: 6.0.0
[junit4] 2> 726159 T2099 oasc.SolrConfig.<init> Loaded SolrConfig: solrconfig.xml
[junit4] 2> 726260 T2099 oass.IndexSchema.readSchema Reading Solr Schema from schema.xml
[junit4] 2> 726270 T2099 oass.IndexSchema.readSchema [collection1] Schema name=test
[junit4] 2> 726623 T2099 oass.IndexSchema.readSchema default search field in schema is text
[junit4] 2> 726627 T2099 oass.IndexSchema.readSchema unique key field: id
[junit4] 2> 726628 T2099 oass.FileExchangeRateProvider.reload Reloading exchange rates from file currency.xml
[junit4] 2> 726633 T2099 oass.FileExchangeRateProvider.reload Reloading exchange rates from file currency.xml
[junit4] 2> 726649 T2099 oasc.CoreContainer.create Creating SolrCore 'collection1' using configuration from collection collection1
[junit4] 2> 726649 T2099 oasc.SolrCore.initDirectoryFactory solr.StandardDirectoryFactory
[junit4] 2> 726650 T2099 oasc.SolrCore.<init> [collection1] Opening new SolrCore at ../../../../../../../../../../../usr/home/jenkins/jenkins-slave/workspace/Lucene-Solr-Tests-trunk-Java7/solr/build/solr-core/test/J1/temp/solr.cloud.ChaosMonkeySafeLeaderTest-71871D6926824D6E-001/tempDir-004/collection1/, dataDir=/usr/home/jenkins/jenkins-slave/workspace/Lucene-Solr-Tests-trunk-Java7/solr/build/solr-core/test/J1/temp/solr.cloud.ChaosMonkeySafeLeaderTest-71871D6926824D6E-001/tempDir-001/jetty2/
[junit4] 2> 726650 T2099 oasc.JmxMonitoredMap.<init> JMX monitoring is enabled. Adding Solr mbeans to JMX Server: com.sun.jmx.mbeanserver.JmxMBeanServer@1a178ca0
[junit4] 2> 726652 T2099 oasc.CachingDirectoryFactory.get return new directory for /usr/home/jenkins/jenkins-slave/workspace/Lucene-Solr-Tests-trunk-Java7/solr/build/solr-core/test/J1/temp/solr.cloud.ChaosMonkeySafeLeaderTest-71871D6926824D6E-001/tempDir-001/jetty2
[junit4] 2> 726652 T2099 oasc.SolrCore.getNewIndexDir New index directory detected: old=null new=/usr/home/jenkins/jenkins-slave/workspace/Lucene-Solr-Tests-trunk-Java7/solr/build/solr-core/test/J1/temp/solr.cloud.ChaosMonkeySafeLeaderTest-71871D6926824D6E-001/tempDir-001/jetty2/index/
[junit4] 2> 726653 T2099 oasc.SolrCore.initIndex WARN [collection1] Solr index directory '/usr/home/jenkins/jenkins-slave/workspace/Lucene-Solr-Tests-trunk-Java7/solr/build/solr-core/test/J1/temp/solr.cloud.ChaosMonkeySafeLeaderTest-71871D6926824D6E-001/tempDir-001/jetty2/index' doesn't exist. Creating new index...
[junit4] 2> 726655 T2099 oasc.CachingDirectoryFactory.get return new directory for /usr/home/jenkins/jenkins-slave/workspace/Lucene-Solr-Tests-trunk-Java7/solr/build/solr-core/test/J1/temp/solr.cloud.ChaosMonkeySafeLeaderTest-71871D6926824D6E-001/tempDir-001/jetty2/index
[junit4] 2> 726655 T2099 oasu.RandomMergePolicy.<init> RandomMergePolicy wrapping class org.apache.lucene.index.LogDocMergePolicy: [LogDocMergePolicy: minMergeSize=1000, mergeFactor=35, maxMergeSize=9223372036854775807, maxMergeSizeForForcedMerge=9223372036854775807, calibrateSizeByDeletes=false, maxMergeDocs=2147483647, maxCFSSegmentSizeMB=8.796093022207999E12, noCFSRatio=0.0]
[junit4] 2> 726660 T2099 oasc.SolrDeletionPolicy.onCommit SolrDeletionPolicy.onCommit: commits: num=1
[junit4] 2> commit{dir=/usr/home/jenkins/jenkins-slave/workspace/Lucene-Solr-Tests-trunk-Java7/solr/build/solr-core/test/J1/temp/solr.cloud.ChaosMonkeySafeLeaderTest-71871D6926824D6E-001/tempDir-001/jetty2/index,segFN=segments_1,generation=1}
[junit4] 2> 726660 T2099 oasc.SolrDeletionPolicy.updateCommits newest commit generation = 1
[junit4] 2> 726665 T2099 oasup.UpdateRequestProcessorChain.init creating updateRequestProcessorChain "nodistrib"
[junit4] 2> 726665 T2099 oasup.UpdateRequestProcessorChain.init creating updateRequestProcessorChain "dedupe"
[junit4] 2> 726665 T2099 oasup.UpdateRequestProcessorChain.init inserting DistributedUpdateProcessorFactory into updateRequestProcessorChain "dedupe"
[junit4] 2> 726666 T2099 oasup.UpdateRequestProcessorChain.init creating updateRequestProcessorChain "stored_sig"
[junit4] 2> 726666 T2099 oasup.UpdateRequestProcessorChain.init inserting DistributedUpdateProcessorFactory into updateRequestProcessorChain "stored_sig"
[junit4] 2> 726666 T2099 oasup.UpdateRequestProcessorChain.init creating updateRequestProcessorChain "distrib-dup-test-chain-explicit"
[junit4] 2> 726667 T2099 oasup.UpdateRequestProcessorChain.init creating updateRequestProcessorChain "distrib-dup-test-chain-implicit"
[junit4] 2> 726667 T2099 oasup.UpdateRequestProcessorChain.init inserting DistributedUpdateProcessorFactory into updateRequestProcessorChain "distrib-dup-test-chain-implicit"
[junit4] 2> 726667 T2099 oasc.SolrCore.loadUpdateProcessorChains no updateRequestProcessorChain defined as default, creating implicit default
[junit4] 2> 726668 T2099 oasc.RequestHandlers.initHandlersFromConfig created /update/json: org.apache.solr.handler.UpdateRequestHandler
[junit4] 2> 726668 T2099 oasc.RequestHandlers.initHandlersFromConfig created /update/json/docs: org.apache.solr.handler.UpdateRequestHandler
[junit4] 2> 726669 T2099 oasc.RequestHandlers.initHandlersFromConfig created /update/csv: org.apache.solr.handler.UpdateRequestHandler
[junit4] 2> 726669 T2099 oasc.RequestHandlers.initHandlersFromConfig created standard: solr.StandardRequestHandler
[junit4] 2> 726670 T2099 oasc.RequestHandlers.initHandlersFromConfig created /get: solr.RealTimeGetHandler
[junit4] 2> 726670 T2099 oasc.RequestHandlers.initHandlersFromConfig adding lazy requestHandler: solr.ReplicationHandler
[junit4] 2> 726671 T2099 oasc.RequestHandlers.initHandlersFromConfig created /replication: solr.ReplicationHandler
[junit4] 2> 726671 T2099 oasc.RequestHandlers.initHandlersFromConfig created /update: solr.UpdateRequestHandler
[junit4] 2> 726671 T2099 oasc.RequestHandlers.initHandlersFromConfig created /admin/: org.apache.solr.handler.admin.AdminHandlers
[junit4] 2> 726672 T2099 oasc.RequestHandlers.initHandlersFromConfig created /admin/file: solr.admin.ShowFileRequestHandler
[junit4] 2> 726672 T2099 oasc.RequestHandlers.initHandlersFromConfig created /admin/fileedit: solr.admin.EditFileRequestHandler
[junit4] 2> 726691 T2099 oashl.XMLLoader.init xsltCacheLifetimeSeconds=60
[junit4] 2> 726693 T2099 oashl.XMLLoader.init xsltCacheLifetimeSeconds=60
[junit4] 2> 726695 T2099 oashl.XMLLoader.init xsltCacheLifetimeSeconds=60
[junit4] 2> 726697 T2099 oashl.XMLLoader.init xsltCacheLifetimeSeconds=60
[junit4] 2> 726700 T2099 oasu.CommitTracker.<init> Hard AutoCommit: disabled
[junit4] 2> 726700 T2099 oasu.CommitTracker.<init> Soft AutoCommit: disabled
[junit4] 2> 726701 T2099 oasu.RandomMergePolicy.<init> RandomMergePolicy wrapping class org.apache.lucene.index.TieredMergePolicy: [TieredMergePolicy: maxMergeAtOnce=30, maxMergeAtOnceExplicit=35, maxMergedSegmentMB=98.1103515625, floorSegmentMB=1.1923828125, forceMergeDeletesPctAllowed=29.172334513895375, segmentsPerTier=27.0, maxCFSSegmentSizeMB=8.796093022207999E12, noCFSRatio=0.42233847442015227
[junit4] 2> 726703 T2099 oasc.SolrDeletionPolicy.onInit SolrDeletionPolicy.onInit: commits: num=1
[junit4] 2> commit{dir=/usr/home/jenkins/jenkins-slave/workspace/Lucene-Solr-Tests-trunk-Java7/solr/build/solr-core/test/J1/temp/solr.cloud.ChaosMonkeySafeLeaderTest-71871D6926824D6E-001/tempDir-001/jetty2/index,segFN=segments_1,generation=1}
[junit4] 2> 726703 T2099 oasc.SolrDeletionPolicy.updateCommits newest commit generation = 1
[junit4] 2> 726703 T2099 oass.SolrIndexSearcher.<init> Opening Searcher@4b78eae4[collection1] main
[junit4] 2> 726704 T2099 oascc.ZkStateReader.readConfigName Load collection config from:/collections/collection1
[junit4] 2> 726705 T2099 oascc.ZkStateReader.readConfigName path=/collections/collection1 configName=conf1 specified config exists in ZooKeeper
[junit4] 2> 726705 T2099 oasr.ManagedResourceStorage.newStorageIO Setting up ZooKeeper-based storage for the RestManager with znodeBase: /configs/conf1
[junit4] 2> 726705 T2099 oasr.ManagedResourceStorage$ZooKeeperStorageIO.configure Configured ZooKeeperStorageIO with znodeBase: /configs/conf1
[junit4] 2> 726705 T2099 oasr.RestManager.init Initializing RestManager with initArgs: {}
[junit4] 2> 726706 T2099 oasr.ManagedResourceStorage.load Reading _rest_managed.json using ZooKeeperStorageIO:path=/configs/conf1
[junit4] 2> 726707 T2099 oasr.ManagedResourceStorage$ZooKeeperStorageIO.openInputStream Read 38 bytes from znode /configs/conf1/_rest_managed.json
[junit4] 2> 726707 T2099 oasr.ManagedResourceStorage.load Loaded LinkedHashMap at path _rest_managed.json using ZooKeeperStorageIO:path=/configs/conf1
[junit4] 2> 726707 T2099 oasr.ManagedResource.reloadFromStorage Loaded initArgs {} for /rest/managed
[junit4] 2> 726707 T2099 oasr.RestManager.init Initializing 0 registered ManagedResources
[junit4] 2> 726711 T2100 oasc.SolrCore.registerSearcher [collection1] Registered new searcher Searcher@4b78eae4[collection1] main{ExitableDirectoryReader(UninvertingDirectoryReader())}
[junit4] 2> 726714 T2099 oasc.CoreContainer.registerCore registering core: collection1
[junit4] 2> 726715 T2103 oasc.ZkController.register Register replica - core:collection1 address:http://127.0.0.1:20550 collection:collection1 shard:shard1
[junit4] 2> 726715 T2028 oass.SolrDispatchFilter.init user.dir=/usr/home/jenkins/jenkins-slave/workspace/Lucene-Solr-Tests-trunk-Java7/solr/build/solr-core/test/J1
[junit4] 2> 726716 T2028 oass.SolrDispatchFilter.init SolrDispatchFilter.init() done
[junit4] 2> 726717 T2103 oasc.ZkController.register We are http://127.0.0.1:20550/collection1/ and leader is http://127.0.0.1:20537/collection1/
[junit4] 2> 726717 T2103 oasc.ZkController.register No LogReplay needed for core=collection1 baseURL=http://127.0.0.1:20550
[junit4] 2> 726718 T2103 oasc.ZkController.checkRecovery Core needs to recover:collection1
[junit4] 2> 726718 T2103 oasu.DefaultSolrCoreState.doRecovery Running recovery - first canceling any ongoing recovery
[junit4] 2> ASYNC NEW_CORE C369 name=collection1 org.apache.solr.core.SolrCore@4a7111ba url=http://127.0.0.1:20550/collection1 node=127.0.0.1:20550_ C369_STATE=coll:collection1 core:collection1 props:{node_name=127.0.0.1:20550_, state=down, base_url=http://127.0.0.1:20550, core=collection1}
[junit4] 2> 726718 T2104 C369 P20550 oasc.RecoveryStrategy.run Starting recovery process. core=collection1 recoveringAfterStartup=true
[junit4] 2> 726719 T2104 C369 P20550 oasc.RecoveryStrategy.doRecovery ###### startupVersions=[]
[junit4] 2> 726719 T2104 C369 P20550 oasc.RecoveryStrategy.doRecovery Publishing state of core collection1 as recovering, leader is http://127.0.0.1:20537/collection1/ and I am http://127.0.0.1:20550/collection1/
[junit4] 2> 726719 T2104 C369 P20550 oasc.ZkController.publish publishing core=collection1 state=recovering collection=collection1
[junit4] 2> 726719 T2104 C369 P20550 oasc.ZkController.publish numShards not found on descriptor - reading it from system property
[junit4] 2> 726721 T2065 oasc.DistributedQueue$LatchChildWatcher.process LatchChildWatcher fired on path: /overseer/queue state: SyncConnected type NodeChildrenChanged
[junit4] 2> 726721 T2103 oascc.ZkStateReader.updateWatchedCollection Updating data for collection1 to ver 5
[junit4] 2> 726721 T2028 oasc.AbstractFullDistribZkTestBase.enableAutoSoftCommit Turning on auto soft commit: 1000
[junit4] 2> 726721 T2104 C369 P20550 oasc.RecoveryStrategy.sendPrepRecoveryCmd Sending prep recovery command to http://127.0.0.1:20537; WaitForState: action=PREPRECOVERY&core=collection1&nodeName=127.0.0.1%3A20550_&coreNodeName=core_node2&state=recovering&checkLive=true&onlyIfLeader=true&onlyIfLeaderActive=true
[junit4] 2> 726723 T2068 oasha.CoreAdminHandler.handleWaitForStateAction Going to wait for coreNodeName: core_node2, state: recovering, checkLive: true, onlyIfLeader: true, onlyIfLeaderActive: true
[junit4] 2> 726724 T2051 oasc.Overseer$ClusterStateUpdater.updateState Update state numShards=1 message={
[junit4] 2> "shard":"shard1",
[junit4] 2> "node_name":"127.0.0.1:20550_",
[junit4] 2> "operation":"state",
[junit4] 2> "roles":null,
[junit4] 2> "collection":"collection1",
[junit4] 2> "state":"recovering",
[junit4] 2> "numShards":"1",
[junit4] 2> "base_url":"http://127.0.0.1:20550",
[junit4] 2> "core_node_name":"core_node2",
[junit4] 2> "core":"collection1"}
[junit4] 2> 726726 T2068 oascc.ZkStateReader.updateWatchedCollection Updating data for collection1 to ver 5
[junit4] 2> 726726 T2068 oasha.CoreAdminHandler.handleWaitForStateAction Will wait a max of 183 seconds to see collection1 (shard1 of collection1) have state: recovering
[junit4] 2> 726727 T2068 oasha.CoreAdminHandler.handleWaitForStateAction In WaitForState(recovering): collection=collection1, shard=shard1, thisCore=collection1, leaderDoesNotNeedRecovery=false, isLeader? true, live=true, checkLive=true, currentState=down, localState=active, nodeName=127.0.0.1:20550_, coreNodeName=core_node2, onlyIfActiveCheckResult=false, nodeProps: core_node2:{"node_name":"127.0.0.1:20550_","state":"down","base_url":"http://127.0.0.1:20550","core":"collection1"}
[junit4] 2> ASYNC NEW_CORE C370 name=collection1 org.apache.solr.core.S
[...truncated too long message...]
nit4] 2> at java.net.AbstractPlainSocketImpl.connect(AbstractPlainSocketImpl.java:182)
[junit4] 2> at java.net.SocksSocketImpl.connect(SocksSocketImpl.java:392)
[junit4] 2> at java.net.Socket.connect(Socket.java:579)
[junit4] 2> at java.net.Socket.connect(Socket.java:528)
[junit4] 2> at sun.net.NetworkClient.doConnect(NetworkClient.java:180)
[junit4] 2> at sun.net.www.http.HttpClient.openServer(HttpClient.java:432)
[junit4] 2> at sun.net.www.http.HttpClient.openServer(HttpClient.java:527)
[junit4] 2> at sun.net.www.http.HttpClient.parseHTTP(HttpClient.java:652)
[junit4] 2> at sun.net.www.protocol.http.HttpURLConnection.getInputStream(HttpURLConnection.java:1323)
[junit4] 2> at java.net.URL.openStream(URL.java:1037)
[junit4] 2> at org.apache.solr.handler.TestReplicationHandlerBackup$BackupThread.run(TestReplicationHandlerBackup.java:318)
[junit4] 2> 27345 T10338 ccr.ThreadLeakControl.tryToInterruptAll Starting to interrupt leaked threads:
[junit4] 2> 1) Thread[id=10359, name=Thread-3034, state=RUNNABLE, group=TGRP-TestReplicationHandlerBackup]
[junit4] 2> 30353 T10338 ccr.ThreadLeakControl.tryToInterruptAll SEVERE There are still zombie threads that couldn't be terminated:
[junit4] 2> 1) Thread[id=10359, name=Thread-3034, state=RUNNABLE, group=TGRP-TestReplicationHandlerBackup]
[junit4] 2> at java.net.PlainSocketImpl.socketConnect(Native Method)
[junit4] 2> at java.net.AbstractPlainSocketImpl.doConnect(AbstractPlainSocketImpl.java:339)
[junit4] 2> at java.net.AbstractPlainSocketImpl.connectToAddress(AbstractPlainSocketImpl.java:200)
[junit4] 2> at java.net.AbstractPlainSocketImpl.connect(AbstractPlainSocketImpl.java:182)
[junit4] 2> at java.net.SocksSocketImpl.connect(SocksSocketImpl.java:392)
[junit4] 2> at java.net.Socket.connect(Socket.java:579)
[junit4] 2> at java.net.Socket.connect(Socket.java:528)
[junit4] 2> at sun.net.NetworkClient.doConnect(NetworkClient.java:180)
[junit4] 2> at sun.net.www.http.HttpClient.openServer(HttpClient.java:432)
[junit4] 2> at sun.net.www.http.HttpClient.openServer(HttpClient.java:527)
[junit4] 2> at sun.net.www.http.HttpClient.parseHTTP(HttpClient.java:652)
[junit4] 2> at sun.net.www.protocol.http.HttpURLConnection.getInputStream(HttpURLConnection.java:1323)
[junit4] 2> at java.net.URL.openStream(URL.java:1037)
[junit4] 2> at org.apache.solr.handler.TestReplicationHandlerBackup$BackupThread.run(TestReplicationHandlerBackup.java:318)
[junit4] 2> NOTE: test params are: codec=Asserting(Lucene50), sim=RandomSimilarityProvider(queryNorm=false,coord=crazy): {}, locale=ar_DZ, timezone=Australia/Adelaide
[junit4] 2> NOTE: FreeBSD 9.1-RELEASE-p3 amd64/Oracle Corporation 1.7.0_65 (64-bit)/cpus=16,threads=2,free=112273856,total=476053504
[junit4] 2> NOTE: All tests run in this JVM: [MultiTermTest, TestSolrQueryParserResource, ShardSplitTest, LegacyHTMLStripCharFilterTest, RAMDirectoryFactoryTest, XsltUpdateRequestHandlerTest, TestStressRecovery, TestQuerySenderListener, TestManagedResourceStorage, RegexBoostProcessorTest, AliasIntegrationTest, TestHashPartitioner, OverseerStatusTest, TestSearcherReuse, StatsComponentTest, SpellCheckCollatorTest, TestReplicationHandler, LeaderInitiatedRecoveryOnCommitTest, TestRemoteStreaming, NumericFieldsTest, TestMultiCoreConfBootstrap, TestLuceneMatchVersion, TestSurroundQueryParser, TestMissingGroups, TestUpdate, DefaultValueUpdateProcessorTest, TestSolrQueryParser, TestOmitPositions, HdfsChaosMonkeySafeLeaderTest, TestPerFieldSimilarity, TestSortingResponseWriter, TestManagedStopFilterFactory, TestReversedWildcardFilterFactory, DistributedFacetPivotLongTailTest, OutOfBoxZkACLAndCredentialsProvidersTest, ModifyConfFileTest, BJQParserTest, XmlUpdateRequestHandlerTest, BinaryUpdateRequestHandlerTest, TestQueryUtils, TestSolr4Spatial, IndexSchemaTest, TestIndexingPerformance, SyncSliceTest, QueryParsingTest, ZkNodePropsTest, DocValuesTest, OpenExchangeRatesOrgProviderTest, TestManagedSynonymFilterFactory, TestElisionMultitermQuery, HighlighterTest, TestDistributedSearch, OverriddenZkACLAndCredentialsProvidersTest, OverseerRolesTest, RemoteQueryErrorTest, TestCollectionAPI, TestShortCircuitedRequests, QueryResultKeyTest, TestConfigSets, TestInfoStreamLogging, TestNRTOpen, TestSolrXml, TestSolrXmlPersistor, TestReplicationHandlerBackup]
[junit4] 2> NOTE: reproduce with: ant test -Dtestcase=TestReplicationHandlerBackup -Dtests.seed=71871D6926824D6E -Dtests.multiplier=2 -Dtests.slow=true -Dtests.locale=ar_DZ -Dtests.timezone=Australia/Adelaide -Dtests.file.encoding=US-ASCII
[junit4] ERROR 0.00s J2 | TestReplicationHandlerBackup (suite) <<<
[junit4] > Throwable #1: com.carrotsearch.randomizedtesting.ThreadLeakError: 1 thread leaked from SUITE scope at org.apache.solr.handler.TestReplicationHandlerBackup:
[junit4] > 1) Thread[id=10359, name=Thread-3034, state=RUNNABLE, group=TGRP-TestReplicationHandlerBackup]
[junit4] > at java.net.PlainSocketImpl.socketConnect(Native Method)
[junit4] > at java.net.AbstractPlainSocketImpl.doConnect(AbstractPlainSocketImpl.java:339)
[junit4] > at java.net.AbstractPlainSocketImpl.connectToAddress(AbstractPlainSocketImpl.java:200)
[junit4] > at java.net.AbstractPlainSocketImpl.connect(AbstractPlainSocketImpl.java:182)
[junit4] > at java.net.SocksSocketImpl.connect(SocksSocketImpl.java:392)
[junit4] > at java.net.Socket.connect(Socket.java:579)
[junit4] > at java.net.Socket.connect(Socket.java:528)
[junit4] > at sun.net.NetworkClient.doConnect(NetworkClient.java:180)
[junit4] > at sun.net.www.http.HttpClient.openServer(HttpClient.java:432)
[junit4] > at sun.net.www.http.HttpClient.openServer(HttpClient.java:527)
[junit4] > at sun.net.www.http.HttpClient.parseHTTP(HttpClient.java:652)
[junit4] > at sun.net.www.protocol.http.HttpURLConnection.getInputStream(HttpURLConnection.java:1323)
[junit4] > at java.net.URL.openStream(URL.java:1037)
[junit4] > at org.apache.solr.handler.TestReplicationHandlerBackup$BackupThread.run(TestReplicationHandlerBackup.java:318)
[junit4] > at __randomizedtesting.SeedInfo.seed([71871D6926824D6E]:0)Throwable #2: com.carrotsearch.randomizedtesting.ThreadLeakError: There are still zombie threads that couldn't be terminated:
[junit4] > 1) Thread[id=10359, name=Thread-3034, state=RUNNABLE, group=TGRP-TestReplicationHandlerBackup]
[junit4] > at java.net.PlainSocketImpl.socketConnect(Native Method)
[junit4] > at java.net.AbstractPlainSocketImpl.doConnect(AbstractPlainSocketImpl.java:339)
[junit4] > at java.net.AbstractPlainSocketImpl.connectToAddress(AbstractPlainSocketImpl.java:200)
[junit4] > at java.net.AbstractPlainSocketImpl.connect(AbstractPlainSocketImpl.java:182)
[junit4] > at java.net.SocksSocketImpl.connect(SocksSocketImpl.java:392)
[junit4] > at java.net.Socket.connect(Socket.java:579)
[junit4] > at java.net.Socket.connect(Socket.java:528)
[junit4] > at sun.net.NetworkClient.doConnect(NetworkClient.java:180)
[junit4] > at sun.net.www.http.HttpClient.openServer(HttpClient.java:432)
[junit4] > at sun.net.www.http.HttpClient.openServer(HttpClient.java:527)
[junit4] > at sun.net.www.http.HttpClient.parseHTTP(HttpClient.java:652)
[junit4] > at sun.net.www.protocol.http.HttpURLConnection.getInputStream(HttpURLConnection.java:1323)
[junit4] > at java.net.URL.openStream(URL.java:1037)
[junit4] > at org.apache.solr.handler.TestReplicationHandlerBackup$BackupThread.run(TestReplicationHandlerBackup.java:318)
[junit4] > at __randomizedtesting.SeedInfo.seed([71871D6926824D6E]:0)
[junit4] Completed on J2 in 30.41s, 1 test, 2 errors <<< FAILURES!
[...truncated 174 lines...]
BUILD FAILED
/usr/home/jenkins/jenkins-slave/workspace/Lucene-Solr-Tests-trunk-Java7/build.xml:524: The following error occurred while executing this line:
/usr/home/jenkins/jenkins-slave/workspace/Lucene-Solr-Tests-trunk-Java7/build.xml:472: The following error occurred while executing this line:
/usr/home/jenkins/jenkins-slave/workspace/Lucene-Solr-Tests-trunk-Java7/build.xml:61: The following error occurred while executing this line:
/usr/home/jenkins/jenkins-slave/workspace/Lucene-Solr-Tests-trunk-Java7/extra-targets.xml:39: The following error occurred while executing this line:
/usr/home/jenkins/jenkins-slave/workspace/Lucene-Solr-Tests-trunk-Java7/solr/build.xml:189: The following error occurred while executing this line:
/usr/home/jenkins/jenkins-slave/workspace/Lucene-Solr-Tests-trunk-Java7/solr/common-build.xml:496: The following error occurred while executing this line:
/usr/home/jenkins/jenkins-slave/workspace/Lucene-Solr-Tests-trunk-Java7/lucene/common-build.xml:1359: The following error occurred while executing this line:
/usr/home/jenkins/jenkins-slave/workspace/Lucene-Solr-Tests-trunk-Java7/lucene/common-build.xml:961: There were test failures: 436 suites, 1783 tests, 2 suite-level errors, 1 failure, 243 ignored (23 assumptions)
Total time: 62 minutes 23 seconds
Build step 'Invoke Ant' marked build as failure
Archiving artifacts
Sending artifact delta relative to Lucene-Solr-Tests-trunk-Java7 #4905
Archived 5 artifacts
Archive block size is 32768
Received 0 blocks and 166075692 bytes
Compression is 0.0%
Took 30 sec
Recording test results
Email was triggered for: Failure
Sending email for trigger: Failure
[JENKINS] Lucene-Solr-Tests-trunk-Java7 - Build # 4908 - Still
Failing
Posted by Apache Jenkins Server <je...@builds.apache.org>.
Build: https://builds.apache.org/job/Lucene-Solr-Tests-trunk-Java7/4908/
1 tests failed.
REGRESSION: org.apache.solr.TestDistributedGrouping.testDistribSearch
Error Message:
Request took too long during query expansion. Terminating request.
Stack Trace:
org.apache.solr.client.solrj.impl.HttpSolrServer$RemoteSolrException: Request took too long during query expansion. Terminating request.
at __randomizedtesting.SeedInfo.seed([CA31735E47096E95:4BD7FD4630560EA9]:0)
at org.apache.solr.client.solrj.impl.HttpSolrServer.executeMethod(HttpSolrServer.java:570)
at org.apache.solr.client.solrj.impl.HttpSolrServer.request(HttpSolrServer.java:215)
at org.apache.solr.client.solrj.impl.HttpSolrServer.request(HttpSolrServer.java:211)
at org.apache.solr.client.solrj.request.QueryRequest.process(QueryRequest.java:91)
at org.apache.solr.client.solrj.SolrServer.query(SolrServer.java:301)
at org.apache.solr.BaseDistributedSearchTestCase.queryServer(BaseDistributedSearchTestCase.java:512)
at org.apache.solr.TestDistributedGrouping.simpleQuery(TestDistributedGrouping.java:274)
at org.apache.solr.TestDistributedGrouping.doTest(TestDistributedGrouping.java:262)
at org.apache.solr.BaseDistributedSearchTestCase.testDistribSearch(BaseDistributedSearchTestCase.java:875)
at sun.reflect.NativeMethodAccessorImpl.invoke0(Native Method)
at sun.reflect.NativeMethodAccessorImpl.invoke(NativeMethodAccessorImpl.java:57)
at sun.reflect.DelegatingMethodAccessorImpl.invoke(DelegatingMethodAccessorImpl.java:43)
at java.lang.reflect.Method.invoke(Method.java:606)
at com.carrotsearch.randomizedtesting.RandomizedRunner.invoke(RandomizedRunner.java:1618)
at com.carrotsearch.randomizedtesting.RandomizedRunner$6.evaluate(RandomizedRunner.java:827)
at com.carrotsearch.randomizedtesting.RandomizedRunner$7.evaluate(RandomizedRunner.java:863)
at com.carrotsearch.randomizedtesting.RandomizedRunner$8.evaluate(RandomizedRunner.java:877)
at com.carrotsearch.randomizedtesting.rules.SystemPropertiesRestoreRule$1.evaluate(SystemPropertiesRestoreRule.java:53)
at org.apache.lucene.util.TestRuleSetupTeardownChained$1.evaluate(TestRuleSetupTeardownChained.java:50)
at org.apache.lucene.util.AbstractBeforeAfterRule$1.evaluate(AbstractBeforeAfterRule.java:46)
at com.carrotsearch.randomizedtesting.rules.SystemPropertiesInvariantRule$1.evaluate(SystemPropertiesInvariantRule.java:55)
at org.apache.lucene.util.TestRuleThreadAndTestName$1.evaluate(TestRuleThreadAndTestName.java:49)
at org.apache.lucene.util.TestRuleIgnoreAfterMaxFailures$1.evaluate(TestRuleIgnoreAfterMaxFailures.java:65)
at org.apache.lucene.util.TestRuleMarkFailure$1.evaluate(TestRuleMarkFailure.java:48)
at com.carrotsearch.randomizedtesting.rules.StatementAdapter.evaluate(StatementAdapter.java:36)
at com.carrotsearch.randomizedtesting.ThreadLeakControl$StatementRunner.run(ThreadLeakControl.java:365)
at com.carrotsearch.randomizedtesting.ThreadLeakControl.forkTimeoutingTask(ThreadLeakControl.java:798)
at com.carrotsearch.randomizedtesting.ThreadLeakControl$3.evaluate(ThreadLeakControl.java:458)
at com.carrotsearch.randomizedtesting.RandomizedRunner.runSingleTest(RandomizedRunner.java:836)
at com.carrotsearch.randomizedtesting.RandomizedRunner$3.evaluate(RandomizedRunner.java:738)
at com.carrotsearch.randomizedtesting.RandomizedRunner$4.evaluate(RandomizedRunner.java:772)
at com.carrotsearch.randomizedtesting.RandomizedRunner$5.evaluate(RandomizedRunner.java:783)
at com.carrotsearch.randomizedtesting.rules.StatementAdapter.evaluate(StatementAdapter.java:36)
at com.carrotsearch.randomizedtesting.rules.SystemPropertiesRestoreRule$1.evaluate(SystemPropertiesRestoreRule.java:53)
at org.apache.lucene.util.AbstractBeforeAfterRule$1.evaluate(AbstractBeforeAfterRule.java:46)
at org.apache.lucene.util.TestRuleStoreClassName$1.evaluate(TestRuleStoreClassName.java:42)
at com.carrotsearch.randomizedtesting.rules.SystemPropertiesInvariantRule$1.evaluate(SystemPropertiesInvariantRule.java:55)
at com.carrotsearch.randomizedtesting.rules.NoShadowingOrOverridesOnMethodsRule$1.evaluate(NoShadowingOrOverridesOnMethodsRule.java:39)
at com.carrotsearch.randomizedtesting.rules.NoShadowingOrOverridesOnMethodsRule$1.evaluate(NoShadowingOrOverridesOnMethodsRule.java:39)
at com.carrotsearch.randomizedtesting.rules.StatementAdapter.evaluate(StatementAdapter.java:36)
at com.carrotsearch.randomizedtesting.rules.StatementAdapter.evaluate(StatementAdapter.java:36)
at com.carrotsearch.randomizedtesting.rules.StatementAdapter.evaluate(StatementAdapter.java:36)
at org.apache.lucene.util.TestRuleAssertionsRequired$1.evaluate(TestRuleAssertionsRequired.java:43)
at org.apache.lucene.util.TestRuleMarkFailure$1.evaluate(TestRuleMarkFailure.java:48)
at org.apache.lucene.util.TestRuleIgnoreAfterMaxFailures$1.evaluate(TestRuleIgnoreAfterMaxFailures.java:65)
at org.apache.lucene.util.TestRuleIgnoreTestSuites$1.evaluate(TestRuleIgnoreTestSuites.java:55)
at com.carrotsearch.randomizedtesting.rules.StatementAdapter.evaluate(StatementAdapter.java:36)
at com.carrotsearch.randomizedtesting.ThreadLeakControl$StatementRunner.run(ThreadLeakControl.java:365)
at java.lang.Thread.run(Thread.java:745)
Build Log:
[...truncated 11095 lines...]
[junit4] Suite: org.apache.solr.TestDistributedGrouping
[junit4] 2> Creating dataDir: /usr/home/jenkins/jenkins-slave/workspace/Lucene-Solr-Tests-trunk-Java7/solr/build/solr-core/test/J3/temp/solr.TestDistributedGrouping-CA31735E47096E95-001/init-core-data-001
[junit4] 2> 571244 T1383 oas.SolrTestCaseJ4.buildSSLConfig Randomized ssl (false) and clientAuth (true)
[junit4] 2> 571244 T1383 oas.BaseDistributedSearchTestCase.initHostContext Setting hostContext system property: /
[junit4] 2> 571249 T1383 oas.SolrTestCaseJ4.setUp ###Starting testDistribSearch
[junit4] 2> 571251 T1383 oejs.Server.doStart jetty-8.1.10.v20130312
[junit4] 2> 571259 T1383 oejs.AbstractConnector.doStart Started SocketConnector@127.0.0.1:17500
[junit4] 2> 571260 T1383 oass.SolrDispatchFilter.init SolrDispatchFilter.init()
[junit4] 2> 571260 T1383 oasc.SolrResourceLoader.locateSolrHome JNDI not configured for solr (NoInitialContextEx)
[junit4] 2> 571260 T1383 oasc.SolrResourceLoader.locateSolrHome using system property solr.solr.home: /usr/home/jenkins/jenkins-slave/workspace/Lucene-Solr-Tests-trunk-Java7/solr/core/src/test-files/solr
[junit4] 2> 571261 T1383 oasc.SolrResourceLoader.<init> new SolrResourceLoader for directory: '/usr/home/jenkins/jenkins-slave/workspace/Lucene-Solr-Tests-trunk-Java7/solr/core/src/test-files/solr/'
[junit4] 2> 571277 T1383 oasc.ConfigSolr.fromFile Loading container configuration from /usr/home/jenkins/jenkins-slave/workspace/Lucene-Solr-Tests-trunk-Java7/solr/core/src/test-files/solr/solr.xml
[junit4] 2> 571340 T1383 oasc.CoreContainer.<init> New CoreContainer 1025963012
[junit4] 2> 571341 T1383 oasc.CoreContainer.load Loading cores into CoreContainer [instanceDir=/usr/home/jenkins/jenkins-slave/workspace/Lucene-Solr-Tests-trunk-Java7/solr/core/src/test-files/solr/]
[junit4] 2> 571342 T1383 oashc.HttpShardHandlerFactory.getParameter Setting socketTimeout to: 90000
[junit4] 2> 571343 T1383 oashc.HttpShardHandlerFactory.getParameter Setting urlScheme to:
[junit4] 2> 571343 T1383 oashc.HttpShardHandlerFactory.getParameter Setting connTimeout to: 15000
[junit4] 2> 571344 T1383 oashc.HttpShardHandlerFactory.getParameter Setting maxConnectionsPerHost to: 20
[junit4] 2> 571344 T1383 oashc.HttpShardHandlerFactory.getParameter Setting corePoolSize to: 0
[junit4] 2> 571344 T1383 oashc.HttpShardHandlerFactory.getParameter Setting maximumPoolSize to: 2147483647
[junit4] 2> 571345 T1383 oashc.HttpShardHandlerFactory.getParameter Setting maxThreadIdleTime to: 5
[junit4] 2> 571345 T1383 oashc.HttpShardHandlerFactory.getParameter Setting sizeOfQueue to: -1
[junit4] 2> 571346 T1383 oashc.HttpShardHandlerFactory.getParameter Setting fairnessPolicy to: false
[junit4] 2> 571347 T1383 oasu.UpdateShardHandler.<init> Creating UpdateShardHandler HTTP client with params: socketTimeout=340000&connTimeout=45000&retry=false
[junit4] 2> 571347 T1383 oasl.LogWatcher.createWatcher SLF4J impl is org.slf4j.impl.Log4jLoggerFactory
[junit4] 2> 571347 T1383 oasl.LogWatcher.newRegisteredLogWatcher Registering Log Listener [Log4j (org.slf4j.impl.Log4jLoggerFactory)]
[junit4] 2> 571348 T1383 oasc.CoreContainer.load Host Name: 127.0.0.1
[junit4] 2> 571353 T1393 oasc.SolrResourceLoader.<init> new SolrResourceLoader for directory: '/usr/home/jenkins/jenkins-slave/workspace/Lucene-Solr-Tests-trunk-Java7/solr/core/src/test-files/solr/collection1/'
[junit4] 2> 571355 T1393 oasc.SolrResourceLoader.replaceClassLoader Adding 'file:/usr/home/jenkins/jenkins-slave/workspace/Lucene-Solr-Tests-trunk-Java7/solr/core/src/test-files/solr/collection1/lib/README' to classloader
[junit4] 2> 571355 T1393 oasc.SolrResourceLoader.replaceClassLoader Adding 'file:/usr/home/jenkins/jenkins-slave/workspace/Lucene-Solr-Tests-trunk-Java7/solr/core/src/test-files/solr/collection1/lib/.svn/' to classloader
[junit4] 2> 571356 T1393 oasc.SolrResourceLoader.replaceClassLoader Adding 'file:/usr/home/jenkins/jenkins-slave/workspace/Lucene-Solr-Tests-trunk-Java7/solr/core/src/test-files/solr/collection1/lib/classes/' to classloader
[junit4] 2> 571470 T1393 oasc.SolrConfig.<init> Using Lucene MatchVersion: 6.0.0
[junit4] 2> 571537 T1393 oasc.SolrConfig.<init> Loaded SolrConfig: solrconfig.xml
[junit4] 2> 571538 T1393 oass.IndexSchema.readSchema Reading Solr Schema from schema.xml
[junit4] 2> 571550 T1393 oass.IndexSchema.readSchema [collection1] Schema name=test
[junit4] 2> 571901 T1393 oass.OpenExchangeRatesOrgProvider.init Initialized with rates=open-exchange-rates.json, refreshInterval=1440.
[junit4] 2> 571915 T1393 oass.IndexSchema.readSchema default search field in schema is text
[junit4] 2> 571917 T1393 oass.IndexSchema.readSchema unique key field: id
[junit4] 2> 571934 T1393 oass.FileExchangeRateProvider.reload Reloading exchange rates from file currency.xml
[junit4] 2> 571939 T1393 oass.FileExchangeRateProvider.reload Reloading exchange rates from file currency.xml
[junit4] 2> 571943 T1393 oass.OpenExchangeRatesOrgProvider.reload Reloading exchange rates from open-exchange-rates.json
[junit4] 2> 571944 T1393 oass.OpenExchangeRatesOrgProvider$OpenExchangeRates.<init> WARN Unknown key IMPORTANT NOTE
[junit4] 2> 571945 T1393 oass.OpenExchangeRatesOrgProvider$OpenExchangeRates.<init> WARN Expected key, got STRING
[junit4] 2> 571945 T1393 oass.OpenExchangeRatesOrgProvider.reload Reloading exchange rates from open-exchange-rates.json
[junit4] 2> 571946 T1393 oass.OpenExchangeRatesOrgProvider$OpenExchangeRates.<init> WARN Unknown key IMPORTANT NOTE
[junit4] 2> 571946 T1393 oass.OpenExchangeRatesOrgProvider$OpenExchangeRates.<init> WARN Expected key, got STRING
[junit4] 2> 571947 T1393 oasc.CoreContainer.create Creating SolrCore 'collection1' using configuration from instancedir /usr/home/jenkins/jenkins-slave/workspace/Lucene-Solr-Tests-trunk-Java7/solr/core/src/test-files/solr/collection1/
[junit4] 2> 571947 T1393 oasc.SolrCore.initDirectoryFactory org.apache.solr.core.MockDirectoryFactory
[junit4] 2> 571947 T1393 oasc.SolrCore.<init> [collection1] Opening new SolrCore at /usr/home/jenkins/jenkins-slave/workspace/Lucene-Solr-Tests-trunk-Java7/solr/core/src/test-files/solr/collection1/, dataDir=/usr/home/jenkins/jenkins-slave/workspace/Lucene-Solr-Tests-trunk-Java7/solr/build/solr-core/test/J3/temp/solr.TestDistributedGrouping-CA31735E47096E95-001/tempDir-001/control/data/
[junit4] 2> 571948 T1393 oasc.JmxMonitoredMap.<init> JMX monitoring is enabled. Adding Solr mbeans to JMX Server: com.sun.jmx.mbeanserver.JmxMBeanServer@11d36c3b
[junit4] 2> 571949 T1393 oasc.CachingDirectoryFactory.get return new directory for /usr/home/jenkins/jenkins-slave/workspace/Lucene-Solr-Tests-trunk-Java7/solr/build/solr-core/test/J3/temp/solr.TestDistributedGrouping-CA31735E47096E95-001/tempDir-001/control/data
[junit4] 2> 571949 T1393 oasc.SolrCore.getNewIndexDir New index directory detected: old=null new=/usr/home/jenkins/jenkins-slave/workspace/Lucene-Solr-Tests-trunk-Java7/solr/build/solr-core/test/J3/temp/solr.TestDistributedGrouping-CA31735E47096E95-001/tempDir-001/control/data/index/
[junit4] 2> 571949 T1393 oasc.SolrCore.initIndex WARN [collection1] Solr index directory '/usr/home/jenkins/jenkins-slave/workspace/Lucene-Solr-Tests-trunk-Java7/solr/build/solr-core/test/J3/temp/solr.TestDistributedGrouping-CA31735E47096E95-001/tempDir-001/control/data/index' doesn't exist. Creating new index...
[junit4] 2> 571951 T1393 oasc.CachingDirectoryFactory.get return new directory for /usr/home/jenkins/jenkins-slave/workspace/Lucene-Solr-Tests-trunk-Java7/solr/build/solr-core/test/J3/temp/solr.TestDistributedGrouping-CA31735E47096E95-001/tempDir-001/control/data/index
[junit4] 2> 571952 T1393 oasu.RandomMergePolicy.<init> RandomMergePolicy wrapping class org.apache.lucene.index.LogByteSizeMergePolicy: [LogByteSizeMergePolicy: minMergeSize=1677721, mergeFactor=23, maxMergeSize=2147483648, maxMergeSizeForForcedMerge=9223372036854775807, calibrateSizeByDeletes=false, maxMergeDocs=2147483647, maxCFSSegmentSizeMB=8.796093022207999E12, noCFSRatio=0.5141052219006201]
[junit4] 2> 571957 T1393 oasc.SolrDeletionPolicy.onCommit SolrDeletionPolicy.onCommit: commits: num=1
[junit4] 2> commit{dir=RateLimitedDirectoryWrapper(MockDirectoryWrapper(MMapDirectory@/usr/home/jenkins/jenkins-slave/workspace/Lucene-Solr-Tests-trunk-Java7/solr/build/solr-core/test/J3/temp/solr.TestDistributedGrouping-CA31735E47096E95-001/index-MMapDirectory-001 lockFactory=NativeFSLockFactory@/usr/home/jenkins/jenkins-slave/workspace/Lucene-Solr-Tests-trunk-Java7/solr/build/solr-core/test/J3/temp/solr.TestDistributedGrouping-CA31735E47096E95-001/index-MMapDirectory-001)),segFN=segments_1,generation=1}
[junit4] 2> 571957 T1393 oasc.SolrDeletionPolicy.updateCommits newest commit generation = 1
[junit4] 2> 571958 T1393 oasc.SolrCore.initWriters created xml: solr.XMLResponseWriter
[junit4] 2> 571963 T1393 oasup.UpdateRequestProcessorChain.init creating updateRequestProcessorChain "dedupe"
[junit4] 2> 571964 T1393 oasup.UpdateRequestProcessorChain.init inserting DistributedUpdateProcessorFactory into updateRequestProcessorChain "dedupe"
[junit4] 2> 571964 T1393 oasup.UpdateRequestProcessorChain.init creating updateRequestProcessorChain "dedupe-allfields"
[junit4] 2> 571964 T1393 oasup.UpdateRequestProcessorChain.init inserting DistributedUpdateProcessorFactory into updateRequestProcessorChain "dedupe-allfields"
[junit4] 2> 571965 T1393 oasup.UpdateRequestProcessorChain.init creating updateRequestProcessorChain "stored_sig"
[junit4] 2> 571965 T1393 oasup.UpdateRequestProcessorChain.init inserting DistributedUpdateProcessorFactory into updateRequestProcessorChain "stored_sig"
[junit4] 2> 571965 T1393 oasup.UpdateRequestProcessorChain.init creating updateRequestProcessorChain "uniq-fields"
[junit4] 2> 571966 T1393 oasup.UpdateRequestProcessorChain.init inserting DistributedUpdateProcessorFactory into updateRequestProcessorChain "uniq-fields"
[junit4] 2> 571966 T1393 oasup.UpdateRequestProcessorChain.init creating updateRequestProcessorChain "distrib-dup-test-chain-explicit"
[junit4] 2> 571967 T1393 oasup.UpdateRequestProcessorChain.init creating updateRequestProcessorChain "distrib-dup-test-chain-implicit"
[junit4] 2> 571967 T1393 oasup.UpdateRequestProcessorChain.init inserting DistributedUpdateProcessorFactory into updateRequestProcessorChain "distrib-dup-test-chain-implicit"
[junit4] 2> 571967 T1393 oasc.SolrCore.loadUpdateProcessorChains no updateRequestProcessorChain defined as default, creating implicit default
[junit4] 2> 571968 T1393 oasc.RequestHandlers.initHandlersFromConfig created /update/json/docs: org.apache.solr.handler.UpdateRequestHandler
[junit4] 2> 571969 T1393 oasc.RequestHandlers.initHandlersFromConfig created /update/csv: org.apache.solr.handler.UpdateRequestHandler
[junit4] 2> 571969 T1393 oasc.RequestHandlers.initHandlersFromConfig created /update/json: org.apache.solr.handler.UpdateRequestHandler
[junit4] 2> 571970 T1393 oasc.RequestHandlers.initHandlersFromConfig adding lazy requestHandler: solr.ReplicationHandler
[junit4] 2> 571970 T1393 oasc.RequestHandlers.initHandlersFromConfig created /replication: solr.ReplicationHandler
[junit4] 2> 571971 T1393 oasc.RequestHandlers.initHandlersFromConfig created standard: solr.StandardRequestHandler
[junit4] 2> 571971 T1393 oasc.RequestHandlers.initHandlersFromConfig created /get: solr.RealTimeGetHandler
[junit4] 2> 571972 T1393 oasc.RequestHandlers.initHandlersFromConfig created dismax: solr.SearchHandler
[junit4] 2> 571972 T1393 oasc.RequestHandlers.initHandlersFromConfig created mock: org.apache.solr.core.MockQuerySenderListenerReqHandler
[junit4] 2> 571973 T1393 oasc.RequestHandlers.initHandlersFromConfig created /admin/: org.apache.solr.handler.admin.AdminHandlers
[junit4] 2> 571973 T1393 oasc.RequestHandlers.initHandlersFromConfig created /admin/file: solr.admin.ShowFileRequestHandler
[junit4] 2> 571974 T1393 oasc.RequestHandlers.initHandlersFromConfig created /admin/fileedit: solr.admin.EditFileRequestHandler
[junit4] 2> 571974 T1393 oasc.RequestHandlers.initHandlersFromConfig created defaults: solr.StandardRequestHandler
[junit4] 2> 571975 T1393 oasc.RequestHandlers.initHandlersFromConfig adding lazy requestHandler: solr.StandardRequestHandler
[junit4] 2> 571975 T1393 oasc.RequestHandlers.initHandlersFromConfig created lazy: solr.StandardRequestHandler
[junit4] 2> 571976 T1393 oasc.RequestHandlers.initHandlersFromConfig created /update: solr.UpdateRequestHandler
[junit4] 2> 571976 T1393 oasc.RequestHandlers.initHandlersFromConfig created /terms: org.apache.solr.handler.component.SearchHandler
[junit4] 2> 571977 T1393 oasc.RequestHandlers.initHandlersFromConfig created spellCheckCompRH: org.apache.solr.handler.component.SearchHandler
[junit4] 2> 571977 T1393 oasc.RequestHandlers.initHandlersFromConfig created spellCheckCompRH_Direct: org.apache.solr.handler.component.SearchHandler
[junit4] 2> 571978 T1393 oasc.RequestHandlers.initHandlersFromConfig created spellCheckWithWordbreak: org.apache.solr.handler.component.SearchHandler
[junit4] 2> 571979 T1393 oasc.RequestHandlers.initHandlersFromConfig created spellCheckWithWordbreak_Direct: org.apache.solr.handler.component.SearchHandler
[junit4] 2> 571979 T1393 oasc.RequestHandlers.initHandlersFromConfig created spellCheckCompRH1: org.apache.solr.handler.component.SearchHandler
[junit4] 2> 571980 T1393 oasc.RequestHandlers.initHandlersFromConfig created mltrh: org.apache.solr.handler.component.SearchHandler
[junit4] 2> 571980 T1393 oasc.RequestHandlers.initHandlersFromConfig created tvrh: org.apache.solr.handler.component.SearchHandler
[junit4] 2> 571981 T1393 oasc.RequestHandlers.initHandlersFromConfig created /mlt: solr.MoreLikeThisHandler
[junit4] 2> 571981 T1393 oasc.RequestHandlers.initHandlersFromConfig created /debug/dump: solr.DumpRequestHandler
[junit4] 2> 572000 T1393 oashl.XMLLoader.init xsltCacheLifetimeSeconds=60
[junit4] 2> 572002 T1393 oashl.XMLLoader.init xsltCacheLifetimeSeconds=60
[junit4] 2> 572004 T1393 oashl.XMLLoader.init xsltCacheLifetimeSeconds=60
[junit4] 2> 572006 T1393 oashl.XMLLoader.init xsltCacheLifetimeSeconds=60
[junit4] 2> 572007 T1393 oasc.SolrCore.initDeprecatedSupport WARN solrconfig.xml uses deprecated <admin/gettableFiles>, Please update your config to use the ShowFileRequestHandler.
[junit4] 2> 572012 T1393 oasu.CommitTracker.<init> Hard AutoCommit: disabled
[junit4] 2> 572013 T1393 oasu.CommitTracker.<init> Soft AutoCommit: disabled
[junit4] 2> 572013 T1393 oasu.RandomMergePolicy.<init> RandomMergePolicy wrapping class org.apache.lucene.index.TieredMergePolicy: [TieredMergePolicy: maxMergeAtOnce=15, maxMergeAtOnceExplicit=28, maxMergedSegmentMB=64.244140625, floorSegmentMB=1.55078125, forceMergeDeletesPctAllowed=16.474970479078706, segmentsPerTier=16.0, maxCFSSegmentSizeMB=8.796093022207999E12, noCFSRatio=0.0
[junit4] 2> 572016 T1393 oasc.SolrDeletionPolicy.onInit SolrDeletionPolicy.onInit: commits: num=1
[junit4] 2> commit{dir=RateLimitedDirectoryWrapper(MockDirectoryWrapper(MMapDirectory@/usr/home/jenkins/jenkins-slave/workspace/Lucene-Solr-Tests-trunk-Java7/solr/build/solr-core/test/J3/temp/solr.TestDistributedGrouping-CA31735E47096E95-001/index-MMapDirectory-001 lockFactory=NativeFSLockFactory@/usr/home/jenkins/jenkins-slave/workspace/Lucene-Solr-Tests-trunk-Java7/solr/build/solr-core/test/J3/temp/solr.TestDistributedGrouping-CA31735E47096E95-001/index-MMapDirectory-001)),segFN=segments_1,generation=1}
[junit4] 2> 572017 T1393 oasc.SolrDeletionPolicy.updateCommits newest commit generation = 1
[junit4] 2> 572017 T1393 oass.SolrIndexSearcher.<init> Opening Searcher@222e9cfc[collection1] main
[junit4] 2> 572018 T1393 oasr.RestManager.init Initializing RestManager with initArgs: {storageIO=org.apache.solr.rest.ManagedResourceStorage$InMemoryStorageIO}
[junit4] 2> 572018 T1393 oasr.ManagedResourceStorage.load Reading _rest_managed.json using InMemoryStorage
[junit4] 2> 572018 T1393 oasr.ManagedResource.reloadFromStorage WARN No stored data found for /rest/managed
[junit4] 2> 572019 T1393 oasr.ManagedResourceStorage$JsonStorage.store Saved JSON object to path _rest_managed.json using InMemoryStorage
[junit4] 2> 572019 T1393 oasr.RestManager.init Initializing 0 registered ManagedResources
[junit4] 2> 572019 T1393 oashc.SpellCheckComponent.inform Initializing spell checkers
[junit4] 2> 572029 T1393 oass.DirectSolrSpellChecker.init init: {name=direct,classname=DirectSolrSpellChecker,field=lowerfilt,minQueryLength=3}
[junit4] 2> 572079 T1394 oasc.SolrCore.registerSearcher [collection1] Registered new searcher Searcher@222e9cfc[collection1] main{ExitableDirectoryReader(UninvertingDirectoryReader())}
[junit4] 2> 572086 T1393 oasc.CoreContainer.registerCore registering core: collection1
[junit4] 2> 572087 T1383 oass.SolrDispatchFilter.init user.dir=/usr/home/jenkins/jenkins-slave/workspace/Lucene-Solr-Tests-trunk-Java7/solr/build/solr-core/test/J3
[junit4] 2> 572088 T1383 oass.SolrDispatchFilter.init SolrDispatchFilter.init() done
[junit4] 2> 572090 T1383 oejs.Server.doStart jetty-8.1.10.v20130312
[junit4] 2> 572093 T1383 oejs.AbstractConnector.doStart Started SocketConnector@127.0.0.1:17501
[junit4] 2> 572094 T1383 oass.SolrDispatchFilter.init SolrDispatchFilter.init()
[junit4] 2> 572094 T1383 oasc.SolrResourceLoader.locateSolrHome JNDI not configured for solr (NoInitialContextEx)
[junit4] 2> 572095 T1383 oasc.SolrResourceLoader.locateSolrHome using system property solr.solr.home: /usr/home/jenkins/jenkins-slave/workspace/Lucene-Solr-Tests-trunk-Java7/solr/core/src/test-files/solr
[junit4] 2> 572095 T1383 oasc.SolrResourceLoader.<init> new SolrResourceLoader for directory: '/usr/home/jenkins/jenkins-slave/workspace/Lucene-Solr-Tests-trunk-Java7/solr/core/src/test-files/solr/'
[junit4] 2> 572112 T1383 oasc.ConfigSolr.fromFile Loading container configuration from /usr/home/jenkins/jenkins-slave/workspace/Lucene-Solr-Tests-trunk-Java7/solr/core/src/test-files/solr/solr.xml
[junit4] 2> 572181 T1383 oasc.CoreContainer.<init> New CoreContainer 1566581646
[junit4] 2> 572182 T1383 oasc.CoreContainer.load Loading cores into CoreContainer [instanceDir=/usr/home/jenkins/jenkins-slave/workspace/Lucene-Solr-Tests-trunk-Java7/solr/core/src/test-files/solr/]
[junit4] 2> 572183 T1383 oashc.HttpShardHandlerFactory.getParameter Setting socketTimeout to: 90000
[junit4] 2> 572183 T1383 oashc.HttpShardHandlerFactory.getParameter Setting urlScheme to:
[junit4] 2> 572184 T1383 oashc.HttpShardHandlerFactory.getParameter Setting connTimeout to: 15000
[junit4] 2> 572184 T1383 oashc.HttpShardHandlerFactory.getParameter Setting maxConnectionsPerHost to: 20
[junit4] 2> 572184 T1383 oashc.HttpShardHandlerFactory.getParameter Setting corePoolSize to: 0
[junit4] 2> 572185 T1383 oashc.HttpShardHandlerFactory.getParameter Setting maximumPoolSize to: 2147483647
[junit4] 2> 572185 T1383 oashc.HttpShardHandlerFactory.getParameter Setting maxThreadIdleTime to: 5
[junit4] 2> 572186 T1383 oashc.HttpShardHandlerFactory.getParameter Setting sizeOfQueue to: -1
[junit4] 2> 572186 T1383 oashc.HttpShardHandlerFactory.getParameter Setting fairnessPolicy to: false
[junit4] 2> 572187 T1383 oasu.UpdateShardHandler.<init> Creating UpdateShardHandler HTTP client with params: socketTimeout=340000&connTimeout=45000&retry=false
[junit4] 2> 572187 T1383 oasl.LogWatcher.createWatcher SLF4J impl is org.slf4j.impl.Log4jLoggerFactory
[junit4] 2> 572188 T1383 oasl.LogWatcher.newRegisteredLogWatcher Registering Log Listener [Log4j (org.slf4j.impl.Log4jLoggerFactory)]
[junit4] 2> 572188 T1383 oasc.CoreContainer.load Host Name: 127.0.0.1
[junit4] 2> 572193 T1405 oasc.SolrResourceLoader.<init> new SolrResourceLoader for directory: '/usr/home/jenkins/jenkins-slave/workspace/Lucene-Solr-Tests-trunk-Java7/solr/core/src/test-files/solr/collection1/'
[junit4] 2> 572195 T1405 oasc.SolrResourceLoader.replaceClassLoader Adding 'file:/usr/home/jenkins/jenkins-slave/workspace/Lucene-Solr-Tests-trunk-Java7/solr/core/src/test-files/solr/collection1/lib/README' to classloader
[junit4] 2> 572196 T1405 oasc.SolrResourceLoader.replaceClassLoader Adding 'file:/usr/home/jenkins/jenkins-slave/workspace/Lucene-Solr-Tests-trunk-Java7/solr/core/src/test-files/solr/collection1/lib/.svn/' to classloader
[junit4] 2> 572196 T1405 oasc.SolrResourceLoader.replaceClassLoader Adding 'file:/usr/home/jenkins/jenkins-slave/workspace/Lucene-Solr-Tests-trunk-Java7/solr/core/src/test-files/solr/collection1/lib/classes/' to classloader
[junit4] 2> 572313 T1405 oasc.SolrConfig.<init> Using Lucene MatchVersion: 6.0.0
[junit4] 2> 572379 T1405 oasc.SolrConfig.<init> Loaded SolrConfig: solrconfig.xml
[junit4] 2> 572380 T1405 oass.IndexSchema.readSchema Reading Solr Schema from schema.xml
[junit4] 2> 572392 T1405 oass.IndexSchema.readSchema [collection1] Schema name=test
[junit4] 2> 572748 T1405 oass.OpenExchangeRatesOrgProvider.init Initialized with rates=open-exchange-rates.json, refreshInterval=1440.
[junit4] 2> 572762 T1405 oass.IndexSchema.readSchema default search field in schema is text
[junit4] 2> 572765 T1405 oass.IndexSchema.readSchema unique key field: id
[junit4] 2> 572781 T1405 oass.FileExchangeRateProvider.reload Reloading exchange rates from file currency.xml
[junit4] 2> 572786 T1405 oass.FileExchangeRateProvider.reload Reloading exchange rates from file currency.xml
[junit4] 2> 572790 T1405 oass.OpenExchangeRatesOrgProvider.reload Reloading exchange rates from open-exchange-rates.json
[junit4] 2> 572791 T1405 oass.OpenExchangeRatesOrgProvider$OpenExchangeRates.<init> WARN Unknown key IMPORTANT NOTE
[junit4] 2> 572791 T1405 oass.OpenExchangeRatesOrgProvider$OpenExchangeRates.<init> WARN Expected key, got STRING
[junit4] 2> 572792 T1405 oass.OpenExchangeRatesOrgProvider.reload Reloading exchange rates from open-exchange-rates.json
[junit4] 2> 572793 T1405 oass.OpenExchangeRatesOrgProvider$OpenExchangeRates.<init> WARN Unknown key IMPORTANT NOTE
[junit4] 2> 572793 T1405 oass.OpenExchangeRatesOrgProvider$OpenExchangeRates.<init> WARN Expected key, got STRING
[junit4] 2> 572793 T1405 oasc.CoreContainer.create Creating SolrCore 'collection1' using configuration from instancedir /usr/home/jenkins/jenkins-slave/workspace/Lucene-Solr-Tests-trunk-Java7/solr/core/src/test-files/solr/collection1/
[junit4] 2> 572794 T1405 oasc.SolrCore.initDirectoryFactory org.apache.solr.core.MockDirectoryFactory
[junit4] 2> 572794 T1405 oasc.SolrCore.<init> [collection1] Opening new SolrCore at /usr/home/jenkins/jenkins-slave/workspace/Lucene-Solr-Tests-trunk-Java7/solr/core/src/test-files/solr/collection1/, dataDir=/usr/home/jenkins/jenkins-slave/workspace/Lucene-Solr-Tests-trunk-Java7/solr/build/solr-core/test/J3/temp/solr.TestDistributedGrouping-CA31735E47096E95-001/tempDir-001/shard0/data/
[junit4] 2> 572794 T1405 oasc.JmxMonitoredMap.<init> JMX monitoring is enabled. Adding Solr mbeans to JMX Server: com.sun.jmx.mbeanserver.JmxMBeanServer@11d36c3b
[junit4] 2> 572795 T1405 oasc.CachingDirectoryFactory.get return new directory for /usr/home/jenkins/jenkins-slave/workspace/Lucene-Solr-Tests-trunk-Java7/solr/build/solr-core/test/J3/temp/solr.TestDistributedGrouping-CA31735E47096E95-001/tempDir-001/shard0/data
[junit4] 2> 572796 T1405 oasc.SolrCore.getNewIndexDir New index directory detected: old=null new=/usr/home/jenkins/jenkins-slave/workspace/Lucene-Solr-Tests-trunk-Java7/solr/build/solr-core/test/J3/temp/solr.TestDistributedGrouping-CA31735E47096E95-001/tempDir-001/shard0/data/index/
[junit4] 2> 572796 T1405 oasc.SolrCore.initIndex WARN [collection1] Solr index directory '/usr/home/jenkins/jenkins-slave/workspace/Lucene-Solr-Tests-trunk-Java7/solr/build/solr-core/test/J3/temp/solr.TestDistributedGrouping-CA31735E47096E95-001/tempDir-001/shard0/data/index' doesn't exist. Creating new index...
[junit4] 2> 572798 T1405 oasc.CachingDirectoryFactory.get return new directory for /usr/home/jenkins/jenkins-slave/workspace/Lucene-Solr-Tests-trunk-Java7/solr/build/solr-core/test/J3/temp/solr.TestDistributedGrouping-CA31735E47096E95-001/tempDir-001/shard0/data/index
[junit4] 2> 572799 T1405 oasu.RandomMergePolicy.<init> RandomMergePolicy wrapping class org.apache.lucene.index.LogByteSizeMergePolicy: [LogByteSizeMergePolicy: minMergeSize=1677721, mergeFactor=23, maxMergeSize=2147483648, maxMergeSizeForForcedMerge=9223372036854775807, calibrateSizeByDeletes=false, maxMergeDocs=2147483647, maxCFSSegmentSizeMB=8.796093022207999E12, noCFSRatio=0.5141052219006201]
[junit4] 2> 572804 T1405 oasc.SolrDeletionPolicy.onCommit SolrDeletionPolicy.onCommit: commits: num=1
[junit4] 2> commit{dir=RateLimitedDirectoryWrapper(MockDirectoryWrapper(MMapDirectory@/usr/home/jenkins/jenkins-slave/workspace/Lucene-Solr-Tests-trunk-Java7/solr/build/solr-core/test/J3/temp/solr.TestDistributedGrouping-CA31735E47096E95-001/index-MMapDirectory-002 lockFactory=NativeFSLockFactory@/usr/home/jenkins/jenkins-slave/workspace/Lucene-Solr-Tests-trunk-Java7/solr/build/solr-core/test/J3/temp/solr.TestDistributedGrouping-CA31735E47096E95-001/index-MMapDirectory-002)),segFN=segments_1,generation=1}
[junit4] 2> 572804 T1405 oasc.SolrDeletionPolicy.updateCommits newest commit generation = 1
[junit4] 2> 572805 T1405 oasc.SolrCore.initWriters created xml: solr.XMLResponseWriter
[junit4] 2> 572812 T1405 oasup.UpdateRequestProcessorChain.init creating updateRequestProcessorChain "dedupe"
[junit4] 2> 572812 T1405 oasup.UpdateRequestProcessorChain.init inserting DistributedUpdateProcessorFactory into updateRequestProcessorChain "dedupe"
[junit4] 2> 572813 T1405 oasup.UpdateRequestProcessorChain.init creating updateRequestProcessorChain "dedupe-allfields"
[junit4] 2> 572813 T1405 oasup.UpdateRequestProcessorChain.init inserting DistributedUpdateProcessorFactory into updateRequestProcessorChain "dedupe-allfields"
[junit4] 2> 572813 T1405 oasup.UpdateRequestProcessorChain.init creating updateRequestProcessorChain "stored_sig"
[junit4] 2> 572814 T1405 oasup.UpdateRequestProcessorChain.init inserting DistributedUpdateProcessorFactory into updateRequestProcessorChain "stored_sig"
[junit4] 2> 572814 T1405 oasup.UpdateRequestProcessorChain.init creating updateRequestProcessorChain "uniq-fields"
[junit4] 2> 572814 T1405 oasup.UpdateRequestProcessorChain.init inserting DistributedUpdateProcessorFactory into updateRequestProcessorChain "uniq-fields"
[junit4] 2> 572815 T1405 oasup.UpdateRequestProcessorChain.init creating updateRequestProcessorChain "distrib-dup-test-chain-explicit"
[junit4] 2> 572815 T1405 oasup.UpdateRequestProcessorChain.init creating updateRequestProcessorChain "distrib-dup-test-chain-implicit"
[junit4] 2> 572816 T1405 oasup.UpdateRequestProcessorChain.init inserting DistributedUpdateProcessorFactory into updateRequestProcessorChain "distrib-dup-test-chain-implicit"
[junit4] 2> 572816 T1405 oasc.SolrCore.loadUpdateProcessorChains no updateRequestProcessorChain defined as default, creating implicit default
[junit4] 2> 572817 T1405 oasc.RequestHandlers.initHandlersFromConfig created /update/json/docs: org.apache.solr.handler.UpdateRequestHandler
[junit4] 2> 572818 T1405 oasc.RequestHandlers.initHandlersFromConfig created /update/csv: org.apache.solr.handler.UpdateRequestHandler
[junit4] 2> 572818 T1405 oasc.RequestHandlers.initHandlersFromConfig created /update/json: org.apache.solr.handler.UpdateRequestHandler
[junit4] 2> 572819 T1405 oasc.RequestHandlers.initHandlersFromConfig adding lazy requestHandler: solr.ReplicationHandler
[junit4] 2> 572819 T1405 oasc.RequestHandlers.initHandlersFromConfig created /replication: solr.ReplicationHandler
[junit4] 2> 572820 T1405 oasc.RequestHandlers.initHandlersFromConfig created standard: solr.StandardRequestHandler
[junit4] 2> 572820 T1405 oasc.RequestHandlers.initHandlersFromConfig created /get: solr.RealTimeGetHandler
[junit4] 2> 572821 T1405 oasc.RequestHandlers.initHandlersFromConfig created dismax: solr.SearchHandler
[junit4] 2> 572822 T1405 oasc.RequestHandlers.initHandlersFromConfig created mock: org.apache.solr.core.MockQuerySenderListenerReqHandler
[junit4] 2> 572822 T1405 oasc.RequestHandlers.initHandlersFromConfig created /admin/: org.apache.solr.handler.admin.AdminHandlers
[junit4] 2> 572823 T1405 oasc.RequestHandlers.initHandlersFromConfig created /admin/file: solr.admin.ShowFileRequestHandler
[junit4] 2> 572824 T1405 oasc.RequestHandlers.initHandlersFromConfig created /admin/fileedit: solr.admin.EditFileRequestHandler
[junit4] 2> 572825 T1405 oasc.RequestHandlers.initHandlersFromConfig created defaults: solr.StandardRequestHandler
[junit4] 2> 572825 T1405 oasc.RequestHandlers.initHandlersFromConfig adding lazy requestHandler: solr.StandardRequestHandler
[junit4] 2> 572825 T1405 oasc.RequestHandlers.initHandlersFromConfig created lazy: solr.StandardRequestHandler
[junit4] 2> 572826 T1405 oasc.RequestHandlers.initHandlersFromConfig created /update: solr.UpdateRequestHandler
[junit4] 2> 572827 T1405 oasc.RequestHandlers.initHandlersFromConfig created /terms: org.apache.solr.handler.component.SearchHandler
[junit4] 2> 572827 T1405 oasc.RequestHandlers.initHandlersFromConfig created spellCheckCompRH: org.apache.solr.handler.component.SearchHandler
[junit4] 2> 572828 T1405 oasc.RequestHandlers.initHandlersFromConfig created spellCheckCompRH_Direct: org.apache.solr.handler.component.SearchHandler
[junit4] 2> 572829 T1405 oasc.RequestHandlers.initHandlersFromConfig created spellCheckWithWordbreak: org.apache.solr.handler.component.SearchHandler
[junit4] 2> 572829 T1405 oasc.RequestHandlers.initHandlersFromConfig created spellCheckWithWordbreak_Direct: org.apache.solr.handler.component.SearchHandler
[junit4] 2> 572830 T1405 oasc.RequestHandlers.initHandlersFromConfig created spellCheckCompRH1: org.apache.solr.handler.component.SearchHandler
[junit4] 2> 572831 T1405 oasc.RequestHandlers.initHandlersFromConfig created mltrh: org.apache.solr.handler.component.SearchHandler
[junit4] 2> 572832 T1405 oasc.RequestHandlers.initHandlersFromConfig created tvrh: org.apache.solr.handler.component.SearchHandler
[junit4] 2> 572832 T1405 oasc.RequestHandlers.initHandlersFromConfig created /mlt: solr.MoreLikeThisHandler
[junit4] 2> 572833 T1405 oasc.RequestHandlers.initHandlersFromConfig created /debug/dump: solr.DumpRequestHandler
[junit4] 2> 572852 T1405 oashl.XMLLoader.init xsltCacheLifetimeSeconds=60
[junit4] 2> 572854 T1405 oashl.XMLLoader.init xsltCacheLifetimeSeconds=60
[junit4] 2> 572855 T1405 oashl.XMLLoader.init xsltCacheLifetimeSeconds=60
[junit4] 2> 572857 T1405 oashl.XMLLoader.init xsltCacheLifetimeSeconds=60
[junit4] 2> 572859 T1405 oasc.SolrCore.initDeprecatedSupport WARN solrconfig.xml uses deprecated <admin/gettableFiles>, Please update your config to use the ShowFileRequestHandler.
[junit4] 2> 572864 T1405 oasu.CommitTracker.<init> Hard AutoCommit: disabled
[junit4] 2> 572864 T1405 oasu.CommitTracker.<init> Soft AutoCommit: disabled
[junit4] 2> 572865 T1405 oasu.RandomMergePolicy.<init> RandomMergePolicy wrapping class org.apache.lucene.index.TieredMergePolicy: [TieredMergePolicy: maxMergeAtOnce=15, maxMergeAtOnceExplicit=28, maxMergedSegmentMB=64.244140625, floorSegmentMB=1.55078125, forceMergeDeletesPctAllowed=16.474970479078706, segmentsPerTier=16.0, maxCFSSegmentSizeMB=8.796093022207999E12, noCFSRatio=0.0
[junit4] 2> 572868 T1405 oasc.SolrDeletionPolicy.onInit SolrDeletionPolicy.onInit: commits: num=1
[junit4] 2> commit{dir=RateLimitedDirectoryWrapper(MockDirectoryWrapper(MMapDirectory@/usr/home/jenkins/jenkins-slave/workspace/Lucene-Solr-Tests-trunk-Java7/solr/build/solr-core/test/J3/temp/solr.TestDistributedGrouping-CA31735E47096E95-001/index-MMapDirectory-002 lockFactory=NativeFSLockFactory@/usr/home/jenkins/jenkins-slave/workspace/Lucene-Solr-Tests-trunk-Java7/solr/build/solr-core/test/J3/temp/solr.TestDistributedGrouping-CA31735E47096E95-001/index-MMapDirectory-002)),segFN=segments_1,generation=1}
[junit4] 2> 572869 T1405 oasc.SolrDeletionPolicy.updateCommits newest commit generation = 1
[junit4] 2> 572869 T1405 oass.SolrIndexSearcher.<init> Opening Searcher@2c896bce[collection1] main
[junit4] 2> 572870 T1405 oasr.RestManager.init Initializing RestManager with initArgs: {storageIO=org.apache.solr.rest.ManagedResourceStorage$InMemoryStorageIO}
[junit4] 2> 572870 T1405 oasr.ManagedResourceStorage.load Reading _rest_managed.json using InMemoryStorage
[junit4] 2> 572870 T1405 oasr.ManagedResource.reloadFromStorage WARN No stored data found for /rest/managed
[junit4] 2> 572871 T1405 oasr.ManagedResourceStorage$JsonStorage.store Saved JSON object to path _rest_managed.json using InMemoryStorage
[junit4] 2> 572871 T1405 oasr.RestManager.init Initializing 0 registered ManagedResources
[junit4] 2> 572871 T1405 oashc.SpellCheckComponent.inform Initializing spell checkers
[junit4] 2> 572882 T1405 oass.DirectSolrSpellChecker.init init: {name=direct,classname=DirectSolrSpellChecker,field=lowerfilt,minQueryLength=3}
[junit4] 2> 572932 T1406 oasc.SolrCore.registerSearcher [collection1] Registered new searcher Searcher@2c896bce[collection1] main{ExitableDirectoryReader(UninvertingDirectoryReader())}
[junit4] 2> 572943 T1405 oasc.CoreContainer.registerCore registering core: collection1
[junit4] 2> 572944 T1383 oass.SolrDispatchFilter.init user.dir=/usr/home/jenkins/jenkins-slave/workspace/Lucene-Solr-Tests-trunk-Java7/solr/build/solr-core/test/J3
[junit4] 2> 572944 T1383 oass.SolrDispatchFilter.init SolrDispatchFilter.init() done
[junit4] 2> ASYNC NEW_CORE C97 name=collection1 org.apache.solr.core.SolrCore@cf6c1f7
[junit4] 2> 572951 T1386 C97 oasup.LogUpdateProcessor.finish [collection1] webapp= path=/update params={wt=javabin&version=2} {deleteByQuery=*:* (-1481235971521380352)} 0 4
[junit4] 2> ASYNC NEW_CORE C98 name=collection1 org.apache.solr.core.SolrCore@5c4efd5c
[junit4] 2> 572956 T1398 C98 oasup.LogUpdateProcessor.finish [collection1] webapp= path=/update params={wt=javabin&version=2} {deleteByQuery=*:* (-1481235971527671808)} 0 3
[junit4] 2> 572961 T1386 C97 oasu.DirectUpdateHandler2.commit start commit{,optimize=false,openSearcher=true,waitSearcher=true,expungeDeletes=false,softCommit=false,prepareCommit=false}
[junit4] 2> 572962 T1386 C97 oasu.DirectUpdateHandler2.commit No uncommitted changes. Skipping IW.commit.
[junit4] 2> 572962 T1386 C97 oasc.SolrCore.openNewSearcher SolrIndexSearcher has not changed - not re-opening: org.apache.solr.search.SolrIndexSearcher
[junit4] 2> 572962 T1386 C97 oasu.DirectUpdateHandler2.commit end_commit_flush
[junit4] 2> 572963 T1386 C97 oasup.LogUpdateProcessor.finish [collection1] webapp= path=/update params={waitSearcher=true&wt=javabin&softCommit=false&version=2&commit=true} {commit=} 0 2
[junit4] 2> 572966 T1398 C98 oasu.DirectUpdateHandler2.commit start commit{,optimize=false,openSearcher=true,waitSearcher=true,expungeDeletes=false,softCommit=false,prepareCommit=false}
[junit4] 2> 572966 T1398 C98 oasu.DirectUpdateHandler2.commit No uncommitted changes. Skipping IW.commit.
[junit4] 2> 572967 T1398 C98 oasc.SolrCore.openNewSearcher SolrIndexSearcher has not changed - not re-opening: org.apache.solr.search.SolrIndexSearcher
[junit4] 2> 572967 T1398 C98 oasu.DirectUpdateHandler2.commit end_commit_flush
[junit4] 2> 572968 T1398 C98 oasup.LogUpdateProcessor.finish [collection1] webapp= path=/update params={waitSearcher=true&wt=javabin&softCommit=false&version=2&commit=true} {commit=} 0 2
[junit4] 2> 573008 T1386 C97 oasc.SolrCore.execute [collection1] webapp= path=/select params={sort=a_i1+asc,+id+asc&group.limit=10&wt=javabin&group.field=a_i1&version=2&q=*:*&distrib=false&group=true&fl=id,a_i1&rows=100} hits=0 status=0 QTime=36
[junit4] 2> 573161 T1399 C98 oasc.SolrCore.execute [collection1] webapp= path=/select params={group.limit=10&wt=javabin&group.field=a_i1&version=2&isShard=true&distrib=false&rows=100&group.distributed.first=true&NOW=1412616702655&sort=a_i1+asc,+id+asc&q=*:*&start=0&group=true&fl=id&shard.url=http://127.0.0.1:17501/|[ff01::114]:33332/|[ff01::083]:33332/|[ff01::213]:33332/} status=0 QTime=121
[junit4] 2> 573235 T1398 C98 oasc.SolrCore.execute [collection1] webapp= path=/select params={sort=a_i1+asc,+id+asc&group.limit=10&wt=javabin&group.field=a_i1&version=2&q=*:*&shards=http://127.0.0.1:17501/|[ff01::114]:33332/|[ff01::083]:33332/|[ff01::213]:33332/&group=true&fl=id,a_i1&rows=100} status=0 QTime=210
[junit4] 2> 573331 T1386 C97 oasc.SolrCore.execute [collection1] webapp= path=/select params={hl=true&sort=a_i1+asc,+id+asc&group.limit=10&wt=javabin&group.field=a_i1&version=2&hl.fl=a_t&q=*:*&distrib=false&group=true&fl=id,a_i1&rows=100} hits=0 status=0 QTime=93
[junit4] 2> 573337 T1399 C98 oasc.SolrCore.execute [collection1] webapp= path=/select params={group.limit=10&wt=javabin&group.field=a_i1&version=2&isShard=true&hl.fl=a_t&distrib=false&rows=100&hl=false&group.distributed.first=true&NOW=1412616702964&sort=a_i1+asc,+id+asc&q=*:*&start=0&group=true&fl=id&shard.url=http://127.0.0.1:17501/|[ff01::114]:33332/} status=0 QTime=0
[junit4] 2> 573339 T1398 C98 oasc.SolrCore.execute [collection1] webapp= path=/select params={hl=true&sort=a_i1+asc,+id+asc&group.limit=10&wt=javabin&group.field=a_i1&version=2&hl.fl=a_t&q=*:*&shards=http://127.0.0.1:17501/|[ff01::114]:33332/&group=true&fl=id,a_i1&rows=100} status=0 QTime=5
[junit4] 2> 573365 T1386 C97 oasc.SolrCore.execute [collection1] webapp= path=/select params={facet.field=a_t&facet=true&sort=a_i1+asc,+id+asc&group.limit=10&wt=javabin&group.field=a_i1&version=2&q=*:*&distrib=false&group=true&fl=id,a_i1&rows=100} hits=0 status=0 QTime=23
[junit4] 2> 573380 T1399 C98 oasc.SolrCore.execute [collection1] webapp= path=/select params={facet.field=a_t&facet=false&group.limit=10&wt=javabin&group.field=a_i1&version=2&isShard=true&distrib=false&rows=100&group.distributed.first=true&NOW=1412616703005&sort=a_i1+asc,+id+asc&q=*:*&start=0&group=true&fl=id&shard.url=http://127.0.0.1:17501/|[ff01::213]:33332/} status=0 QTime=0
[junit4] 2> 573437 T1399 C98 oasc.SolrCore.execute [collection1] webapp= path=/select params={facet.field=a_t&facet=true&group.distributed.second=true&f.a_t.facet.limit=160&group.limit=10&wt=javabin&group.field=a_i1&version=2&isShard=true&distrib=false&rows=100&f.a_t.facet.mincount=0&NOW=1412616703005&sort=a_i1+asc,+id+asc&q=*:*&start=0&group=true&fl=id&shard.url=http://127.0.0.1:17501/|[ff01::213]:33332/} status=0 QTime=53
[junit4] 2> 573455 T1398 C98 oasc.SolrCore.execute [collection1] webapp= path=/select params={facet.field=a_t&facet=true&sort=a_i1+asc,+id+asc&group.limit=10&wt=javabin&group.field=a_i1&version=2&q=*:*&shards=http://127.0.0.1:17501/|[ff01::213]:33332/&group=true&fl=id,a_i1&rows=100} status=0 QTime=80
[junit4] 2> 573460 T1386 C97 oasc.SolrCore.execute [collection1] webapp= path=/select params={sort=a_i1+asc,+id+asc&group.limit=10&wt=javabin&group.field=a_i1&version=2&q=*:*&distrib=false&stats.field=a_i1&group=true&fl=id,a_i1&rows=100&stats=true} hits=0 status=0 QTime=1
[junit4] 2> 573467 T1399 C98 oasc.SolrCore.execute [collection1] webapp= path=/select params={group.limit=10&wt=javabin&group.field=a_i1&version=2&isShard=true&stats.field=a_i1&distrib=false&rows=100&stats=false&group.distributed.first=true&NOW=1412616703094&sort=a_i1+asc,+id+asc&q=*:*&start=0&group=true&fl=id&shard.url=http://127.0.0.1:17501/|[ff01::213]:33332/} status=0 QTime=0
[junit4] 2> 573472 T1399 C98 oasc.SolrCore.execute [collection1] webapp= path=/select params={group.distributed.second=true&group.limit=10&wt=javabin&group.field=a_i1&version=2&isShard=true&stats.field=a_i1&distrib=false&rows=100&stats=true&NOW=1412616703094&sort=a_i1+asc,+id+asc&q=*:*&start=0&group=true&fl=id&shard.url=http://127.0.0.1:17501/|[ff01::213]:33332/} status=0 QTime=0
[junit4] 2> 573474 T1398 C98 oasc.SolrCore.execute [collection1] webapp= path=/select params={sort=a_i1+asc,+id+asc&group.limit=10&wt=javabin&group.field=a_i1&version=2&q=*:*&stats.field=a_i1&shards=http://127.0.0.1:17501/|[ff01::213]:33332/&group=true&fl=id,a_i1&rows=100&stats=true} status=0 QTime=10
[junit4] 2> 573493 T1386 C97 oasc.SolrCore.execute [collection1] webapp= path=/select params={group.limit=10&group.field=a_i1&wt=javabin&version=2&distrib=false&rows=100&spellcheck.build=true&spellcheck=true&qt=spellCheckCompRH&sort=a_i1+asc,+id+asc&q=kings&fl=id,a_i1&group=true} hits=0 status=0 QTime=17
[junit4] 2> 573524 T1399 C98 oasc.SolrCore.execute [collection1] webapp= path=/select params={spellcheck.onlyMorePopular=false&group.limit=10&wt=javabin&group.field=a_i1&version=2&isShard=true&distrib=false&spellcheck.count=5&rows=100&spellcheck.build=true&spellcheck=true&group.distributed.first=true&spellcheck.extendedResults=false&NOW=1412616703134&sort=a_i1+asc,+id+asc&q=kings&start=0&fl=id&group=true&shard.url=http://127.0.0.1:17501/|[ff01::114]:33332/} status=0 QTime=1
[junit4] 2> 573526 T1398 C98 oashc.SpellCheckComponent.finishStage http://127.0.0.1:17501/|[ff01::114]:33332/ null
[junit4] 2> 573526 T1398 C98 oasc.SolrCore.execute [collection1] webapp= path=/select params={group.limit=10&group.field=a_i1&wt=javabin&version=2&rows=100&spellcheck.build=true&spellcheck=true&qt=spellCheckCompRH&sort=a_i1+asc,+id+asc&q=kings&shards=http://127.0.0.1:17501/|[ff01::114]:33332/&fl=id,a_i1&group=true} status=0 QTime=22
[junit4] 2> 573558 T1386 C97 oasc.SolrCore.execute [collection1] webapp= path=/select params={fq=a_s:a&facet=true&facet.field=a_t&group.limit=10&wt=javabin&group.field=a_i1&version=2&distrib=false&group.truncate=true&rows=100&sort=a_i1+asc,+id+asc&q=*:*&fl=id,a_i1&group=true} hits=0 status=0 QTime=29
[junit4] 2> 573564 T1399 C98 oasc.SolrCore.execute [collection1] webapp= path=/select params={fq=a_s:a&facet=false&facet.field=a_t&group.limit=10&wt=javabin&group.field=a_i1&version=2&isShard=true&distrib=false&group.truncate=true&rows=100&group.distributed.first=true&NOW=1412616703191&sort=a_i1+asc,+id+asc&q=*:*&start=0&fl=id&group=true&shard.url=[ff01::213]:33332/|[ff01::114]:33332/|http://127.0.0.1:17501/|[ff01::083]:33332/} status=0 QTime=0
[junit4] 2> 573569 T1399 C98 oasc.SolrCore.execute [collection1] webapp= path=/select params={fq=a_s:a&facet=true&facet.field=a_t&f.a_t.facet.limit=160&group.distributed.second=true&group.limit=10&wt=javabin&group.field=a_i1&version=2&isShard=true&distrib=false&group.truncate=true&rows=100&f.a_t.facet.mincount=0&NOW=1412616703191&sort=a_i1+asc,+id+asc&q=*:*&start=0&fl=id&group=true&shard.url=[ff01::213]:33332/|[ff01::114]:33332/|http://127.0.0.1:17501/|[ff01::083]:33332/} status=0 QTime=1
[junit4] 2> 573570 T1398 C98 oasc.SolrCore.execute [collection1] webapp= path=/select params={fq=a_s:a&facet=true&facet.field=a_t&group.limit=10&wt=javabin&group.field=a_i1&version=2&group.truncate=true&rows=100&sort=a_i1+asc,+id+asc&q=*:*&shards=[ff01::213]:33332/|[ff01::114]:33332/|http://127.0.0.1:17501/|[ff01::083]:33332/&fl=id,a_i1&group=true} status=0 QTime=9
[junit4] 2> 573585 T1386 C97 oasup.LogUpdateProcessor.finish [collection1] webapp= path=/update params={wt=javabin&version=2} {add=[1 (1481235972180934656)]} 0 10
[junit4] 2> 573599 T1398 C98 oasup.LogUpdateProcessor.finish [collection1] webapp= path=/update params={wt=javabin&version=2} {add=[1 (1481235972195614720)]} 0 10
[junit4] 2> 573607 T1386 C97 oasup.LogUpdateProcessor.finish [collection1] webapp= path=/update params={wt=javabin&version=2} {add=[2 (1481235972210294784)]} 0 4
[junit4] 2> 573614 T1398 C98 oasup.LogUpdateProcessor.finish [collection1] webapp= path=/update params={wt=javabin&version=2} {add=[2 (1481235972217634816)]} 0 4
[junit4] 2> 573620 T1386 C97 oasup.LogUpdateProcessor.finish [collection1] webapp= path=/update params={wt=javabin&version=2} {add=[3 (1481235972224974848)]} 0 3
[junit4] 2> 573627 T1398 C98 oasup.LogUpdateProcessor.finish [collection1] webapp= path=/update params={wt=javabin&version=2} {add=[3 (1481235972232314880)]} 0 3
[junit4] 2> 573634 T1386 C97 oasup.LogUpdateProcessor.finish [collection1] webapp= path=/update params={wt=javabin&version=2} {add=[4 (1481235972239654912)]} 0 3
[junit4] 2> 573640 T1398 C98 oasup.LogUpdateProcessor.finish [collection1] webapp= path=/update params={wt=javabin&version=2} {add=[4 (1481235972245946368)]} 0 3
[junit4] 2> 573647 T1386 C97 oasup.LogUpdateProcessor.finish [collection1] webapp= path=/update params={wt=javabin&version=2} {add=[5 (1481235972253286400)]} 0 3
[junit4] 2> 573654 T1398 C98 oasup.LogUpdateProcessor.finish [collection1] webapp= path=/update params={wt=javabin&version=2} {add=[5 (1481235972260626432)]} 0 3
[junit4] 2> 573661 T1386 C97 oasup.LogUpdateProcessor.finish [collection1] webapp= path=/update params={wt=javabin&version=2} {add=[6 (1481235972267966464)]} 0 3
[junit4] 2> 573668 T1398 C98 oasup.LogUpdateProcessor.finish [collection1] webapp= path=/update params={wt=javabin&version=2} {add=[6 (1481235972275306496)]} 0 3
[junit4] 2> 573674 T1386 C97 oasup.LogUpdateProcessor.finish [collection1] webapp= path=/update params={wt=javabin&version=2} {add=[7 (1481235972281597952)]} 0 3
[junit4] 2> 573680 T1398 C98 oasup.LogUpdateProcessor.finish [collection1] webapp= path=/update params={wt=javabin&version=2} {add=[7 (1481235972287889408)]} 0 3
[junit4] 2> 573686 T1386 C97 oasup.LogUpdateProcessor.finish [collection1] webapp= path=/update params={wt=javabin&version=2} {add=[8 (1481235972294180864)]} 0 3
[junit4] 2> 573693 T1398 C98 oasup.LogUpdateProcessor.finish [collection1] webapp= path=/update params={wt=javabin&version=2} {add=[8 (1481235972301520896)]} 0 3
[junit4] 2> 573700 T1386 C97 oasup.LogUpdateProcessor.finish [collection1] webapp= path=/update params={wt=javabin&version=2} {add=[9 (1481235972308860928)]} 0 3
[junit4] 2> 573706 T1398 C98 oasup.LogUpdateProcessor.finish [collection1] webapp= path=/update params={wt=javabin&version=2} {add=[9 (1481235972315152384)]} 0 3
[junit4] 2> 573713 T1386 C97 oasup.LogUpdateProcessor.finish [collection1] webapp= path=/update params={wt=javabin&version=2} {add=[10 (1481235972322492416)]} 0 3
[junit4] 2> 573720 T1398 C98 oasup.LogUpdateProcessor.finish [collection1] webapp= path=/update params={wt=javabin&version=2} {add=[10 (1481235972329832448)]} 0 3
[junit4] 2> 573726 T1386 C97 oasup.LogUpdateProcessor.finish [collection1] webapp= path=/update params={wt=javabin&version=2} {add=[11 (1481235972336123904)]} 0 3
[junit4] 2> 573732 T1398 C98 oasup.LogUpdateProcessor.finish [collection1] webapp= path=/update params={wt=javabin&version=2} {add=[11 (1481235972342415360)]} 0 3
[junit4] 2> 573740 T1386 C97 oasup.LogUpdateProcessor.finish [collection1] webapp= path=/update params={wt=javabin&version=2} {add=[12 (1481235972350803968)]} 0 3
[junit4] 2> 573747 T1398 C98 oasup.LogUpdateProcessor.finish [collection1] webapp= path=/update params={wt=javabin&version=2} {add=[12 (1481235972358144000)]} 0 3
[junit4] 2> 573753 T1386 C97 oasup.LogUpdateProcessor.finish [collection1] webapp= path=/update params={wt=javabin&version=2} {add=[14 (1481235972365484032)]} 0 2
[junit4] 2> 573759 T1398 C98 oasup.LogUpdateProcessor.finish [collection1] webapp= path=/update params={wt=javabin&version=2} {add=[14 (1481235972371775488)]} 0 2
[junit4] 2> 573765 T1386 C97 oasup.LogUpdateProcessor.finish [collection1] webapp= path=/update params={wt=javabin&version=2} {add=[15 (1481235972378066944)]} 0 2
[junit4] 2> 573772 T1398 C98 oasup.LogUpdateProcessor.finish [collection1] webapp= path=/update params={wt=javabin&version=2} {add=[15 (1481235972385406976)]} 0 2
[junit4] 2> 573779 T1386 C97 oasup.LogUpdateProcessor.finish [collection1] webapp= path=/update params={wt=javabin&version=2} {add=[16 (1481235972391698432)]} 0 3
[junit4] 2> 573786 T1398 C98 oasup.LogUpdateProcessor.finish [collection1] webapp= path=/update params={wt=javabin&version=2} {add=[16 (1481235972400087040)]} 0 3
[junit4] 2> 573799 T1386 C97 oasup.LogUpdateProcessor.finish [collection1] webapp= path=/update params={wt=javabin&version=2} {add=[17 (1481235972410572800)]} 0 9
[junit4] 2> 573812 T1398 C98 oasup.LogUpdateProcessor.finish [collection1] webapp= path=/update params={wt=javabin&version=2} {add=[17 (1481235972424204288)]} 0 9
[junit4] 2> 573820 T1386 C97 oasup.LogUpdateProcessor.finish [collection1] webapp= path=/update params={wt=javabin&version=2} {add=[18 (1481235972434690048)]} 0 3
[junit4] 2> 573827 T1398 C98 oasup.LogUpdateProcessor.finish [collection1] webapp= path=/update params={wt=javabin&version=2} {add=[18 (1481235972442030080)]} 0 3
[junit4] 2> 573834 T1386 C97 oasup.LogUpdateProcessor.finish [collection1] webapp= path=/update params={wt=javabin&version=2} {add=[19 (1481235972449370112)]} 0 3
[junit4] 2> 573840 T1398 C98 oasup.LogUpdateProcessor.finish [collection1] webapp= path=/update params={wt=javabin&version=2} {add=[19 (1481235972455661568)]} 0 3
[junit4] 2> 573847 T1386 C97 oasup.LogUpdateProcessor.finish [collection1] webapp= path=/update params={wt=javabin&version=2} {add=[20 (1481235972463001600)]} 0 3
[junit4] 2> 573853 T1398 C98 oasup.LogUpdateProcessor.finish [collection1] webapp= path=/update params={wt=javabin&version=2} {add=[20 (1481235972469293056)]} 0 3
[junit4] 2> 573859 T1386 C97 oasup.LogUpdateProcessor.finish [collection1] webapp= path=/update params={wt=javabin&version=2} {add=[21 (1481235972475584512)]} 0 3
[junit4] 2> 573865 T1398 C98 oasup.LogUpdateProcessor.finish [collection1] webapp= path=/update params={wt=javabin&version=2} {add=[21 (1481235972481875968)]} 0 3
[junit4] 2> 573871 T1386 C97 oasup.LogUpdateProcessor.finish [collection1] webapp= path=/update params={wt=javabin&version=2} {add=[22 (1481235972488167424)]} 0 3
[junit4] 2> 573877 T1398 C98 oasup.LogUpdateProcessor.finish [collection1] webapp= path=/update params={wt=javabin&version=2} {add=[22 (1481235972494458880)]} 0 3
[junit4] 2> 573883 T1386 C97 oasup.LogUpdateProcessor.finish [collection1] webapp= path=/update params={wt=javabin&version=2} {add=[23 (1481235972500750336)]} 0 3
[junit4] 2> 573889 T1398 C98 oasup.LogUpdateProcessor.finish [collection1] webapp= path=/update params={wt=javabin&version=2} {add=[23 (1481235972507041792)]} 0 3
[junit4] 2> 573895 T1386 C97 oasup.LogUpdateProcessor.finish [collection1] webapp= path=/update params={wt=javabin&version=2} {add=[100 (1481235972514381824)]} 0 2
[junit4] 2> 573901 T1398 C98 oasup.LogUpdateProcessor.finish [collection1] webapp= path=/update params={wt=javabin&version=2} {add=[100 (1481235972520673280)]} 0 2
[junit4] 2> 573907 T1386 C97 oasup.LogUpdateProcessor.finish [collection1] webapp= path=/update params={wt=javabin&version=2} {add=[101 (1481235972526964736)]} 0 2
[junit4] 2> 573912 T1398 C98 oasup.LogUpdateProcessor.finish [collection1] webapp= path=/update params={wt=javabin&version=2} {add=[101 (1481235972532207616)]} 0 2
[junit4] 2> 573918 T1386 C97 oasup.LogUpdateProcessor.finish [collection1] webapp= path=/update params={wt=javabin&version=2} {add=[102 (1481235972538499072)]} 0 2
[junit4] 2> 573924 T1398 C98 oasup.LogUpdateProcessor.finish [collection1] webapp= path=/update params={wt=javabin&version=2} {add=[102 (1481235972543741952)]} 0 2
[junit4] 2> 573930 T1386 C97 oasup.LogUpdateProcessor.finish [collection1] webapp= path=/update params={wt=javabin&version=2} {add=[103 (1481235972551081984)]} 0 2
[junit4] 2> 573935 T1398 C98 oasup.LogUpdateProcessor.finish [collection1] webapp= path=/update params={wt=javabin&version=2} {add=[103 (1481235972555276288)]} 0 2
[junit4] 2> 573940 T1386 C97 oasup.LogUpdateProcessor.finish [collection1] webapp= path=/update params={wt=javabin&version=2} {add=[104 (1481235972561567744)]} 0 2
[junit4] 2> 573945 T1398 C98 oasup.LogUpdateProcessor.finish [collection1] webapp= path=/update params={wt=javabin&version=2} {add=[104 (1481235972565762048)]} 0 2
[junit4] 2> 573952 T1386 C97 oasup.LogUpdateProcessor.finish [collection1] webapp= path=/update params={wt=javabin&version=2} {add=[105 (1481235972574150656)]} 0 2
[junit4] 2> 573957 T1398 C98 oasup.LogUpdateProcessor.finish [collection1] webapp= path=/update params={wt=javabin&version=2} {add=[105 (1481235972579393536)]} 0 2
[junit4] 2> 573963 T1386 C97 oasup.LogUpdateProcessor.finish [collection1] webapp= path=/update params={wt=javabin&version=2} {add=[106 (1481235972585684992)]} 0 2
[junit4] 2> 573969 T1398 C98 oasup.LogUpdateProcessor.finish [collection1] webapp= path=/update params={wt=javabin&version=2} {add=[106 (1481235972590927872)]} 0 2
[junit4] 2> 573974 T1386 C97 oasup.LogUpdateProcessor.finish [collection1] webapp= path=/update params={wt=javabin&version=2} {add=[107 (1481235972597219328)]} 0 2
[junit4] 2> 573981 T1398 C98 oasup.LogUpdateProcessor.finish [collection1] webapp= path=/update params={wt=javabin&version=2} {add=[107 (1481235972603510784)]} 0 3
[junit4] 2> 573986 T1386 C97 oasup.LogUpdateProcessor.finish [collection1] webapp= path=/update params={wt=javabin&version=2} {add=[108 (1481235972609802240)]} 0 2
[junit4] 2> 573992 T1398 C98 oasup.LogUpdateProcessor.finish [collection1] webapp= path=/update params={wt=javabin&version=2} {add=[108 (1481235972616093696)]} 0 2
[junit4] 2> 573998 T1386 C97 oasup.LogUpdateProcessor.finish [collection1] webapp= path=/update params={wt=javabin&version=2} {add=[109 (1481235972621336576)]} 0 2
[junit4] 2> 574003 T1398 C98 oasup.LogUpdateProcessor.finish [collection1] webapp= path=/update params={wt=javabin&version=2} {add=[109 (1481235972626579456)]} 0 2
[junit4] 2> 574009 T1386 C97 oasup.LogUpdateProcessor.finish [collection1] webapp= path=/update params={wt=javabin&version=2} {add=[110 (1481235972632870912)]} 0 2
[junit4] 2> 574014 T1398 C98 oasup.LogUpdateProcessor.finish [collection1] webapp= path=/update params={wt=javabin&version=2} {add=[110 (1481235972638113792)]} 0 2
[junit4] 2> 574021 T1386 C97 oasup.LogUpdateProcessor.finish [collection1] webapp= path=/update params={wt=javabin&version=2} {add=[111 (1481235972646502400)]} 0 2
[junit4] 2> 574027 T1398 C98 oasup.LogUpdateProcessor.finish [collection1] webapp= path=/update params={wt=javabin&version=2} {add=[111 (1481235972652793856)]} 0 2
[junit4] 2> 574034 T1386 C97 oasup.LogUpdateProcessor.finish [collection1] webapp= path=/update params={wt=javabin&version=2} {add=[112 (1481235972659085312)]} 0 3
[junit4] 2> 574040 T1398 C98 oasup.LogUpdateProcessor.finish [collection1] webapp= path=/update params={wt=javabin&version=2} {add=[112 (1481235972665376768)]} 0 3
[junit4] 2> 574045 T1386 C97 oasup.LogUpdateProcessor.finish [collection1] webapp= path=/update params={wt=javabin&version=2} {add=[113 (1481235972671668224)]} 0 2
[junit4] 2> 574052 T1398 C98 oasup.LogUpdateProcessor.finish [collection1] webapp= path=/update params={wt=javabin&version=2} {add=[113 (1481235972677959680)]} 0 3
[junit4] 2> 574057 T1386 C97 oasup.LogUpdateProcessor.finish [collection1] webapp= path=/update params={wt=javabin&version=2} {add=[114 (1481235972684251136)]} 0 2
[junit4] 2> 574065 T1398 C98 oasup.LogUpdateProcessor.finish [collection1] webapp= path=/update params={wt=javabin&version=2} {add=[114 (1481235972691591168)]} 0 3
[junit4] 2> 574070 T1386 C97 oasup.LogUpdateProcessor.finish [collection1] webapp= path=/update params={wt=javabin&version=2} {add=[115 (1481235972697882624)]} 0 2
[junit4] 2> 574077 T1398 C98 oasup.LogUpdateProcessor.finish [collection1] webapp= path=/update params={wt=javabin&version=2} {add=[115 (1481235972704174080)]} 0 3
[junit4] 2> 574082 T1386 C97 oasup.LogUpdateProcessor.finish [collection1] webapp= path=/update params={wt=javabin&version=2} {add=[116 (1481235972710465536)]} 0 2
[junit4] 2> 574088 T1398 C98 oasup.LogUpdateProcessor.finish [collection1] webapp= path=/update params={wt=javabin&version=2} {add=[116 (1481235972716756992)]} 0 2
[junit4] 2> 574095 T1386 C97 oasup.LogUpdateProcessor.finish [collection1] webapp= path=/update params={wt=javabin&version=2} {add=[117 (1481235972723048448)]} 0 3
[junit4] 2> 574100 T1398 C98 oasup.LogUpdateProcessor.finish [collection1] webapp= path=/update params={wt=javabin&version=2} {add=[117 (1481235972729339904)]} 0 2
[junit4] 2> 574107 T1386 C97 oasup.LogUpdateProcessor.finish [collection1] webapp= path=/update params={wt=javabin&version=2} {add=[118 (1481235972735631360)]} 0 3
[junit4] 2> 574112 T1398 C98 oasup.LogUpdateProcessor.finish [collection1] webapp= path=/update params={wt=javabin&version=2} {add=[118 (1481235972741922816)]} 0 2
[junit4] 2> 574118 T1386 C97 oasup.LogUpdateProcessor.finish [collection1] webapp= path=/update params={wt=javabin&version=2} {add=[119 (1481235972747165696)]} 0 2
[junit4] 2> 574124 T1398 C98 oasup.LogUpdateProcessor.finish [collection1] webapp= path=/update params={wt=javabin&version=2} {add=[119 (1481235972754505728)]} 0 2
[junit4] 2> 574130 T1386 C97 oasup.LogUpdateProcessor.finish [collection1] webapp= path=/update params={wt=javabin&version=2} {add=[120 (1481235972759748608)]} 0 2
[junit4] 2> 574135 T1398 C98 oasup.LogUpdateProcessor.finish [collection1] webapp= path=/update params={wt=javabin&version=2} {add=[120 (1481235972764991488)]} 0 2
[junit4] 2> 574140 T1386 C97 oasup.LogUpdateProcessor.finish [collection1] webapp= path=/update params={wt=javabin&version=2} {add=[121 (1481235972770234368)]} 0 2
[junit4] 2> 574145 T1398 C98 oasup.LogUpdateProcessor.finish [collection1] webapp= path=/update params={wt=javabin&version=2} {add=[121 (1481235972775477248)]} 0 2
[junit4] 2> 574150 T1386 C97 oasup.LogUpdateProcessor.finish [collection1] webapp= path=/update params={wt=javabin&version=2} {add=[122 (1481235972780720128)]} 0 2
[junit4] 2> 574155 T1398 C98 oasup.LogUpdateProcessor.finish [collection1] webapp= path=/update params={wt=javabin&version=2} {add=[122 (1481235972787011584)]} 0 2
[junit4] 2> 574160 T1386 C97 oasup.LogUpdateProcessor.finish [collection1] webapp= path=/update params={wt=javabin&version=2} {add=[123 (1481235972791205888)]} 0 2
[junit4] 2> 574165 T1398 C98 oasup.LogUpdateProcessor.finish [collection1] webapp= path=/update params={wt=javabin&version=2} {add=[123 (1481235972796448768)]} 0 2
[junit4] 2> 574170 T1386 C97 oasup.LogUpdateProcessor.finish [collection1] webapp= path=/update params={wt=javabin&version=2} {add=[124 (1481235972802740224)]} 0 2
[junit4] 2> 574175 T1398 C98 oasup.LogUpdateProcessor.finish [collection1] webapp= path=/update params={wt=javabin&version=2} {add=[124 (1481235972806934528)]} 0 2
[junit4] 2> 574181 T1386 C97 oasup.LogUpdateProcessor.finish [collection1] webapp= path=/update params={wt=javabin&version=2} {add=[125 (1481235972814274560)]} 0 2
[junit4] 2> 574186 T1398 C98 oasup.LogUpdateProcessor.finish [collection1] webapp= path=/update params={wt=javabin&version=2} {add=[125 (1481235972819517440)]} 0 2
[junit4] 2> 574192 T1386 C97 oasup.LogUpdateProcessor.finish [collection1] webapp= path=/update params={wt=javabin&version=2} {add=[126 (1481235972825808896)]} 0 2
[junit4] 2> 574197 T1398 C98 oasup.LogUpdateProcessor.finish [collection1] webapp= path=/update params={wt=javabin&version=2} {add=[126 (1481235972831051776)]} 0 2
[junit4] 2> 574203 T1386 C97 oasup.LogUpdateProcessor.finish [collection1] webapp= path=/update params={wt=javabin&version=2} {add=[127 (1481235972837343232)]} 0 2
[junit4] 2> 574209 T1398 C98 oasup.LogUpdateProcessor.finish [collection1] webapp= path=/update params={wt=javabin&version=2} {add=[127 (1481235972842586112)]} 0 3
[junit4] 2> 574214 T1386 C97 oasup.LogUpdateProcessor.finish [collection1] webapp= path=/update params={wt=javabin&version=2} {add=[128 (1481235972848877568)]} 0 2
[junit4] 2> 574220 T1398 C98 oasup.LogUpdateProcessor.finish [collection1] webapp= path=/update params={wt=javabin&version=2} {add=[128 (1481235972855169024)]} 0 2
[junit4] 2> 574226 T1386 C97 oasup.LogUpdateProcessor.finish [collection1] webapp= path=/update params={wt=javabin&version=2} {add=[129 (1481235972861460480)]} 0 2
[junit4] 2> 574232 T1398 C98 oasup.LogUpdateProcessor.finish [collection1] webapp= path=/update params={wt=javabin&version=2} {add=[129 (1481235972867751936)]} 0 2
[junit4] 2> 574238 T1386 C97 oasup.LogUpdateProcessor.finish [collection1] webapp= path=/update params={wt=javabin&version=2} {add=[130 (1481235972874043392)]} 0 2
[junit4] 2> 574245 T1398 C98 oasup.LogUpdateProcessor.finish [collection1] webapp= path=/update params={wt=javabin&version=2} {add=[130 (1481235972880334848)]} 0 3
[junit4] 2> 574250 T1386 C97 oasup.LogUpdateProcessor.finish [collection1] webapp= path=/update params={wt=javabin&version=2} {add=[131 (1481235972886626304)]} 0 2
[junit4] 2> 574256 T1398 C98 oasup.LogUpdateProcessor.finish [collection1] webapp= path=/update params={wt=javabin&version=2} {add=[131 (1481235972892917760)]} 0 2
[junit4] 2> 574262 T1386 C97 oasup.LogUpdateProcessor.finish [collection1] webapp= path=/update params={wt=javabin&version=2} {add=[132 (1481235972899209216)]} 0 2
[junit4] 2> 574268 T1398 C98 oasup.LogUpdateProcessor.finish [collection1] webapp= path=/update params={wt=javabin&version=2} {add=[132 (1481235972905500672)]} 0 2
[junit4] 2> 574276 T1386 C97 oasup.LogUpdateProcessor.finish [collection1] webapp= path=/update params={wt=javabin&version=2} {add=[133 (1481235972912840704)]} 0 3
[junit4] 2> 574282 T1398 C98 oasup.LogUpdateProcessor.finish [collection1] webapp= path=/update params={wt=javabin&version=2} {add=[133 (1481235972920180736)]} 0 2
[junit4] 2> 574289 T1386 C97 oasup.LogUpdateProcessor.finish [collection1] webapp= path=/update params={wt=javabin&version=2} {add=[134 (1481235972927520768)]} 0 2
[junit4] 2> 574296 T1398 C98 oasup.LogUpdateProcessor.finish [collection1] webapp= path=/update params={wt=javabin&version=2} {add=[134 (1481235972933812224)]} 0 3
[junit4] 2> 574301 T1386 C97 oasup.LogUpdateProcessor.finish [collection1] webapp= path=/update params={wt=javabin&version=2} {add=[135 (1481235972940103680)]} 0 2
[junit4] 2> 574306 T1398 C98 oasup.LogUpdateProcessor.finish [collection1] webapp= path=/update params={wt=javabin&version=2} {add=[135 (1481235972945346560)]} 0 2
[junit4] 2> 574312 T1386 C97 oasup.LogUpdateProcessor.finish [collection1] webapp= path=/update params={wt=javabin&version=2} {add=[136 (1481235972951638016)]} 0 2
[junit4] 2> 574319 T1398 C98 oasup.LogUpdateProcessor.finish [collection1] webapp= path=/update params={wt=javabin&version=2} {add=[136 (1481235972957929472)]} 0 2
[junit4] 2> 574325 T1386 C97 oasup.LogUpdateProcessor.finish [collection1] webapp= path=/update params={wt=javabin&version=2} {add=[137 (1481235972964220928)]} 0 2
[junit4] 2> 574335 T1398 C98 oasup.LogUpdateProcessor.finish [collection1] webapp= path=/update params={wt=javabin&version=2} {add=[137 (1481235972971560960)]} 0 6
[junit4] 2> 574342 T1386 C97 oasup.LogUpdateProcessor.finish [collection1] webapp= path=/update params={wt=javabin&version=2} {add=[138 (1481235972983095296)]} 0 2
[junit4] 2> 574348 T1398 C98 oasup.LogUpdateProcessor.finish [collection1] webapp= path=/update params={wt=javabin&version=2} {add=[138 (1481235972988338176)]} 0 2
[junit4] 2> 574353 T1386 C97 oasup.LogUpdateProcessor.finish [collection1] webapp= path=/update params={wt=javabin&version=2} {add=[139 (1481235972994629632)]} 0 2
[junit4] 2> 574359 T1398 C98 oasup.LogUpdateProcessor.finish [collection1] webapp= path=/update params={wt=javabin&version=2} {add=[139 (1481235972999872512)]} 0 2
[junit4] 2> 574365 T1386 C97 oasup.LogUpdateProcessor.finish [collection1] webapp= path=/update params={wt=javabin&version=2} {add=[140 (1481235973006163968)]} 0 2
[junit4] 2> 574370 T1398 C98 oasup.LogUpdateProcessor.finish [collection1] webapp= path=/update params={wt=javabin&version=2} {add=[140 (1481235973012455424)]} 0 2
[junit4] 2> 574377 T1386 C97 oasup.LogUpdateProcessor.finish [collection1] webapp= path=/update params={wt=javabin&version=2} {add=[141 (1481235973018746880)]} 0 3
[junit4] 2> 574383 T1398 C98 oasup.LogUpdateProcessor.finish [collection1] webapp= path=/update params={wt=javabin&version=2} {add=[141 (1481235973023989760)]} 0 3
[junit4] 2> 574388 T1386 C97 oasup.LogUpdateProcessor.finish [collection1] webapp= path=/update params={wt=javabin&version=2} {add=[142 (1481235973031329792)]} 0 2
[junit4] 2> 574395 T1398 C98 oasup.LogUpdateProcessor.finish [collection1] webapp= path=/update params={wt=javabin&version=2} {add=[142 (1481235973038669824)]} 0 2
[junit4] 2> 574401 T1386 C97 oasup.LogUpdateProcessor.finish [collection1] webapp= path=/update params={wt=javabin&version=2} {add=[143 (1481235973044961280)]} 0 2
[junit4] 2> 574407 T1398 C98 oasup.LogUpdateProcessor.finish [collection1] webapp= path=/update params={wt=javabin&version=2} {add=[143 (1481235973050204160)]} 0 2
[junit4] 2> 574413 T1386 C97 oasup.LogUpdateProcessor.finish [collection1] webapp= path=/update params={wt=javabin&version=2} {add=[144 (1481235973057544192)]} 0 2
[junit4] 2> 574420 T1398 C98 oasup.LogUpdateProcessor.finish [collection1] webapp= path=/update params={wt=javabin&version=2} {add=[144 (1481235973063835648)]} 0 3
[junit4] 2> 574428 T1386 C97 oasup.LogUpdateProcessor.finish [collection1] webapp= path=/update params={wt=javabin&version=2} {add=[145 (1481235973072224256)]} 0 3
[junit4] 2> 574434 T1398 C98 oasup.LogUpdateProcessor.finish [collection1] webapp= path=/update params={wt=javabin&version=2} {add=[145 (1481235973078515712)]} 0 3
[junit4] 2> 574483 T1386 C97 oasup.LogUpdateProcessor.finish [collection1] webapp= path=/update params={wt=javabin&version=2} {add=[146 (1481235973085855744)]} 0 45
[junit4] 2> 574489 T1398 C98 oasup.LogUpdateProcessor.finish [collection1] webapp= path=/update params={wt=javabin&version=2} {add=[146 (1481235973137235968)]} 0 2
[junit4] 2> 574496 T1386 C97 oasup.LogUpdateProcessor.finish [collection1] webapp= path=/update params={wt=javabin&version=2} {add=[147 (1481235973144576000)]} 0 2
[junit4] 2> 574501 T1398 C98 oasup.LogUpdateProcessor.finish [collection1] webapp= path=/update params={wt=javabin&version=2} {add=[147 (1481235973149818880)]} 0 1
[junit4] 2> 574506 T1386 C97 oasup.LogUpdateProcessor.finish [collection1] webapp= path=/update params={wt=javabin&version=2} {add=[148 (1481235973155061760)]} 0 1
[junit4] 2> 574511 T1398 C98 oasup.LogUpdateProcessor.finish [collection1] webapp= path=/update params={wt=javabin&version=2} {add=[148 (1481235973160304640)]} 0 1
[junit4] 2> 574516 T1386 C97 oasup.LogUpdateProcessor.finish [collection1] webapp= path=/update params={wt=javabin&version=2} {add=[149 (1481235973165547520)]} 0 1
[junit4] 2> 574520 T1398 C98 oasup.LogUpdateProcessor.finish [collection1] webapp= path=/update params={wt=javabin&version=2} {add=[149 (1481235973169741824)]} 0 1
[junit4] 2> 574525 T1386 C97 oasup.LogUpdateProcessor.finish [collection1] webapp= path=/update params={wt=javabin&version=2} {add=[500 (1481235973174984704)]} 0 1
[junit4] 2> 574529 T1398 C98 oasup.LogUpdateProcessor.finish [collection1] webapp= path=/update params={wt=javabin&version=2} {add=[500 (1481235973179179008)]} 0 1
[junit4] 2> 574533 T1386 C97 oasup.LogUpdateProcessor.finish [collection1] webapp= path=/update params={wt=javabin&version=2} {add=[501 (1481235973183373312)]} 0 1
[junit4] 2> 574537 T1398 C98 oasup.LogUpdateProcessor.finish [collection1] webapp= path=/update params={wt=javabin&version=2} {add=[501 (1481235973187567616)]} 0 1
[junit4] 2> 574542 T1386 C97 oasup.LogUpdateProcessor.finish [collection1] webapp= path=/update params={wt=javabin&version=2} {add=[502 (1481235973192810496)]} 0 1
[junit4] 2> 574546 T1398 C98 oasup.LogUpdateProcessor.finish [collection1] webapp= path=/update params={wt=javabin&version=2} {add=[502 (1481235973197004800)]} 0 1
[junit4] 2> 574550 T1386 C97 oasup.LogUpdateProcessor.finish [collection1] webapp= path=/update params={wt=javabin&version=2} {add=[503 (1481235973201199104)]} 0 1
[junit4] 2> 574554 T1398 C98 oasup.LogUpdateProcessor.finish [collection1] webapp= path=/update params={wt=javabin&version=2} {add=[503 (1481235973206441984)]} 0 1
[junit4] 2> 574559 T1386 C97 oasup.LogUpdateProcessor.finish [collection1] webapp= path=/update params={wt=javabin&version=2} {add=[504 (1481235973210636288)]} 0 1
[junit4] 2> 574563 T1398 C98 oasup.LogUpdateProcessor.finish [collection1] webapp= path=/update params={wt=javabin&version=2} {add=[504 (1481235973214830592)]} 0 1
[junit4] 2> 574567 T1386 C97 oasup.LogUpdateProcessor.finish [collection1] webapp= path=/update params={wt=javabin&version=2} {add=[505 (1481235973219024896)]} 0 1
[junit4] 2> 574572 T1398 C98 oasup.LogUpdateProcessor.finish [collection1] webapp= path=/update params={wt=javabin&version=2} {add=[505 (1481235973224267776)]} 0 1
[junit4] 2> 574576 T1386 C97 oasup.LogUpdateProcessor.finish [collection1] webapp= path=/update params={wt=javabin&version=2} {add=[506 (1481235973228462080)]} 0 1
[junit4] 2> 574580 T1398 C98 oasup.LogUpdateProcessor.finish [collection1] webapp= path=/update params={wt=javabin&version=2} {add=[506 (1481235973232656384)]} 0 1
[junit4] 2> 574584 T1386 C97 oasup.LogUpdateProcessor.finish [collection1] webapp= path=/update params={wt=javabin&version=2} {add=[507 (1481235973236850688)]} 0 1
[junit4] 2> 574588 T1398 C98 oasup.LogUpdateProcessor.finish [collection1] webapp= path=/update params={wt=javabin&version=2} {add=[507 (1481235973241044992)]} 0 1
[junit4] 2> 574592 T1386 C97 oasup.LogUpdateProcessor.finish [collection1] webapp= path=/update params={wt=javabin&version=2} {add=[508 (1481235973245239296)]} 0 1
[junit4] 2> 574596 T1398 C98 oasup.LogUpdateProcessor.finish [collection1] webapp= path=/update params={wt=javabin&version=2} {add=[508 (1481235973249433600)]} 0 1
[junit4] 2> 574600 T1386 C97 oasup.LogUpdateProcessor.finish [collection1] webapp= path=/update params={wt=javabin&version=2} {add=[509 (1481235973253627904)]} 0 1
[junit4] 2> 574604 T1398 C98 oasup.LogUpdateProcessor.finish [collection1] webapp= path=/update params={wt=javabin&version=2} {add=[509 (1481235973257822208)]} 0 1
[junit4] 2> 574608 T1386 C97 oasup.LogUpdateProcessor.finish [collection1] webapp= path=/update params={wt=javabin&version=2} {add=[510 (1481235973262016512)]} 0 1
[junit4] 2> 574612 T1398 C98 oasup.LogUpdateProcessor.finish [collection1] webapp= path=/update params={wt=javabin&version=2} {add=[510 (1481235973266210816)]} 0 1
[junit4] 2> 574616 T1386 C97 oasup.LogUpdateProcessor.finish [collection1] webapp= path=/update params={wt=javabin&version=2} {add=[511 (1481235973270405120)]} 0 1
[junit4] 2> 574619 T1398 C98 oasup.LogUpdateProcessor.finish [collection1] webapp= path=/update params={wt=javabin&version=2} {add=[511 (1481235973273550848)]} 0 1
[junit4] 2> 574624 T1386 C97 oasup.LogUpdateProcessor.finish [collection1] webapp= path=/update params={wt=javabin&version=2} {add=[512 (1481235973278793728)]} 0 1
[junit4] 2> 574629 T1398 C98 oasup.LogUpdateProcessor.finish [collection1] webapp= path=/update params={wt=javabin&version=2} {add=[512 (1481235973285085184)]} 0 1
[junit4] 2> 574633 T1386 C97 oasup.LogUpdateProcessor.finish [collection1] webapp= path=/update params={wt=javabin&version=2} {add=[513 (1481235973288230912)]} 0 1
[junit4] 2> 574637 T1398 C98 oasup.LogUpdateProcessor.finish [collection1] webapp= path=/update params={wt=javabin&version=2} {add=[513 (1481235973292425216)]} 0 1
[junit4] 2> 574640 T1386 C97 oasup.LogUpdateProcessor.finish [collection1] webapp= path=/update params={wt=javabin&version=2} {add=[514 (1481235973296619520)]} 0 0
[junit4] 2> 574643 T1398 C98 oasup.LogUpdateProcessor.finish [collection1] webapp= path=/update params={wt=javabin&version=2} {add=[514 (1481235973299765248)]} 0 0
[junit4] 2> 574646 T1386 C97 oasup.LogUpdateProcessor.finish [collection1] webapp= path=/update params={wt=javabin&version=2} {add=[515 (1481235973302910976)]} 0 0
[junit4] 2> 574649 T1398 C98 oasup.LogUpdateProcessor.finish [collection1] webapp= path=/update params={wt=javabin&version=2} {add=[515 (1481235973306056704)]} 0 0
[junit4] 2> 574652 T1386 C97 oasup.LogUpdateProcessor.finish [collection1] webapp= path=/update params={wt=javabin&version=2} {add=[516 (1481235973309202432)]} 0 0
[junit4] 2> 574655 T1398 C98 oasup.LogUpdateProcessor.finish [collection1] webapp= path=/update params={wt=javabin&version=2} {add=[516 (1481235973312348160)]} 0 0
[junit4] 2> 574659 T1386 C97 oasup.LogUpdateProcessor.finish [collection1] webapp= path=/update params={wt=javabin&version=2} {add=[517 (1481235973316542464)]} 0 0
[junit4] 2> 574663 T1398 C98 oasup.LogUpdateProcessor.finish [collection1] webapp= path=/update params={wt=javabin&version=2} {add=[517 (1481235973320736768)]} 0 0
[junit4] 2> 574667 T1386 C97 oasup.LogUpdateProcessor.finish [collection1] webapp= path=/update params={wt=javabin&version=2} {add=[518 (1481235973323882496)]} 0 0
[junit4] 2> 574670 T1398 C98 oasup.LogUpdateProcessor.finish [collection1] webapp= path=/update params={wt=javabin&version=2} {add=[518 (1481235973328076800)]} 0 0
[junit4] 2> 574673 T1386 C97 oasup.LogUpdateProcessor.finish [collection1] webapp= path=/update params={wt=javabin&version=2} {add=[519 (1481235973331222528)]} 0 0
[junit4] 2> 574676 T1398 C98 oasup.LogUpdateProcessor.finish [collection1] webapp= path=/update params={wt=javabin&version=2} {add=[519 (1481235973334368256)]} 0 0
[junit4] 2> 574680 T1386 C97 oasup.LogUpdateProcessor.finish [collection1] webapp= path=/update params={wt=javabin&version=2} {add=[520 (1481235973337513984)]} 0 1
[junit4] 2> 574684 T1398 C98 oasup.LogUpdateProcessor.finish [collection1] webapp= path=/update params={wt=javabin&version=2} {add=[520 (1481235973341708288)]} 0 1
[junit4] 2> 574688 T1386 C97 oasup.LogUpdateProcessor.finish [collection1] webapp= path=/update params={wt=javabin&version=2} {add=[521 (1481235973345902592)]} 0 1
[junit4] 2> 574692 T1398 C98 oasup.LogUpdateProcessor.finish [collection1] webapp= path=/update params={wt=javabin&version=2} {add=[521 (1481235973350096896)]} 0 1
[junit4] 2> 574696 T1386 C97 oasup.LogUpdateProcessor.finish [collection1] webapp= path=/update params={wt=javabin&version=2} {add=[522 (1481235973354291200)]} 0 1
[junit4] 2> 574698 T1398 C98 oasup.LogUpdateProcessor.finish [collection1] webapp= path=/update params={wt=javabin&version=2} {add=[522 (1481235973357436928)]} 0 0
[junit4] 2> 574702 T1386 C97 oasup.LogUpdateProcessor.finish [collection1] webapp= path=/update params={wt=javabin&version=2} {add=[523 (1481235973360582656)]} 0 1
[junit4] 2> 574706 T1398 C98 oasup.LogUpdateProcessor.finish [collection1] webapp= path=/update params={wt=javabin&version=2} {add=[523 (1481235973364776960)]} 0 1
[junit4] 2> 574709 T1386 C97 oasup.LogUpdateProcessor.finish [collection1] webapp= path=/update params={wt=javabin&version=2} {add=[524 (1481235973368971264)]} 0 0
[junit4] 2> 574713 T1398 C98 oasup.LogUpdateProcessor.finish [collection1] webapp= path=/update params={wt=javabin&version=2} {add=[524 (1481235973372116992)]} 0 1
[junit4] 2> 574716 T1386 C97 oasup.LogUpdateProcessor.finish [collection1] webapp= path=/update params={wt=javabin&version=2} {add=[525 (1481235973376311296)]} 0 0
[junit4] 2> 574719 T1398 C98 oasup.LogUpdateProcessor.finish [collection1] webapp= path=/update params={wt=javabin&version=2} {add=[525 (1481235973379457024)]} 0 0
[junit4] 2> 574723 T1386 C97 oasup.LogUpdateProcessor.finish [collection1] webapp= path=/update params={wt=javabin&version=2} {add=[526 (1481235973382602752)]} 0 1
[junit4] 2> 574727 T1398 C98 oasup.LogUpdateProcessor.finish [collection1] webapp= path=/update params={wt=javabin&version=2} {add=[526 (1481235973386797056)]} 0 1
[junit4] 2> 574731 T1386 C97 oasup.LogUpdateProcessor.finish [collection1] webapp= path=/update params={wt=javabin&version=2} {add=[527 (1481235973390991360)]} 0 1
[junit4] 2> 574734 T1398 C98 oasup.LogUpdateProcessor.finish [collection1] webapp= path=/update params={wt=javabin&version=2} {add=[527 (1481235973395185664)]} 0 0
[junit4] 2> 574738 T1386 C97 oasup.LogUpdateProcessor.finish [collection1] webapp= path=/update params={wt=javabin&version=2} {add=[528 (1481235973398331392)]} 0 1
[junit4] 2> 574742 T1398 C98 oasup.LogUpdateProcessor.finish [collection1] webapp= path=/update params={wt=javabin&version=2} {add=[528 (1481235973402525696)]} 0 1
[junit4] 2> 574748 T1386 C97 oasup.LogUpdateProcessor.finish [collection1] webapp= path=/update params={wt=javabin&version=2} {add=[529 (1481235973408817152)]} 0 1
[junit4] 2> 574752 T1398 C98 oasup.LogUpdateProcessor.finish [collection1] webapp= path=/update params={wt=javabin&version=2} {add=[529 (1481235973413011456)]} 0 1
[junit4] 2> 574756 T1386 C97 oasup.LogUpdateProcessor.finish [collection1] webapp= path=/update params={wt=javabin&version=2} {add=[530 (1481235973417205760)]} 0 1
[junit4] 2> 574759 T1398 C98 oasup.LogUpdateProcessor.finish [collection1] webapp= path=/update params={wt=javabin&version=2} {add=[530 (1481235973421400064)]} 0 0
[junit4] 2> 574763 T1386 C97 oasup.LogUpdateProcessor.finish [collection1] webapp= path=/update params={wt=javabin&version=2} {add=[531 (1481235973424545792)]} 0 1
[junit4] 2> 574768 T1398 C98 oasup.LogUpdateProcessor.finish [collection1] webapp= path=/update params={wt=javabin&version=2} {add=[531 (1481235973429788672)]} 0 1
[junit4] 2> 574772 T1386 C97 oasup.LogUpdateProcessor.finish [collection1] webapp= path=/update params={wt=javabin&version=2} {add=[532 (1481235973433982976)]} 0 1
[junit4] 2> 574776 T1398 C98 oasup.LogUpdateProcessor.finish [collection1] webapp= path=/update params={wt=javabin&version=2} {add=[532 (1481235973438177280)]} 0 1
[junit4] 2> 574780 T1386 C97 oasup.LogUpdateProcessor.finish [collection1] webapp= path=/update params={wt=javabin&version=2} {add=[533 (1481235973442371584)]} 0 1
[junit4] 2> 574784 T1398 C98 oasup.LogUpdateProcessor.finish [collection1] webapp= path=/update params={wt=javabin&version=2} {add=[533 (1481235973446565888)]} 0 1
[junit4] 2> 574787 T1386 C97 oasup.LogUpdateProcessor.finish [collection1] webapp= path=/update params={wt=javabin&version=2} {add=[534 (1481235973450760192)]} 0 0
[junit4] 2> 574791 T1398 C98 oasup.LogUpdateProcessor.finish [collection1] webapp= path=/update params={wt=javabin&version=2} {add=[534 (1481235973453905920)]} 0 0
[junit4] 2> 574794 T1386 C97 oasup.LogUpdateProcessor.finish [collection1] webapp= path=/update params={wt=javabin&version=2} {add=[535 (1481235973457051648)]} 0 1
[junit4] 2> 574798 T1398 C98 oasup.LogUpdateProcessor.finish [collection1] webapp= path=/update params={wt=javabin&version=2} {add=[535 (1481235973461245952)]} 0 1
[junit4] 2> 574801 T1386 C97 oasup.LogUpdateProcessor.finish [collection1] webapp= path=/update params={wt=javabin&version=2} {add=[536 (1481235973464391680)]} 0 1
[junit4] 2> 574805 T1398 C98 oasup.LogUpdateProcessor.finish [collection1] webapp= path=/update params={wt=javabin&version=2} {add=[536 (1481235973468585984)]} 0 1
[junit4] 2> 574809 T1386 C97 oasup.LogUpdateProcessor.finish [collection1] webapp= path=/update params={wt=javabin&version=2} {add=[537 (1481235973472780288)]} 0 1
[junit4] 2> 574813 T1398 C98 oasup.LogUpdateProcessor.finish [collection1] webapp= path=/update params={wt=javabin&version=2} {add=[537 (1481235973476974592)]} 0 1
[junit4] 2> 574816 T1386 C97 oasup.LogUpdateProcessor.finish [collection1] webapp= path=/update params={wt=javabin&version=2} {add=[538 (1481235973480120320)]} 0 1
[junit4] 2> 574820 T1398 C98 oasup.LogUpdateProcessor.finish [collection1] webapp= path=/update params={wt=javabin&version=2} {add=[538 (1481235973484314624)]} 0 1
[junit4] 2> 574823 T1386 C97 oasup.LogUpdateProcessor.finish [collection1] webapp= path=/update params={wt=javabin&version=2} {add=[539 (1481235973487460352)]} 0 1
[junit4] 2> 574826 T1398 C98 oasup.LogUpdateProcessor.finish [collection1] webapp= path=/update params={wt=javabin&version=2} {add=[539 (1481235973490606080)]} 0 1
[junit4] 2> 574828 T1386 C97 oasup.LogUpdateProcessor.finish [collection1] webapp= path=/update params={wt=javabin&version=2} {add=[540 (1481235973493751808)]} 0 0
[junit4] 2> 574832 T1398 C98 oasup.LogUpdateProcessor.finish [collection1] webapp= path=/update params={wt=javabin&version=2} {add=[540 (1481235973496897536)]} 0 1
[junit4] 2> 574835 T1386 C97 oasup.LogUpdateProcessor.finish [collection1] webapp= path=/update params={wt=javabin&version=2} {add=[541 (1481235973501091840)]} 0 0
[junit4] 2> 574839 T1398 C98 oasup.LogUpdateProcessor.finish [collection1] webapp= path=/update params={wt=javabin&version=2} {add=[541 (1481235973504237568)]} 0 1
[junit4] 2> 574842 T1386 C97 oasup.LogUpdateProcessor.finish [collection1] webapp= path=/update params={wt=javabin&version=2} {add=[542 (1481235973508431872)]} 0 0
[junit4] 2> 574847 T1398 C98 oasup.LogUpdateProcessor.finish [collection1] webapp= path=/update params={wt=javabin&version=2} {add=[542 (1481235973512626176)]} 0 1
[junit4] 2> 574851 T1386 C97 oasup.LogUpdateProcessor.finish [collection1] webapp= path=/update params={wt=javabin&version=2} {add=[543 (1481235973516820480)]} 0 1
[junit4] 2> 574854 T1398 C98 oasup.LogUpdateProcessor.finish [collection1] webapp= path=/update params={wt=javabin&version=2} {add=[543 (1481235973519966208)]} 0 1
[junit4] 2> 574857 T1386 C97 oasup.LogUpdateProcessor.finish [collection1] webapp= path=/update params={wt=javabin&version=2} {add=[544 (1481235973524160512)]} 0 0
[junit4] 2> 574861 T1398 C98 oasup.LogUpdateProcessor.finish [collection1] webapp= path=/update params={wt=javabin&version=2} {add=[544 (1481235973527306240)]} 0 1
[junit4] 2> 574864 T1386 C97 oasup.LogUpdateProcessor.finish [collection1] webapp= path=/update params={wt=javabin&version=2} {add=[545 (1481235973531500544)]} 0 0
[junit4] 2> 574868 T1398 C98 oasup.LogUpdateProcessor.finish [collection1] webapp= path=/update params={wt=javabin&version=2} {add=[545 (1481235973534646272)]} 0 1
[junit4] 2> 574871 T1386 C97 oasup.LogUpdateProcessor.finish [collection1] webapp= path=/update params={wt=javabin&version=2} {add=[546 (1481235973538840576)]} 0 0
[junit4] 2> 574875 T1398 C98 oasup.LogUpdateProcessor.finish [collection1] webapp= path=/update params={wt=javabin&version=2} {add=[546 (1481235973543034880)]} 0 0
[junit4] 2> 574879 T1386 C97 oasup.LogUpdateProcessor.finish [collection1] webapp= path=/update params={wt=javabin&version=2} {add=[547 (1481235973546180608)]} 0 1
[junit4] 2> 574882 T1398 C98 oasup.LogUpdateProcessor.finish [collection1] webapp= path=/update params={wt=javabin&version=2} {add=[547 (1481235973550374912)]} 0 0
[junit4] 2> 574885 T1386 C97 oasup.LogUpdateProcessor.finish [collection1] webapp= path=/update params={wt=javabin
[...truncated too long message...]
83 oasc.CachingDirectoryFactory.close Closing directory: /usr/home/jenkins/jenkins-slave/workspace/Lucene-Solr-Tests-trunk-Java7/solr/build/solr-core/test/J3/temp/solr.TestDistributedGrouping-CA31735E47096E95-001/tempDir-001/shard1/data/index
[junit4] 2> 630641 T1383 oasc.CachingDirectoryFactory.closeCacheValue looking to close /usr/home/jenkins/jenkins-slave/workspace/Lucene-Solr-Tests-trunk-Java7/solr/build/solr-core/test/J3/temp/solr.TestDistributedGrouping-CA31735E47096E95-001/tempDir-001/shard1/data [CachedDir<<refCount=0;path=/usr/home/jenkins/jenkins-slave/workspace/Lucene-Solr-Tests-trunk-Java7/solr/build/solr-core/test/J3/temp/solr.TestDistributedGrouping-CA31735E47096E95-001/tempDir-001/shard1/data;done=false>>]
[junit4] 2> 630641 T1383 oasc.CachingDirectoryFactory.close Closing directory: /usr/home/jenkins/jenkins-slave/workspace/Lucene-Solr-Tests-trunk-Java7/solr/build/solr-core/test/J3/temp/solr.TestDistributedGrouping-CA31735E47096E95-001/tempDir-001/shard1/data
[junit4] 2> 630642 T1383 oejsh.ContextHandler.doStop stopped o.e.j.s.ServletContextHandler{/,null}
[junit4] 2> 635643 T1383 oasc.CoreContainer.shutdown Shutting down CoreContainer instance=1184078717
[junit4] 2> 635645 T1383 oasc.SolrCore.close [collection1] CLOSING SolrCore org.apache.solr.core.SolrCore@6131d379
[junit4] 2> 635668 T1383 oasu.DirectUpdateHandler2.close closing DirectUpdateHandler2{commits=2,autocommits=0,soft autocommits=0,optimizes=0,rollbacks=0,expungeDeletes=0,docsPending=0,adds=0,deletesById=0,deletesByQuery=0,errors=0,cumulative_adds=124,cumulative_deletesById=0,cumulative_deletesByQuery=1,cumulative_errors=0,transaction_logs_total_size=11345,transaction_logs_total_number=1}
[junit4] 2> 635669 T1383 oasu.SolrCoreState.decrefSolrCoreState Closing SolrCoreState
[junit4] 2> 635670 T1383 oasu.DefaultSolrCoreState.closeIndexWriter SolrCoreState ref count has reached 0 - closing IndexWriter
[junit4] 2> 635670 T1383 oasu.DefaultSolrCoreState.closeIndexWriter closing IndexWriter with IndexWriterCloser
[junit4] 2> 635674 T1383 oasc.SolrCore.closeSearcher [collection1] Closing main searcher on request.
[junit4] 2> 635675 T1383 oasc.CachingDirectoryFactory.close Closing MockDirectoryFactory - 2 directories currently being tracked
[junit4] 2> 635676 T1383 oasc.CachingDirectoryFactory.closeCacheValue looking to close /usr/home/jenkins/jenkins-slave/workspace/Lucene-Solr-Tests-trunk-Java7/solr/build/solr-core/test/J3/temp/solr.TestDistributedGrouping-CA31735E47096E95-001/tempDir-001/shard2/data [CachedDir<<refCount=0;path=/usr/home/jenkins/jenkins-slave/workspace/Lucene-Solr-Tests-trunk-Java7/solr/build/solr-core/test/J3/temp/solr.TestDistributedGrouping-CA31735E47096E95-001/tempDir-001/shard2/data;done=false>>]
[junit4] 2> 635676 T1383 oasc.CachingDirectoryFactory.close Closing directory: /usr/home/jenkins/jenkins-slave/workspace/Lucene-Solr-Tests-trunk-Java7/solr/build/solr-core/test/J3/temp/solr.TestDistributedGrouping-CA31735E47096E95-001/tempDir-001/shard2/data
[junit4] 2> 635677 T1383 oasc.CachingDirectoryFactory.closeCacheValue looking to close /usr/home/jenkins/jenkins-slave/workspace/Lucene-Solr-Tests-trunk-Java7/solr/build/solr-core/test/J3/temp/solr.TestDistributedGrouping-CA31735E47096E95-001/tempDir-001/shard2/data/index [CachedDir<<refCount=0;path=/usr/home/jenkins/jenkins-slave/workspace/Lucene-Solr-Tests-trunk-Java7/solr/build/solr-core/test/J3/temp/solr.TestDistributedGrouping-CA31735E47096E95-001/tempDir-001/shard2/data/index;done=false>>]
[junit4] 2> 635677 T1383 oasc.CachingDirectoryFactory.close Closing directory: /usr/home/jenkins/jenkins-slave/workspace/Lucene-Solr-Tests-trunk-Java7/solr/build/solr-core/test/J3/temp/solr.TestDistributedGrouping-CA31735E47096E95-001/tempDir-001/shard2/data/index
[junit4] 2> 635678 T1383 oejsh.ContextHandler.doStop stopped o.e.j.s.ServletContextHandler{/,null}
[junit4] 2> 640646 T1383 oas.SolrTestCaseJ4.tearDown ###Ending testDistribSearch
[junit4] 2> NOTE: reproduce with: ant test -Dtestcase=TestDistributedGrouping -Dtests.method=testDistribSearch -Dtests.seed=CA31735E47096E95 -Dtests.multiplier=2 -Dtests.slow=true -Dtests.locale=ja_JP_JP_#u-ca-japanese -Dtests.timezone=Canada/Eastern -Dtests.file.encoding=UTF-8
[junit4] ERROR 69.4s J3 | TestDistributedGrouping.testDistribSearch <<<
[junit4] > Throwable #1: org.apache.solr.client.solrj.impl.HttpSolrServer$RemoteSolrException: Request took too long during query expansion. Terminating request.
[junit4] > at __randomizedtesting.SeedInfo.seed([CA31735E47096E95:4BD7FD4630560EA9]:0)
[junit4] > at org.apache.solr.client.solrj.impl.HttpSolrServer.executeMethod(HttpSolrServer.java:570)
[junit4] > at org.apache.solr.client.solrj.impl.HttpSolrServer.request(HttpSolrServer.java:215)
[junit4] > at org.apache.solr.client.solrj.impl.HttpSolrServer.request(HttpSolrServer.java:211)
[junit4] > at org.apache.solr.client.solrj.request.QueryRequest.process(QueryRequest.java:91)
[junit4] > at org.apache.solr.client.solrj.SolrServer.query(SolrServer.java:301)
[junit4] > at org.apache.solr.BaseDistributedSearchTestCase.queryServer(BaseDistributedSearchTestCase.java:512)
[junit4] > at org.apache.solr.TestDistributedGrouping.simpleQuery(TestDistributedGrouping.java:274)
[junit4] > at org.apache.solr.TestDistributedGrouping.doTest(TestDistributedGrouping.java:262)
[junit4] > at org.apache.solr.BaseDistributedSearchTestCase.testDistribSearch(BaseDistributedSearchTestCase.java:875)
[junit4] > at java.lang.Thread.run(Thread.java:745)
[junit4] 2> 640660 T1383 oas.SolrTestCaseJ4.deleteCore ###deleteCore
[junit4] 2> NOTE: leaving temporary files on disk at: /usr/home/jenkins/jenkins-slave/workspace/Lucene-Solr-Tests-trunk-Java7/solr/build/solr-core/test/J3/temp/solr.TestDistributedGrouping-CA31735E47096E95-001
[junit4] 2> NOTE: test params are: codec=Asserting(Lucene50): {a_i1=PostingsFormat(name=Memory doPackFST= true), oddField_s=PostingsFormat(name=MockRandom), range_facet_l=PostingsFormat(name=Memory doPackFST= true), intDefault=PostingsFormat(name=Memory doPackFST= true), foo_f=PostingsFormat(name=MockRandom), multiDefault=PostingsFormat(name=Lucene41VarGapFixedInterval), n_d1=PostingsFormat(name=Memory doPackFST= true), SubjectTerms_mfacet=PostingsFormat(name=Memory doPackFST= true), n_l1=PostingsFormat(name=Memory doPackFST= true), id=PostingsFormat(name=SimpleText), foo_b=PostingsFormat(name=MockRandom), n_tf1=PostingsFormat(name=Memory doPackFST= true), b_n_tdt=PostingsFormat(name=Memory doPackFST= true), n_tl1=PostingsFormat(name=Lucene41VarGapFixedInterval), rnd_b=PostingsFormat(name=SimpleText), text=PostingsFormat(name=MockRandom), n_f1=PostingsFormat(name=Lucene41VarGapFixedInterval), other_tl1=PostingsFormat(name=Memory doPackFST= true), n_dt1=PostingsFormat(name=Lucene41VarGapFixedInterval), timestamp=PostingsFormat(name=Memory doPackFST= true), n_ti1=PostingsFormat(name=SimpleText), _version_=PostingsFormat(name=Memory doPackFST= true), a_t=PostingsFormat(name=Memory doPackFST= true), a_s=PostingsFormat(name=MockRandom), n_td1=PostingsFormat(name=Lucene41VarGapFixedInterval), foo_d=PostingsFormat(name=SimpleText), n_tdt1=PostingsFormat(name=Memory doPackFST= true), a_n_tdt=PostingsFormat(name=MockRandom)}, docValues:{timestamp=DocValuesFormat(name=Asserting)}, sim=RandomSimilarityProvider(queryNorm=true,coord=no): {}, locale=ja_JP_JP_#u-ca-japanese, timezone=Canada/Eastern
[junit4] 2> NOTE: FreeBSD 9.1-RELEASE-p3 amd64/Oracle Corporation 1.7.0_65 (64-bit)/cpus=16,threads=2,free=140960528,total=240123904
[junit4] 2> NOTE: All tests run in this JVM: [TestMiniSolrCloudCluster, TestSort, TermVectorComponentTest, ZkCLITest, ReplicationFactorTest, SolrInfoMBeanTest, DistributedExpandComponentTest, DistributedQueryComponentOptimizationTest, TestBadConfig, UniqFieldsUpdateProcessorFactoryTest, TestCSVResponseWriter, AsyncMigrateRouteKeyTest, CachingDirectoryFactoryTest, SearchHandlerTest, LeaderFailoverAfterPartitionTest, LeaderElectionTest, HdfsSyncSliceTest, WordBreakSolrSpellCheckerTest, TestFileDictionaryLookup, TestSearchPerf, TestDistributedGrouping]
[junit4] Completed on J3 in 69.46s, 1 test, 1 error <<< FAILURES!
[...truncated 1112 lines...]
BUILD FAILED
/usr/home/jenkins/jenkins-slave/workspace/Lucene-Solr-Tests-trunk-Java7/build.xml:524: The following error occurred while executing this line:
/usr/home/jenkins/jenkins-slave/workspace/Lucene-Solr-Tests-trunk-Java7/build.xml:472: The following error occurred while executing this line:
/usr/home/jenkins/jenkins-slave/workspace/Lucene-Solr-Tests-trunk-Java7/build.xml:61: The following error occurred while executing this line:
/usr/home/jenkins/jenkins-slave/workspace/Lucene-Solr-Tests-trunk-Java7/extra-targets.xml:39: The following error occurred while executing this line:
/usr/home/jenkins/jenkins-slave/workspace/Lucene-Solr-Tests-trunk-Java7/solr/build.xml:189: The following error occurred while executing this line:
/usr/home/jenkins/jenkins-slave/workspace/Lucene-Solr-Tests-trunk-Java7/solr/common-build.xml:496: The following error occurred while executing this line:
/usr/home/jenkins/jenkins-slave/workspace/Lucene-Solr-Tests-trunk-Java7/lucene/common-build.xml:1359: The following error occurred while executing this line:
/usr/home/jenkins/jenkins-slave/workspace/Lucene-Solr-Tests-trunk-Java7/lucene/common-build.xml:961: There were test failures: 436 suites, 1783 tests, 1 error, 58 ignored (23 assumptions)
Total time: 58 minutes 28 seconds
Build step 'Invoke Ant' marked build as failure
Archiving artifacts
Sending artifact delta relative to Lucene-Solr-Tests-trunk-Java7 #4905
Archived 5 artifacts
Archive block size is 32768
Received 0 blocks and 161730653 bytes
Compression is 0.0%
Took 30 sec
Recording test results
Email was triggered for: Failure
Sending email for trigger: Failure