You are viewing a plain text version of this content. The canonical link for it is here.
Posted to commits@karaf.apache.org by Apache Jenkins Server <je...@builds.apache.org> on 2012/10/01 22:21:01 UTC

Build failed in Jenkins: Karaf-2.2.x #760

See <https://builds.apache.org/job/Karaf-2.2.x/760/changes>

Changes:

[jbonofre] [KARAF-1849] Set the file mode in etc folder of the default distribution

------------------------------------------
[...truncated 8960 lines...]
Tests run: 0, Failures: 0, Errors: 0, Skipped: 0

[JENKINS] Recording test results[INFO] [bundle:bundle {execution: default-bundle}]

Downloading: http://repo1.maven.org/maven2/asm/asm/3.3.1/asm-3.3.1.pom
266b downloaded  (asm-3.3.1.pom)
Downloading: http://repo1.maven.org/maven2/asm/asm-parent/3.3.1/asm-parent-3.3.1.pom
4K downloaded  (asm-parent-3.3.1.pom)
Downloading: http://repo1.maven.org/maven2/asm/asm-commons/3.3.1/asm-commons-3.3.1.pom
417b downloaded  (asm-commons-3.3.1.pom)
Downloading: http://svn.apache.org/repos/asf/servicemix/m2-repo/asm/asm-tree/3.3.1/asm-tree-3.3.1.pom
[INFO] Unable to find resource 'asm:asm-tree:pom:3.3.1' in repository servicemix (http://svn.apache.org/repos/asf/servicemix/m2-repo)
Downloading: http://repo1.maven.org/maven2/asm/asm-tree/3.3.1/asm-tree-3.3.1.pom
406b downloaded  (asm-tree-3.3.1.pom)
Downloading: http://repo1.maven.org/maven2/org/jdom/jdom/1.1/jdom-1.1.pom
2K downloaded  (jdom-1.1.pom)
Downloading: http://repo1.maven.org/maven2/org/apache/maven/shared/maven-dependency-tree/1.1/maven-dependency-tree-1.1.pom
2K downloaded  (maven-dependency-tree-1.1.pom)
Downloading: http://repo1.maven.org/maven2/org/vafer/jdependency/0.7/jdependency-0.7.pom
7K downloaded  (jdependency-0.7.pom)
Downloading: http://svn.apache.org/repos/asf/servicemix/m2-repo/commons-io/commons-io/1.3.2/commons-io-1.3.2.pom
[INFO] Unable to find resource 'commons-io:commons-io:pom:1.3.2' in repository servicemix (http://svn.apache.org/repos/asf/servicemix/m2-repo)
Downloading: http://repo1.maven.org/maven2/commons-io/commons-io/1.3.2/commons-io-1.3.2.pom
9K downloaded  (commons-io-1.3.2.pom)
Downloading: http://svn.apache.org/repos/asf/servicemix/m2-repo/org/apache/commons/commons-parent/3/commons-parent-3.pom
[INFO] Unable to find resource 'org.apache.commons:commons-parent:pom:3' in repository servicemix (http://svn.apache.org/repos/asf/servicemix/m2-repo)
Downloading: http://repo1.maven.org/maven2/org/apache/commons/commons-parent/3/commons-parent-3.pom
11K downloaded  (commons-parent-3.pom)
Downloading: http://repo1.maven.org/maven2/org/apache/maven/shared/maven-dependency-tree/1.1/maven-dependency-tree-1.1.jar
Downloading: http://repo1.maven.org/maven2/org/jdom/jdom/1.1/jdom-1.1.jar
Downloading: http://repo1.maven.org/maven2/org/vafer/jdependency/0.7/jdependency-0.7.jar
Downloading: http://svn.apache.org/repos/asf/servicemix/m2-repo/commons-io/commons-io/1.3.2/commons-io-1.3.2.jar
Downloading: http://repo1.maven.org/maven2/asm/asm/3.3.1/asm-3.3.1.jar
33K downloaded  (maven-dependency-tree-1.1.jar)
42K downloaded  (asm-3.3.1.jar)
Downloading: http://repo1.maven.org/maven2/org/codehaus/plexus/plexus-utils/1.5.5/plexus-utils-1.5.5.jar
Downloading: http://repo1.maven.org/maven2/asm/asm-commons/3.3.1/asm-commons-3.3.1.jar
245K downloaded  (plexus-utils-1.5.5.jar)
11K downloaded  (jdependency-0.7.jar)
37K downloaded  (asm-commons-3.3.1.jar)
[INFO] Unable to find resource 'commons-io:commons-io:jar:1.3.2' in repository servicemix (http://svn.apache.org/repos/asf/servicemix/m2-repo)
Downloading: http://repo1.maven.org/maven2/commons-io/commons-io/1.3.2/commons-io-1.3.2.jar
149K downloaded  (jdom-1.1.jar)
85K downloaded  (commons-io-1.3.2.jar)
Downloading: http://svn.apache.org/repos/asf/servicemix/m2-repo/asm/asm-tree/3.3.1/asm-tree-3.3.1.jar
[INFO] Unable to find resource 'asm:asm-tree:jar:3.3.1' in repository servicemix (http://svn.apache.org/repos/asf/servicemix/m2-repo)
Downloading: http://repo1.maven.org/maven2/asm/asm-tree/3.3.1/asm-tree-3.3.1.jar
21K downloaded  (asm-tree-3.3.1.jar)
[INFO] [shade:shade {execution: default}]
[INFO] Excluding org.apache.sshd:sshd-core:jar:0.7.0 from the shaded jar.
[INFO] Excluding org.apache.mina:mina-core:jar:2.0.1 from the shaded jar.
[INFO] Including org.slf4j:slf4j-api:jar:1.6.6 in the shaded jar.
[INFO] Excluding org.apache.karaf.shell:org.apache.karaf.shell.console:jar:2.2.10-SNAPSHOT from the shaded jar.
[INFO] Excluding jline:jline:jar:2.7 from the shaded jar.
[INFO] Excluding org.fusesource.jansi:jansi:jar:1.9 from the shaded jar.
[INFO] Excluding org.osgi:org.osgi.core:jar:4.2.0 from the shaded jar.
[INFO] Excluding org.osgi:org.osgi.compendium:jar:4.2.0 from the shaded jar.
[INFO] Excluding org.apache.karaf.jaas:org.apache.karaf.jaas.boot:jar:2.2.10-SNAPSHOT from the shaded jar.
[INFO] Excluding org.apache.karaf.jaas:org.apache.karaf.jaas.modules:jar:2.2.10-SNAPSHOT from the shaded jar.
[INFO] Excluding org.apache.karaf.jaas:org.apache.karaf.jaas.config:jar:2.2.10-SNAPSHOT from the shaded jar.
[INFO] Excluding org.apache.karaf:org.apache.karaf.util:jar:2.2.10-SNAPSHOT from the shaded jar.
[INFO] Excluding org.apache.aries.blueprint:org.apache.aries.blueprint:jar:0.3.2 from the shaded jar.
[INFO] Excluding org.apache.aries:org.apache.aries.util:jar:0.3.1 from the shaded jar.
[INFO] Excluding org.apache.aries.testsupport:org.apache.aries.testsupport.unit:jar:0.3 from the shaded jar.
[INFO] Excluding org.apache.aries.proxy:org.apache.aries.proxy.api:jar:0.3 from the shaded jar.
[INFO] Excluding org.apache.felix:org.apache.felix.gogo.runtime:jar:0.10.0 from the shaded jar.
[INFO] Excluding org.slf4j:slf4j-simple:jar:1.6.6 from the shaded jar.
[INFO] No artifact matching filter org.slf4j:slf4j-nop
[INFO] Replacing original artifact with shaded artifact.
[INFO] Replacing <https://builds.apache.org/job/Karaf-2.2.x/ws/karaf/client/target/org.apache.karaf.client-2.2.10-SNAPSHOT.jar> with <https://builds.apache.org/job/Karaf-2.2.x/ws/karaf/client/target/org.apache.karaf.client-2.2.10-SNAPSHOT-shaded.jar>
[INFO] [install:install {execution: default-install}]
[INFO] Installing <https://builds.apache.org/job/Karaf-2.2.x/ws/karaf/client/target/org.apache.karaf.client-2.2.10-SNAPSHOT.jar> to <https://builds.apache.org/job/Karaf-2.2.x/ws/.repository/org/apache/karaf/org.apache.karaf.client/2.2.10-SNAPSHOT/org.apache.karaf.client-2.2.10-SNAPSHOT.jar>
[INFO] [bundle:install {execution: default-install}]
[INFO] Installing org/apache/karaf/org.apache.karaf.client/2.2.10-SNAPSHOT/org.apache.karaf.client-2.2.10-SNAPSHOT.jar
[INFO] Writing OBR metadata
[INFO] [bundle:cleanVersions {execution: cleanVersions}]
[WARNING] The parameter expression: 'project.build.resources' used in mojo: 'process' has been deprecated. Use 'project.resources' instead.
[INFO] [remote-resources:process {execution: default}]
[INFO] [antrun:run {execution: copy-notice}]
[INFO] Executing tasks

main:
     [copy] Copying 1 file to <https://builds.apache.org/job/Karaf-2.2.x/ws/karaf/client/target/maven-shared-archive-resources/META-INF>
[INFO] Executed tasks
[debug] execute contextualize
[INFO] [resources:resources {execution: default-resources}]
[INFO] Using 'UTF-8' encoding to copy filtered resources.
[INFO] Copying 2 resources
[INFO] Copying 3 resources
[INFO] Copying 3 resources
[INFO] [compiler:compile {execution: default-compile}]
[INFO] Nothing to compile - all classes are up to date
[debug] execute contextualize
[INFO] [resources:testResources {execution: default-testResources}]
[INFO] Using 'UTF-8' encoding to copy filtered resources.
[INFO] skip non existing resourceDirectory <https://builds.apache.org/job/Karaf-2.2.x/ws/karaf/client/src/test/resources>
[INFO] Copying 3 resources
[INFO] Copying 3 resources
[INFO] [compiler:testCompile {execution: default-testCompile}]
[INFO] No sources to compile
[INFO] [surefire:test {execution: default-test}]
[INFO] Skipping execution of surefire because it has already been run for this configuration
[JENKINS] Recording test results[INFO] [bundle:bundle {execution: default-bundle}]

[INFO] [shade:shade {execution: default}]
[INFO] Excluding org.apache.sshd:sshd-core:jar:0.7.0 from the shaded jar.
[INFO] Excluding org.apache.mina:mina-core:jar:2.0.1 from the shaded jar.
[INFO] Including org.slf4j:slf4j-api:jar:1.6.6 in the shaded jar.
[INFO] Excluding org.apache.karaf.shell:org.apache.karaf.shell.console:jar:2.2.10-SNAPSHOT from the shaded jar.
[INFO] Excluding jline:jline:jar:2.7 from the shaded jar.
[INFO] Excluding org.fusesource.jansi:jansi:jar:1.9 from the shaded jar.
[INFO] Excluding org.osgi:org.osgi.core:jar:4.2.0 from the shaded jar.
[INFO] Excluding org.osgi:org.osgi.compendium:jar:4.2.0 from the shaded jar.
[INFO] Excluding org.apache.karaf.jaas:org.apache.karaf.jaas.boot:jar:2.2.10-SNAPSHOT from the shaded jar.
[INFO] Excluding org.apache.karaf.jaas:org.apache.karaf.jaas.modules:jar:2.2.10-SNAPSHOT from the shaded jar.
[INFO] Excluding org.apache.karaf.jaas:org.apache.karaf.jaas.config:jar:2.2.10-SNAPSHOT from the shaded jar.
[INFO] Excluding org.apache.karaf:org.apache.karaf.util:jar:2.2.10-SNAPSHOT from the shaded jar.
[INFO] Excluding org.apache.aries.blueprint:org.apache.aries.blueprint:jar:0.3.2 from the shaded jar.
[INFO] Excluding org.apache.aries:org.apache.aries.util:jar:0.3.1 from the shaded jar.
[INFO] Excluding org.apache.aries.testsupport:org.apache.aries.testsupport.unit:jar:0.3 from the shaded jar.
[INFO] Excluding org.apache.aries.proxy:org.apache.aries.proxy.api:jar:0.3 from the shaded jar.
[INFO] Excluding org.apache.felix:org.apache.felix.gogo.runtime:jar:0.10.0 from the shaded jar.
[INFO] Excluding org.slf4j:slf4j-simple:jar:1.6.6 from the shaded jar.
[INFO] No artifact matching filter org.slf4j:slf4j-nop
[INFO] Replacing original artifact with shaded artifact.
[INFO] Replacing <https://builds.apache.org/job/Karaf-2.2.x/ws/karaf/client/target/org.apache.karaf.client-2.2.10-SNAPSHOT.jar> with <https://builds.apache.org/job/Karaf-2.2.x/ws/karaf/client/target/org.apache.karaf.client-2.2.10-SNAPSHOT-shaded.jar>
[INFO] [install:install {execution: default-install}]
[INFO] Installing <https://builds.apache.org/job/Karaf-2.2.x/ws/karaf/client/target/org.apache.karaf.client-2.2.10-SNAPSHOT.jar> to <https://builds.apache.org/job/Karaf-2.2.x/ws/.repository/org/apache/karaf/org.apache.karaf.client/2.2.10-SNAPSHOT/org.apache.karaf.client-2.2.10-SNAPSHOT.jar>
[INFO] [bundle:install {execution: default-install}]
[INFO] Installing org/apache/karaf/org.apache.karaf.client/2.2.10-SNAPSHOT/org.apache.karaf.client-2.2.10-SNAPSHOT.jar
[INFO] Writing OBR metadata
[INFO] [deploy:deploy {execution: default-deploy}]
[INFO] Retrieving previous build number from apache.snapshots.https
[WARNING] *** CHECKSUM FAILED - Checksum failed on download: local = 'afc831088bca540936765ebc6f48c39a5b6ad997'; remote = 'f6c0a2eda4bc37d41dd92407b25c1d0079c7ea01' - RETRYING
[WARNING] *** CHECKSUM FAILED - Checksum failed on download: local = 'afc831088bca540936765ebc6f48c39a5b6ad997'; remote = 'f6c0a2eda4bc37d41dd92407b25c1d0079c7ea01' - IGNORING
Uploading: https://repository.apache.org/content/repositories/snapshots/org/apache/karaf/org.apache.karaf.client/2.2.10-SNAPSHOT/org.apache.karaf.client-2.2.10-20121001.201332-53.jar
45K uploaded  (org.apache.karaf.client-2.2.10-20121001.201332-53.jar)
[INFO] Retrieving previous metadata from apache.snapshots.https
[INFO] Uploading repository metadata for: 'artifact org.apache.karaf:org.apache.karaf.client'
[INFO] Uploading project information for org.apache.karaf.client 2.2.10-20121001.201332-53
[INFO] Retrieving previous metadata from apache.snapshots.https
[WARNING] *** CHECKSUM FAILED - Checksum failed on download: local = 'afc831088bca540936765ebc6f48c39a5b6ad997'; remote = 'f6c0a2eda4bc37d41dd92407b25c1d0079c7ea01' - RETRYING
[WARNING] *** CHECKSUM FAILED - Checksum failed on download: local = 'afc831088bca540936765ebc6f48c39a5b6ad997'; remote = 'f6c0a2eda4bc37d41dd92407b25c1d0079c7ea01' - IGNORING
[INFO] Uploading repository metadata for: 'snapshot org.apache.karaf:org.apache.karaf.client:2.2.10-SNAPSHOT'
[INFO] [bundle:deploy {execution: default-deploy}]
[INFO] Remote OBR update disabled (enable with -DremoteOBR)
[JENKINS] Archiving <https://builds.apache.org/job/Karaf-2.2.x/ws/karaf/client/target/dependency-reduced-pom.xml> to /home/hudson/hudson/jobs/Karaf-2.2.x/modules/org.apache.karaf$org.apache.karaf.client/builds/2012-10-01_20-11-40/archive/org.apache.karaf/org.apache.karaf.client/2.2.10-SNAPSHOT/org.apache.karaf.client-2.2.10-SNAPSHOT.pom
[JENKINS] Archiving <https://builds.apache.org/job/Karaf-2.2.x/ws/karaf/client/target/org.apache.karaf.client-2.2.10-SNAPSHOT.jar> to /home/hudson/hudson/jobs/Karaf-2.2.x/modules/org.apache.karaf$org.apache.karaf.client/builds/2012-10-01_20-11-40/archive/org.apache.karaf/org.apache.karaf.client/2.2.10-20121001.201332-53/org.apache.karaf.client-2.2.10-20121001.201332-53.jar
[INFO] ------------------------------------------------------------------------
[INFO] Building Apache Karaf :: Management :: MBeans
[INFO]    task-segment: [clean, install, deploy]
[INFO] ------------------------------------------------------------------------
[INFO] [clean:clean {execution: default-clean}]
[INFO] [bundle:cleanVersions {execution: cleanVersions}]
[WARNING] The parameter expression: 'project.build.resources' used in mojo: 'process' has been deprecated. Use 'project.resources' instead.
[INFO] [remote-resources:process {execution: default}]
[INFO] [antrun:run {execution: copy-notice}]
[INFO] Executing tasks

main:
     [copy] Warning: Could not find file <https://builds.apache.org/job/Karaf-2.2.x/ws/karaf/management/mbeans/NOTICE> to copy.
[INFO] Executed tasks
[INFO] [site:attach-descriptor {execution: default-attach-descriptor}]
[INFO] [install:install {execution: default-install}]
[INFO] Installing <https://builds.apache.org/job/Karaf-2.2.x/ws/karaf/management/mbeans/pom.xml> to <https://builds.apache.org/job/Karaf-2.2.x/ws/.repository/org/apache/karaf/management/mbeans/mbeans/2.2.10-SNAPSHOT/mbeans-2.2.10-SNAPSHOT.pom>
[INFO] [bundle:cleanVersions {execution: cleanVersions}]
[WARNING] The parameter expression: 'project.build.resources' used in mojo: 'process' has been deprecated. Use 'project.resources' instead.
[INFO] [remote-resources:process {execution: default}]
[INFO] [antrun:run {execution: copy-notice}]
[INFO] Executing tasks

main:
     [copy] Warning: Could not find file <https://builds.apache.org/job/Karaf-2.2.x/ws/karaf/management/mbeans/NOTICE> to copy.
[INFO] Executed tasks
[INFO] [site:attach-descriptor {execution: default-attach-descriptor}]
[INFO] [install:install {execution: default-install}]
[INFO] Installing <https://builds.apache.org/job/Karaf-2.2.x/ws/karaf/management/mbeans/pom.xml> to <https://builds.apache.org/job/Karaf-2.2.x/ws/.repository/org/apache/karaf/management/mbeans/mbeans/2.2.10-SNAPSHOT/mbeans-2.2.10-SNAPSHOT.pom>
[INFO] [deploy:deploy {execution: default-deploy}]
[INFO] Retrieving previous build number from apache.snapshots.https
[WARNING] *** CHECKSUM FAILED - Checksum failed on download: local = 'f13cd3dd63f1f1d84e23019d4dad9ed2b8ac8f92'; remote = 'aa74a84045f855341d1708857091d55d511775db' - RETRYING
[WARNING] *** CHECKSUM FAILED - Checksum failed on download: local = 'f13cd3dd63f1f1d84e23019d4dad9ed2b8ac8f92'; remote = 'aa74a84045f855341d1708857091d55d511775db' - IGNORING
Uploading: https://repository.apache.org/content/repositories/snapshots/org/apache/karaf/management/mbeans/mbeans/2.2.10-SNAPSHOT/mbeans-2.2.10-20121001.201332-53.pom
1K uploaded  (mbeans-2.2.10-20121001.201332-53.pom)
[INFO] Retrieving previous metadata from apache.snapshots.https
[INFO] Uploading repository metadata for: 'artifact org.apache.karaf.management.mbeans:mbeans'
[INFO] Retrieving previous metadata from apache.snapshots.https
[WARNING] *** CHECKSUM FAILED - Checksum failed on download: local = 'f13cd3dd63f1f1d84e23019d4dad9ed2b8ac8f92'; remote = 'aa74a84045f855341d1708857091d55d511775db' - RETRYING
[WARNING] *** CHECKSUM FAILED - Checksum failed on download: local = 'f13cd3dd63f1f1d84e23019d4dad9ed2b8ac8f92'; remote = 'aa74a84045f855341d1708857091d55d511775db' - IGNORING
[INFO] Uploading repository metadata for: 'snapshot org.apache.karaf.management.mbeans:mbeans:2.2.10-SNAPSHOT'
[JENKINS] Archiving <https://builds.apache.org/job/Karaf-2.2.x/ws/karaf/management/mbeans/pom.xml> to /home/hudson/hudson/jobs/Karaf-2.2.x/modules/org.apache.karaf.management.mbeans$mbeans/builds/2012-10-01_20-11-40/archive/org.apache.karaf.management.mbeans/mbeans/2.2.10-SNAPSHOT/mbeans-2.2.10-SNAPSHOT.pom
[JENKINS] Archiving <https://builds.apache.org/job/Karaf-2.2.x/ws/.repository/org/apache/karaf/management/mbeans/mbeans/2.2.10-SNAPSHOT/mbeans-2.2.10-SNAPSHOT.pom> to /home/hudson/hudson/jobs/Karaf-2.2.x/modules/org.apache.karaf.management.mbeans$mbeans/builds/2012-10-01_20-11-40/archive/org.apache.karaf.management.mbeans/mbeans/2.2.10-20121001.201332-53/mbeans-2.2.10-20121001.201332-53.pom
[INFO] ------------------------------------------------------------------------
[INFO] Building Apache Karaf :: Management :: MBeans :: Bundles
[INFO]    task-segment: [clean, install, deploy]
[INFO] ------------------------------------------------------------------------
[INFO] [clean:clean {execution: default-clean}]
[INFO] [bundle:cleanVersions {execution: cleanVersions}]
[WARNING] The parameter expression: 'project.build.resources' used in mojo: 'process' has been deprecated. Use 'project.resources' instead.
[INFO] [remote-resources:process {execution: default}]
[INFO] [antrun:run {execution: copy-notice}]
[INFO] Executing tasks

main:
     [copy] Copying 1 file to <https://builds.apache.org/job/Karaf-2.2.x/ws/karaf/management/mbeans/bundles/target/maven-shared-archive-resources/META-INF>
[INFO] Executed tasks
[debug] execute contextualize
[INFO] [resources:resources {execution: default-resources}]
[INFO] Using 'UTF-8' encoding to copy filtered resources.
[INFO] Copying 2 resources
[INFO] Copying 1 resource
[INFO] Copying 3 resources
[INFO] [compiler:compile {execution: default-compile}]
[INFO] Compiling 3 source files to <https://builds.apache.org/job/Karaf-2.2.x/ws/karaf/management/mbeans/bundles/target/classes>
[debug] execute contextualize
[INFO] [resources:testResources {execution: default-testResources}]
[INFO] Using 'UTF-8' encoding to copy filtered resources.
[INFO] skip non existing resourceDirectory <https://builds.apache.org/job/Karaf-2.2.x/ws/karaf/management/mbeans/bundles/src/test/resources>
[INFO] Copying 3 resources
[INFO] [compiler:testCompile {execution: default-testCompile}]
[INFO] No sources to compile
[INFO] [surefire:test {execution: default-test}]
[INFO] Surefire report directory: <https://builds.apache.org/job/Karaf-2.2.x/ws/karaf/management/mbeans/bundles/target/surefire-reports>

-------------------------------------------------------
 T E S T S
-------------------------------------------------------

Results :

Tests run: 0, Failures: 0, Errors: 0, Skipped: 0

[JENKINS] Recording test results[INFO] [bundle:bundle {execution: default-bundle}]
Oct 1, 2012 8:20:57 PM hudson.remoting.SynchronousCommandTransport$ReaderThread run
SEVERE: I/O error in channel channel
java.io.StreamCorruptedException
	at java.io.ObjectInputStream.readObject0(ObjectInputStream.java:1332)
	at java.io.ObjectInputStream.readObject(ObjectInputStream.java:348)
	at hudson.remoting.Command.readFrom(Command.java:90)
	at hudson.remoting.ClassicCommandTransport.read(ClassicCommandTransport.java:59)
	at hudson.remoting.SynchronousCommandTransport$ReaderThread.run(SynchronousCommandTransport.java:48)
channel stopped

[INFO] [install:install {execution: default-install}]
[INFO] Installing <https://builds.apache.org/job/Karaf-2.2.x/ws/karaf/management/mbeans/bundles/target/org.apache.karaf.management.mbeans.bundles-2.2.10-SNAPSHOT.jar> to <https://builds.apache.org/job/Karaf-2.2.x/ws/.repository/org/apache/karaf/management/mbeans/org.apache.karaf.management.mbeans.bundles/2.2.10-SNAPSHOT/org.apache.karaf.management.mbeans.bundles-2.2.10-SNAPSHOT.jar>
[INFO] [bundle:install {execution: default-install}]
[INFO] Installing org/apache/karaf/management/mbeans/org.apache.karaf.management.mbeans.bundles/2.2.10-SNAPSHOT/org.apache.karaf.management.mbeans.bundles-2.2.10-SNAPSHOT.jar
[INFO] Writing OBR metadata
ERROR: Maven JVM terminated unexpectedly with exit code 0


Jenkins build is back to normal : Karaf-2.2.x #763

Posted by Apache Jenkins Server <je...@builds.apache.org>.
See <https://builds.apache.org/job/Karaf-2.2.x/763/>


Build failed in Jenkins: Karaf-2.2.x #762

Posted by Apache Jenkins Server <je...@builds.apache.org>.
See <https://builds.apache.org/job/Karaf-2.2.x/762/changes>

Changes:

[jbonofre] [KARAF-1828] Build src distribution in specific profile

[jbonofre] [KARAF-1849] Fix file mode in the minimal distribution

[jbonofre] [KARAF-1849] Fix file mode in lib and system folder of the standard distribution

[jbonofre] [KARAF-1849] Change file mode of the demos files in the distribution

------------------------------------------
[...truncated 2535 lines...]
[INFO] [remote-resources:process {execution: default}]
[INFO] [antrun:run {execution: copy-notice}]
[INFO] Executing tasks

main:
     [copy] Copying 1 file to <https://builds.apache.org/job/Karaf-2.2.x/ws/karaf/util/target/maven-shared-archive-resources/META-INF>
[INFO] Executed tasks
[debug] execute contextualize
[INFO] [resources:resources {execution: default-resources}]
[INFO] Using 'UTF-8' encoding to copy filtered resources.
[INFO] skip non existing resourceDirectory <https://builds.apache.org/job/Karaf-2.2.x/ws/karaf/util/src/main/resources>
[INFO] Copying 3 resources
[INFO] Copying 3 resources
[INFO] [compiler:compile {execution: default-compile}]
[INFO] Nothing to compile - all classes are up to date
[debug] execute contextualize
[INFO] [resources:testResources {execution: default-testResources}]
[INFO] Using 'UTF-8' encoding to copy filtered resources.
[INFO] Copying 1 resource
[INFO] Copying 3 resources
[INFO] Copying 3 resources
[INFO] [compiler:testCompile {execution: default-testCompile}]
[INFO] Nothing to compile - all classes are up to date
[INFO] [surefire:test {execution: default-test}]
[INFO] Skipping execution of surefire because it has already been run for this configuration
[JENKINS] Recording test results
[INFO] [jar:jar {execution: default-jar}]
[INFO] [install:install {execution: default-install}]
[INFO] Installing <https://builds.apache.org/job/Karaf-2.2.x/ws/karaf/util/target/org.apache.karaf.util-2.2.10-SNAPSHOT.jar> to <https://builds.apache.org/job/Karaf-2.2.x/ws/.repository/org/apache/karaf/org.apache.karaf.util/2.2.10-SNAPSHOT/org.apache.karaf.util-2.2.10-SNAPSHOT.jar>
[INFO] [deploy:deploy {execution: default-deploy}]
[INFO] Retrieving previous build number from apache.snapshots.https
Uploading: https://repository.apache.org/content/repositories/snapshots/org/apache/karaf/org.apache.karaf.util/2.2.10-SNAPSHOT/org.apache.karaf.util-2.2.10-20121002.051322-61.jar
35K uploaded  (org.apache.karaf.util-2.2.10-20121002.051322-61.jar)
[INFO] Retrieving previous metadata from apache.snapshots.https
[INFO] Uploading repository metadata for: 'artifact org.apache.karaf:org.apache.karaf.util'
[INFO] Retrieving previous metadata from apache.snapshots.https
[INFO] Uploading repository metadata for: 'snapshot org.apache.karaf:org.apache.karaf.util:2.2.10-SNAPSHOT'
[INFO] Uploading project information for org.apache.karaf.util 2.2.10-20121002.051322-61
[JENKINS] Archiving <https://builds.apache.org/job/Karaf-2.2.x/ws/karaf/util/pom.xml> to /home/hudson/hudson/jobs/Karaf-2.2.x/modules/org.apache.karaf$org.apache.karaf.util/builds/2012-10-02_05-12-21/archive/org.apache.karaf/org.apache.karaf.util/2.2.10-SNAPSHOT/org.apache.karaf.util-2.2.10-SNAPSHOT.pom
[JENKINS] Archiving <https://builds.apache.org/job/Karaf-2.2.x/ws/karaf/util/target/org.apache.karaf.util-2.2.10-SNAPSHOT.jar> to /home/hudson/hudson/jobs/Karaf-2.2.x/modules/org.apache.karaf$org.apache.karaf.util/builds/2012-10-02_05-12-21/archive/org.apache.karaf/org.apache.karaf.util/2.2.10-20121002.051322-61/org.apache.karaf.util-2.2.10-20121002.051322-61.jar
[INFO] ------------------------------------------------------------------------
[INFO] Building Apache Karaf :: Main
[INFO]    task-segment: [clean, install, deploy]
[INFO] ------------------------------------------------------------------------
[INFO] [clean:clean {execution: default-clean}]
[INFO] [bundle:cleanVersions {execution: cleanVersions}]
[WARNING] The parameter expression: 'project.build.resources' used in mojo: 'process' has been deprecated. Use 'project.resources' instead.
[INFO] [remote-resources:process {execution: default}]
[INFO] [antrun:run {execution: copy-notice}]
[INFO] Executing tasks

main:
     [copy] Copying 1 file to <https://builds.apache.org/job/Karaf-2.2.x/ws/karaf/main/target/maven-shared-archive-resources/META-INF>
[INFO] Executed tasks
[debug] execute contextualize
[INFO] [resources:resources {execution: default-resources}]
[INFO] Using 'UTF-8' encoding to copy filtered resources.
[INFO] Copying 2 resources
[INFO] Copying 3 resources
[INFO] [compiler:compile {execution: default-compile}]
[INFO] Compiling 15 source files to <https://builds.apache.org/job/Karaf-2.2.x/ws/karaf/main/target/classes>
[debug] execute contextualize
[INFO] [resources:testResources {execution: default-testResources}]
[INFO] Using 'UTF-8' encoding to copy filtered resources.
[INFO] Copying 5 resources
[INFO] Copying 3 resources
[INFO] [compiler:testCompile {execution: default-testCompile}]
[INFO] Compiling 16 source files to <https://builds.apache.org/job/Karaf-2.2.x/ws/karaf/main/target/test-classes>
[INFO] [surefire:test {execution: default-test}]
[INFO] Surefire report directory: <https://builds.apache.org/job/Karaf-2.2.x/ws/karaf/main/target/surefire-reports>

-------------------------------------------------------
 T E S T S
-------------------------------------------------------
Running org.apache.karaf.main.DerbyJDBCLockTest
Oct 2, 2012 5:13:57 AM org.apache.karaf.main.DefaultJDBCLock schemaExists
SEVERE: Error testing for db table: java.lang.NullPointerException
Oct 2, 2012 5:13:57 AM org.apache.karaf.main.DefaultJDBCLock createSchema
SEVERE: Could not create schema: java.lang.IllegalStateException: missing behavior definition for the preceding method call:
Connection.getMetaData()
Usage is: expect(a.foo()).andXXX()
Oct 2, 2012 5:13:57 AM org.apache.karaf.main.DefaultJDBCLock updateLock
WARNING: Failed to update database lock: java.sql.SQLException
Oct 2, 2012 5:13:57 AM org.apache.karaf.main.DefaultJDBCLock updateLock
WARNING: Failed to update database lock: java.sql.SQLException
Oct 2, 2012 5:13:57 AM org.apache.karaf.main.DefaultJDBCLock isAlive
SEVERE: Lost lock!
Oct 2, 2012 5:13:57 AM org.apache.karaf.main.DefaultJDBCLock isAlive
SEVERE: Lost lock!
Oct 2, 2012 5:13:57 AM org.apache.karaf.main.DefaultJDBCLock updateLock
WARNING: Failed to update database lock: java.sql.SQLException
Tests run: 14, Failures: 0, Errors: 0, Skipped: 0, Time elapsed: 0.229 sec
Running org.apache.karaf.main.DefaultJDBCLockTest
Oct 2, 2012 5:13:57 AM org.apache.karaf.main.DefaultJDBCLock schemaExists
SEVERE: Error testing for db table: java.lang.NullPointerException
Oct 2, 2012 5:13:57 AM org.apache.karaf.main.DefaultJDBCLock createSchema
SEVERE: Could not create schema: java.lang.IllegalStateException: missing behavior definition for the preceding method call:
Connection.getMetaData()
Usage is: expect(a.foo()).andXXX()
Oct 2, 2012 5:13:57 AM org.apache.karaf.main.DefaultJDBCLock updateLock
WARNING: Failed to update database lock: java.sql.SQLException
Oct 2, 2012 5:13:57 AM org.apache.karaf.main.DefaultJDBCLock updateLock
WARNING: Failed to update database lock: java.sql.SQLException
Oct 2, 2012 5:13:57 AM org.apache.karaf.main.DefaultJDBCLock isAlive
SEVERE: Lost lock!
Oct 2, 2012 5:13:57 AM org.apache.karaf.main.DefaultJDBCLock isAlive
SEVERE: Lost lock!
Oct 2, 2012 5:13:57 AM org.apache.karaf.main.DefaultJDBCLock updateLock
WARNING: Failed to update database lock: java.sql.SQLException
Tests run: 14, Failures: 0, Errors: 0, Skipped: 0, Time elapsed: 0.03 sec
Running org.apache.karaf.main.OracleJDBCLockIntegrationTest
Tests run: 1, Failures: 0, Errors: 0, Skipped: 1, Time elapsed: 0 sec
Running org.apache.karaf.main.MySQLJDBCLockIntegrationTest
Tests run: 1, Failures: 0, Errors: 0, Skipped: 1, Time elapsed: 0 sec
Running org.apache.karaf.main.DerbyJDBCLockIntegrationTest
Tests run: 1, Failures: 0, Errors: 0, Skipped: 1, Time elapsed: 0.003 sec
Running org.apache.karaf.main.StatementsTest
Tests run: 6, Failures: 0, Errors: 0, Skipped: 0, Time elapsed: 0.001 sec
Running org.apache.karaf.main.DefaultJDBCLockIntegrationTest
Tests run: 1, Failures: 0, Errors: 0, Skipped: 1, Time elapsed: 0 sec
Running org.apache.karaf.main.MySQLJDBCLockTest
Oct 2, 2012 5:13:57 AM org.apache.karaf.main.DefaultJDBCLock schemaExists
SEVERE: Error testing for db table: java.lang.NullPointerException
Oct 2, 2012 5:13:57 AM org.apache.karaf.main.DefaultJDBCLock createSchema
SEVERE: Could not create schema: java.lang.IllegalStateException: missing behavior definition for the preceding method call:
Connection.getMetaData()
Usage is: expect(a.foo()).andXXX()
Oct 2, 2012 5:13:57 AM org.apache.karaf.main.DefaultJDBCLock updateLock
WARNING: Failed to update database lock: java.sql.SQLException
Oct 2, 2012 5:13:57 AM org.apache.karaf.main.DefaultJDBCLock updateLock
WARNING: Failed to update database lock: java.sql.SQLException
Oct 2, 2012 5:13:57 AM org.apache.karaf.main.DefaultJDBCLock isAlive
SEVERE: Lost lock!
Oct 2, 2012 5:13:57 AM org.apache.karaf.main.DefaultJDBCLock isAlive
SEVERE: Lost lock!
Oct 2, 2012 5:13:57 AM org.apache.karaf.main.DefaultJDBCLock updateLock
WARNING: Failed to update database lock: java.sql.SQLException
Tests run: 14, Failures: 0, Errors: 0, Skipped: 0, Time elapsed: 0.028 sec
Running org.apache.karaf.main.PostgreSQLJDBCLockTest
Oct 2, 2012 5:13:57 AM org.apache.karaf.main.DefaultJDBCLock schemaExists
SEVERE: Error testing for db table: java.lang.NullPointerException
Oct 2, 2012 5:13:57 AM org.apache.karaf.main.DefaultJDBCLock createSchema
SEVERE: Could not create schema: java.lang.IllegalStateException: missing behavior definition for the preceding method call:
Connection.getMetaData()
Usage is: expect(a.foo()).andXXX()
Oct 2, 2012 5:13:57 AM org.apache.karaf.main.DefaultJDBCLock updateLock
WARNING: Failed to update database lock: java.sql.SQLException
Oct 2, 2012 5:13:57 AM org.apache.karaf.main.DefaultJDBCLock updateLock
WARNING: Failed to update database lock: java.sql.SQLException
Oct 2, 2012 5:13:57 AM org.apache.karaf.main.DefaultJDBCLock isAlive
SEVERE: Lost lock!
Oct 2, 2012 5:13:57 AM org.apache.karaf.main.DefaultJDBCLock isAlive
SEVERE: Lost lock!
Oct 2, 2012 5:13:57 AM org.apache.karaf.main.DefaultJDBCLock updateLock
WARNING: Failed to update database lock: java.sql.SQLException
Tests run: 14, Failures: 0, Errors: 0, Skipped: 0, Time elapsed: 0.028 sec
Running org.apache.karaf.main.MainStartTest
Oct 2, 2012 5:13:57 AM org.apache.karaf.main.SimpleFileLock lock
INFO: locking
Oct 2, 2012 5:13:58 AM org.ops4j.pax.swissbox.tinybundles.core.metadata.RawBuilder$1 run
INFO: Copy thread finished.
Oct 2, 2012 5:14:08 AM org.apache.karaf.main.SimpleFileLock release
INFO: releasing
Tests run: 2, Failures: 0, Errors: 0, Skipped: 1, Time elapsed: 11.449 sec
Running org.apache.karaf.main.PostgreSQLJDBCLockIntegrationTest
Tests run: 1, Failures: 0, Errors: 0, Skipped: 1, Time elapsed: 0 sec
Running org.apache.karaf.main.StringMapTest
Tests run: 1, Failures: 0, Errors: 0, Skipped: 0, Time elapsed: 0 sec
Running org.apache.karaf.main.OracleJDBCLockTest
Oct 2, 2012 5:14:08 AM org.apache.karaf.main.DefaultJDBCLock aquireLock
WARNING: Failed to acquire database lock: java.sql.SQLException
Oct 2, 2012 5:14:08 AM org.apache.karaf.main.DefaultJDBCLock aquireLock
WARNING: Failed to acquire database lock: java.sql.SQLException
Oct 2, 2012 5:14:08 AM org.apache.karaf.main.DefaultJDBCLock aquireLock
WARNING: Failed to acquire database lock: java.sql.SQLException
Oct 2, 2012 5:14:08 AM org.apache.karaf.main.DefaultJDBCLock isAlive
SEVERE: Lost lock!
Oct 2, 2012 5:14:08 AM org.apache.karaf.main.DefaultJDBCLock isAlive
SEVERE: Lost lock!
Tests run: 13, Failures: 0, Errors: 0, Skipped: 0, Time elapsed: 0.002 sec

Results :

Tests run: 83, Failures: 0, Errors: 0, Skipped: 6

[JENKINS] Recording test results
Oct 2, 2012 5:14:09 AM hudson.remoting.SynchronousCommandTransport$ReaderThread run
SEVERE: I/O error in channel channel
java.io.StreamCorruptedException
	at java.io.ObjectInputStream.readObject0(ObjectInputStream.java:1332)
	at java.io.ObjectInputStream.readObject(ObjectInputStream.java:348)
	at hudson.remoting.Command.readFrom(Command.java:90)
	at hudson.remoting.ClassicCommandTransport.read(ClassicCommandTransport.java:59)
	at hudson.remoting.SynchronousCommandTransport$ReaderThread.run(SynchronousCommandTransport.java:48)
[INFO] ------------------------------------------------------------------------
[ERROR] FATAL ERRORchannel stopped

[INFO] ------------------------------------------------------------------------
[INFO] null
[INFO] ------------------------------------------------------------------------
[INFO] Trace
java.lang.reflect.UndeclaredThrowableException
	at $Proxy2.isArchivingDisabled(Unknown Source)
	at hudson.maven.MavenBuildProxy$Filter.isArchivingDisabled(MavenBuildProxy.java:227)
	at hudson.maven.reporters.MavenArtifact.archive(MavenArtifact.java:223)
	at hudson.maven.reporters.MavenArtifactArchiver.postBuild(MavenArtifactArchiver.java:108)
	at hudson.maven.Maven2Builder.postModule(Maven2Builder.java:127)
	at hudson.maven.MavenBuilder$Adapter.fireLeaveModule(MavenBuilder.java:327)
	at hudson.maven.MavenBuilder$Adapter.postBuild(MavenBuilder.java:285)
	at org.apache.maven.lifecycle.LifecycleExecutorInterceptor.execute(LifecycleExecutorInterceptor.java:68)
	at org.apache.maven.DefaultMaven.doExecute(DefaultMaven.java:328)
	at org.apache.maven.DefaultMaven.execute(DefaultMaven.java:138)
	at org.apache.maven.cli.MavenCli.main(MavenCli.java:362)
	at sun.reflect.NativeMethodAccessorImpl.invoke0(Native Method)
	at sun.reflect.NativeMethodAccessorImpl.invoke(NativeMethodAccessorImpl.java:39)
	at sun.reflect.DelegatingMethodAccessorImpl.invoke(DelegatingMethodAccessorImpl.java:25)
	at java.lang.reflect.Method.invoke(Method.java:592)
	at org.codehaus.classworlds.Launcher.launchEnhanced(Launcher.java:315)
	at org.codehaus.classworlds.Launcher.launch(Launcher.java:255)
	at hudson.maven.agent.Main.launch(Main.java:185)
	at hudson.maven.MavenBuilder.call(MavenBuilder.java:151)
	at hudson.maven.Maven2Builder.call(Maven2Builder.java:77)
	at hudson.maven.Maven2Builder.call(Maven2Builder.java:53)
	at hudson.remoting.UserRequest.perform(UserRequest.java:118)
	at hudson.remoting.UserRequest.perform(UserRequest.java:48)
	at hudson.remoting.Request$2.run(Request.java:326)
	at hudson.remoting.InterceptingExecutorService$1.call(InterceptingExecutorService.java:72)
	at java.util.concurrent.FutureTask$Sync.innerRun(FutureTask.java:269)
	at java.util.concurrent.FutureTask.run(FutureTask.java:123)
	at java.util.concurrent.ThreadPoolExecutor$Worker.runTask(ThreadPoolExecutor.java:651)
	at java.util.concurrent.ThreadPoolExecutor$Worker.run(ThreadPoolExecutor.java:676)
	at java.lang.Thread.run(Thread.java:595)
Caused by: hudson.remoting.ChannelClosedException: channel is already closed
	at hudson.remoting.Channel.send(Channel.java:493)
	at hudson.remoting.Request.call(Request.java:129)
	at hudson.remoting.Channel.call(Channel.java:664)
	at hudson.remoting.RemoteInvocationHandler.invoke(RemoteInvocationHandler.java:158)
	... 30 more
Caused by: java.io.StreamCorruptedException
	at java.io.ObjectInputStream.readObject0(ObjectInputStream.java:1332)
	at java.io.ObjectInputStream.readObject(ObjectInputStream.java:348)
	at hudson.remoting.Command.readFrom(Command.java:90)
	at hudson.remoting.ClassicCommandTransport.read(ClassicCommandTransport.java:59)
	at hudson.remoting.SynchronousCommandTransport$ReaderThread.run(SynchronousCommandTransport.java:48)
[INFO] ------------------------------------------------------------------------
[INFO] Total time: 1 minute 12 seconds
[INFO] Finished at: Tue Oct 02 05:14:09 UTC 2012
ERROR: Maven JVM terminated unexpectedly with exit code 0


Jenkins build is unstable: Karaf-2.2.x #761

Posted by Apache Jenkins Server <je...@builds.apache.org>.
See <https://builds.apache.org/job/Karaf-2.2.x/761/changes>