You are viewing a plain text version of this content. The canonical link for it is here.
Posted to builds@solr.apache.org by Apache Jenkins Server <je...@builds.apache.org> on 2025/05/23 06:49:21 UTC

[JENKINS] Solr » Solr-Lint-9.x - Build # 195 - Still Failing!

Build: https://ci-builds.apache.org/job/Solr/job/Solr-Lint-9.x/195/

No tests ran.

Build Log:
[...truncated 785 lines...]
BUILD FAILED in 3m 2s
298 actionable tasks: 298 executed

Publishing build scan...
https://develocity.apache.org/s/xqtonfdcsr3o4

Build step 'Invoke Gradle script' changed build result to FAILURE
Build step 'Invoke Gradle script' marked build as failure
Email was triggered for: Failure - Any
Sending email for trigger: Failure - Any

[JENKINS] Solr » Solr-Lint-9.x - Build # 196 - Still Failing!

Posted by Apache Jenkins Server <je...@builds.apache.org>.
Build: https://ci-builds.apache.org/job/Solr/job/Solr-Lint-9.x/196/

No tests ran.

Build Log:
[...truncated 786 lines...]
BUILD FAILED in 3m 3s
298 actionable tasks: 298 executed

Publishing build scan...
https://develocity.apache.org/s/hxeqzdjskxqpc

Build step 'Invoke Gradle script' changed build result to FAILURE
Build step 'Invoke Gradle script' marked build as failure
Email was triggered for: Failure - Any
Sending email for trigger: Failure - Any