You are viewing a plain text version of this content. The canonical link for it is here.
Posted to dev@zookeeper.apache.org by Apache Jenkins Server <je...@builds.apache.org> on 2013/09/19 00:52:16 UTC
Failed: ZOOKEEPER-1759 PreCommit Build #1589
Jira: https://issues.apache.org/jira/browse/ZOOKEEPER-1759
Build: https://builds.apache.org/job/PreCommit-ZOOKEEPER-Build/1589/
###################################################################################
########################## LAST 60 LINES OF THE CONSOLE ###########################
[...truncated 66 lines...]
[exec] ======================================================================
[exec]
[exec]
[exec] patching file b/src/java/main/org/apache/zookeeper/server/auth/SASLAuthenticationProvider.java
[exec] Hunk #1 FAILED at 39.
[exec] 1 out of 1 hunk FAILED -- saving rejects to file b/src/java/main/org/apache/zookeeper/server/auth/SASLAuthenticationProvider.java.rej
[exec] patching file b/src/java/test/org/apache/zookeeper/test/SaslAuthDesignatedClientTest.java
[exec] Hunk #1 FAILED at 21.
[exec] Hunk #2 FAILED at 100.
[exec] 2 out of 2 hunks FAILED -- saving rejects to file b/src/java/test/org/apache/zookeeper/test/SaslAuthDesignatedClientTest.java.rej
[exec] PATCH APPLICATION FAILED
[exec]
[exec]
[exec]
[exec]
[exec] -1 overall. Here are the results of testing the latest attachment
[exec] http://issues.apache.org/jira/secure/attachment/12603932/ZOOKEEPER-1759.patch
[exec] against trunk revision 1524398.
[exec]
[exec] +1 @author. The patch does not contain any @author tags.
[exec]
[exec] +1 tests included. The patch appears to include 3 new or modified tests.
[exec]
[exec] -1 patch. The patch command could not apply the patch.
[exec]
[exec] Console output: https://builds.apache.org/job/PreCommit-ZOOKEEPER-Build/1589//console
[exec]
[exec] This message is automatically generated.
[exec]
[exec]
[exec] ======================================================================
[exec] ======================================================================
[exec] Adding comment to Jira.
[exec] ======================================================================
[exec] ======================================================================
[exec]
[exec]
[exec] Comment added.
[exec] b4ba107621bdb44858ef49502216463de31d6316 logged out
[exec]
[exec]
[exec] ======================================================================
[exec] ======================================================================
[exec] Finished build.
[exec] ======================================================================
[exec] ======================================================================
[exec]
[exec]
BUILD FAILED
/home/jenkins/jenkins-slave/workspace/PreCommit-ZOOKEEPER-Build/trunk/build.xml:1623: exec returned: 1
Total time: 43 seconds
Build step 'Execute shell' marked build as failure
Archiving artifacts
Recording test results
Description set: ZOOKEEPER-1759
Email was triggered for: Failure
Sending email for trigger: Failure
###################################################################################
############################## FAILED TESTS (if any) ##############################
No tests ran.
Success: ZOOKEEPER-87 PreCommit Build #1592
Posted by Apache Jenkins Server <je...@builds.apache.org>.
Jira: https://issues.apache.org/jira/browse/ZOOKEEPER-87
Build: https://builds.apache.org/job/PreCommit-ZOOKEEPER-Build/1592/
###################################################################################
########################## LAST 60 LINES OF THE CONSOLE ###########################
[...truncated 279652 lines...]
[exec] BUILD SUCCESSFUL
[exec] Total time: 0 seconds
[exec]
[exec]
[exec]
[exec]
[exec] +1 overall. Here are the results of testing the latest attachment
[exec] http://issues.apache.org/jira/secure/attachment/12604193/ZOOKEEPER-87.patch
[exec] against trunk revision 1524398.
[exec]
[exec] +1 @author. The patch does not contain any @author tags.
[exec]
[exec] +1 tests included. The patch appears to include 10 new or modified tests.
[exec]
[exec] +1 javadoc. The javadoc tool did not generate any warning messages.
[exec]
[exec] +1 javac. The applied patch does not increase the total number of javac compiler warnings.
[exec]
[exec] +1 findbugs. The patch does not introduce any new Findbugs (version 1.3.9) warnings.
[exec]
[exec] +1 release audit. The applied patch does not increase the total number of release audit warnings.
[exec]
[exec] +1 core tests. The patch passed core unit tests.
[exec]
[exec] +1 contrib tests. The patch passed contrib unit tests.
[exec]
[exec] Test results: https://builds.apache.org/job/PreCommit-ZOOKEEPER-Build/1592//testReport/
[exec] Findbugs warnings: https://builds.apache.org/job/PreCommit-ZOOKEEPER-Build/1592//artifact/trunk/build/test/findbugs/newPatchFindbugsWarnings.html
[exec] Console output: https://builds.apache.org/job/PreCommit-ZOOKEEPER-Build/1592//console
[exec]
[exec] This message is automatically generated.
[exec]
[exec]
[exec] ======================================================================
[exec] ======================================================================
[exec] Adding comment to Jira.
[exec] ======================================================================
[exec] ======================================================================
[exec]
[exec]
[exec] Comment added.
[exec] 1535130f4c9c9baa7b211798173f901606345a0a logged out
[exec]
[exec]
[exec] ======================================================================
[exec] ======================================================================
[exec] Finished build.
[exec] ======================================================================
[exec] ======================================================================
[exec]
[exec]
BUILD SUCCESSFUL
Total time: 31 minutes 16 seconds
Archiving artifacts
Recording test results
Description set: ZOOKEEPER-87
Email was triggered for: Success
Sending email for trigger: Success
###################################################################################
############################## FAILED TESTS (if any) ##############################
All tests passed
Failed: ZOOKEEPER-87 PreCommit Build #1591
Posted by Apache Jenkins Server <je...@builds.apache.org>.
Jira: https://issues.apache.org/jira/browse/ZOOKEEPER-87
Build: https://builds.apache.org/job/PreCommit-ZOOKEEPER-Build/1591/
###################################################################################
########################## LAST 60 LINES OF THE CONSOLE ###########################
[...truncated 275768 lines...]
[exec]
[exec]
[exec]
[exec] -1 overall. Here are the results of testing the latest attachment
[exec] http://issues.apache.org/jira/secure/attachment/12604034/ZOOKEEPER-87.patch
[exec] against trunk revision 1524398.
[exec]
[exec] +1 @author. The patch does not contain any @author tags.
[exec]
[exec] +1 tests included. The patch appears to include 10 new or modified tests.
[exec]
[exec] +1 javadoc. The javadoc tool did not generate any warning messages.
[exec]
[exec] +1 javac. The applied patch does not increase the total number of javac compiler warnings.
[exec]
[exec] +1 findbugs. The patch does not introduce any new Findbugs (version 1.3.9) warnings.
[exec]
[exec] +1 release audit. The applied patch does not increase the total number of release audit warnings.
[exec]
[exec] -1 core tests. The patch failed core unit tests.
[exec]
[exec] +1 contrib tests. The patch passed contrib unit tests.
[exec]
[exec] Test results: https://builds.apache.org/job/PreCommit-ZOOKEEPER-Build/1591//testReport/
[exec] Findbugs warnings: https://builds.apache.org/job/PreCommit-ZOOKEEPER-Build/1591//artifact/trunk/build/test/findbugs/newPatchFindbugsWarnings.html
[exec] Console output: https://builds.apache.org/job/PreCommit-ZOOKEEPER-Build/1591//console
[exec]
[exec] This message is automatically generated.
[exec]
[exec]
[exec] ======================================================================
[exec] ======================================================================
[exec] Adding comment to Jira.
[exec] ======================================================================
[exec] ======================================================================
[exec]
[exec]
[exec] Comment added.
[exec] 47c1b3f29cd56242c0827ec57bed968780701732 logged out
[exec]
[exec]
[exec] ======================================================================
[exec] ======================================================================
[exec] Finished build.
[exec] ======================================================================
[exec] ======================================================================
[exec]
[exec]
BUILD FAILED
/home/jenkins/jenkins-slave/workspace/PreCommit-ZOOKEEPER-Build/trunk/build.xml:1623: exec returned: 1
Total time: 26 minutes 45 seconds
Build step 'Execute shell' marked build as failure
Archiving artifacts
Recording test results
Description set: ZOOKEEPER-87
Email was triggered for: Failure
Sending email for trigger: Failure
###################################################################################
############################## FAILED TESTS (if any) ##############################
1 tests failed.
REGRESSION: org.apache.zookeeper.test.ReconfigTest.testQuorumSystemChange
Error Message:
Couldn't instantiate org.apache.zookeeper.ClientCnxnSocketNIO
Stack Trace:
java.io.IOException: Couldn't instantiate org.apache.zookeeper.ClientCnxnSocketNIO
at org.apache.zookeeper.ZooKeeper.getClientCnxnSocket(ZooKeeper.java:2182)
at org.apache.zookeeper.ZooKeeper.<init>(ZooKeeper.java:540)
at org.apache.zookeeper.ZooKeeper.<init>(ZooKeeper.java:472)
at org.apache.zookeeper.test.ReconfigTest.createHandles(ReconfigTest.java:182)
at org.apache.zookeeper.test.ReconfigTest.testQuorumSystemChange(ReconfigTest.java:634)
at org.apache.zookeeper.JUnit4ZKTestRunner$LoggedInvokeMethod.evaluate(JUnit4ZKTestRunner.java:52)
Caused by: java.io.IOException: Too many open files
at sun.nio.ch.IOUtil.initPipe(Native Method)
at sun.nio.ch.EPollSelectorImpl.<init>(EPollSelectorImpl.java:49)
at sun.nio.ch.EPollSelectorProvider.openSelector(EPollSelectorProvider.java:18)
at java.nio.channels.Selector.open(Selector.java:209)
at org.apache.zookeeper.ClientCnxnSocketNIO.<init>(ClientCnxnSocketNIO.java:44)
at java.lang.reflect.Constructor.newInstance(Constructor.java:513)
at java.lang.Class.newInstance0(Class.java:355)
at java.lang.Class.newInstance(Class.java:308)
at org.apache.zookeeper.ZooKeeper.getClientCnxnSocket(ZooKeeper.java:2179)
Failed: ZOOKEEPER-1759 PreCommit Build #1590
Posted by Apache Jenkins Server <je...@builds.apache.org>.
Jira: https://issues.apache.org/jira/browse/ZOOKEEPER-1759
Build: https://builds.apache.org/job/PreCommit-ZOOKEEPER-Build/1590/
###################################################################################
########################## LAST 60 LINES OF THE CONSOLE ###########################
[...truncated 281688 lines...]
[exec]
[exec]
[exec]
[exec] -1 overall. Here are the results of testing the latest attachment
[exec] http://issues.apache.org/jira/secure/attachment/12603960/ZOOKEEPER-1759.patch
[exec] against trunk revision 1524398.
[exec]
[exec] +1 @author. The patch does not contain any @author tags.
[exec]
[exec] +1 tests included. The patch appears to include 3 new or modified tests.
[exec]
[exec] +1 javadoc. The javadoc tool did not generate any warning messages.
[exec]
[exec] +1 javac. The applied patch does not increase the total number of javac compiler warnings.
[exec]
[exec] +1 findbugs. The patch does not introduce any new Findbugs (version 1.3.9) warnings.
[exec]
[exec] +1 release audit. The applied patch does not increase the total number of release audit warnings.
[exec]
[exec] -1 core tests. The patch failed core unit tests.
[exec]
[exec] +1 contrib tests. The patch passed contrib unit tests.
[exec]
[exec] Test results: https://builds.apache.org/job/PreCommit-ZOOKEEPER-Build/1590//testReport/
[exec] Findbugs warnings: https://builds.apache.org/job/PreCommit-ZOOKEEPER-Build/1590//artifact/trunk/build/test/findbugs/newPatchFindbugsWarnings.html
[exec] Console output: https://builds.apache.org/job/PreCommit-ZOOKEEPER-Build/1590//console
[exec]
[exec] This message is automatically generated.
[exec]
[exec]
[exec] ======================================================================
[exec] ======================================================================
[exec] Adding comment to Jira.
[exec] ======================================================================
[exec] ======================================================================
[exec]
[exec]
[exec] Comment added.
[exec] 32881ced2c9545067bc330eaa746361e85c2c8d1 logged out
[exec]
[exec]
[exec] ======================================================================
[exec] ======================================================================
[exec] Finished build.
[exec] ======================================================================
[exec] ======================================================================
[exec]
[exec]
BUILD FAILED
/home/jenkins/jenkins-slave/workspace/PreCommit-ZOOKEEPER-Build/trunk/build.xml:1623: exec returned: 1
Total time: 31 minutes 11 seconds
Build step 'Execute shell' marked build as failure
Archiving artifacts
Recording test results
Description set: ZOOKEEPER-1759
Email was triggered for: Failure
Sending email for trigger: Failure
###################################################################################
############################## FAILED TESTS (if any) ##############################
All tests passed