You are viewing a plain text version of this content. The canonical link for it is here.
Posted to builds@beam.apache.org by Apache Jenkins Server <je...@builds.apache.org> on 2022/09/17 15:49:42 UTC

Build failed in Jenkins: beam_PerformanceTests_PubsubIOIT_Python_Streaming #830

See <https://ci-beam.apache.org/job/beam_PerformanceTests_PubsubIOIT_Python_Streaming/830/display/redirect?page=changes>

Changes:

[noreply] TensorRT Initial commit (#22131)

[noreply] Fix Kafka performance test sourceOption to match expected hash (#23274)

[noreply] updated the pydoc for running a custom model on Beam (#23218)


------------------------------------------
Started by timer
Running as SYSTEM
[EnvInject] - Loading node environment variables.
Building remotely on apache-beam-jenkins-9 (beam) in workspace <https://ci-beam.apache.org/job/beam_PerformanceTests_PubsubIOIT_Python_Streaming/ws/>
The recommended git tool is: NONE
No credentials specified
Wiping out workspace first.
Cloning the remote Git repository
Cloning repository https://github.com/apache/beam.git
 > git init <https://ci-beam.apache.org/job/beam_PerformanceTests_PubsubIOIT_Python_Streaming/ws/src> # timeout=10
Fetching upstream changes from https://github.com/apache/beam.git
 > git --version # timeout=10
 > git --version # 'git version 2.25.1'
 > git fetch --tags --force --progress -- https://github.com/apache/beam.git +refs/heads/*:refs/remotes/origin/* # timeout=10
 > git config remote.origin.url https://github.com/apache/beam.git # timeout=10
 > git config --add remote.origin.fetch +refs/heads/*:refs/remotes/origin/* # timeout=10
 > git config remote.origin.url https://github.com/apache/beam.git # timeout=10
Fetching upstream changes from https://github.com/apache/beam.git
 > git fetch --tags --force --progress -- https://github.com/apache/beam.git +refs/heads/*:refs/remotes/origin/* +refs/pull/${ghprbPullId}/*:refs/remotes/origin/pr/${ghprbPullId}/* # timeout=10
 > git rev-parse origin/master^{commit} # timeout=10
Checking out Revision 8754cc0904872d37edbb8b4d3b8d9f92aad94acc (origin/master)
 > git config core.sparsecheckout # timeout=10
 > git checkout -f 8754cc0904872d37edbb8b4d3b8d9f92aad94acc # timeout=10
Commit message: "updated the pydoc for running a custom model on Beam (#23218)"
 > git rev-list --no-walk 8b2676782a62f8bdf912395267056c9f37251338 # timeout=10
No emails were triggered.
[EnvInject] - Executing scripts and injecting environment variables after the SCM step.
[EnvInject] - Injecting as environment variables the properties content 
SETUPTOOLS_USE_DISTUTILS=stdlib
SPARK_LOCAL_IP=127.0.0.1

[EnvInject] - Variables injected successfully.
[beam_PerformanceTests_PubsubIOIT_Python_Streaming] $ /bin/bash -xe /tmp/jenkins2966784103559661964.sh
+ echo '*** PubsubIO Write Performance Test Python 2GB ***'
*** PubsubIO Write Performance Test Python 2GB ***
[Gradle] - Launching build.
[src] $ <https://ci-beam.apache.org/job/beam_PerformanceTests_PubsubIOIT_Python_Streaming/ws/src/gradlew> -PloadTest.mainClass=apache_beam.io.gcp.pubsub_io_perf_test -Prunner=TestDataflowRunner '-PloadTest.args=--job_name=performance-tests-psio-python-2gb0917150412 --project=apache-beam-testing --region=us-central1 --temp_location=gs://temp-storage-for-perf-tests/loadtests --publish_to_big_query=true --metrics_dataset=beam_performance --metrics_table=psio_io_2GB_results --influx_measurement=python_psio_2GB_results --influx_db_name=beam_test_metrics --influx_hostname=http://10.128.0.96:8086 --input_options='{"num_records": 2097152,"key_size": 1,"value_size": 1024}' --num_****s=5 --autoscaling_algorithm=NONE --pubsub_namespace_prefix=pubsub_io_performance_ --wait_until_finish_duration=600000 --runner=TestDataflowRunner' -PwithDataflowWorkerJar=true -PpythonVersion=3.7 --continue --max-****s=8 -Dorg.gradle.jvmargs=-Xms2g -Dorg.gradle.jvmargs=-Xmx6g -Dorg.gradle.vfs.watch=false -Pdocker-pull-licenses :sdks:python:apache_beam:testing:load_tests:run
Starting a Gradle Daemon (subsequent builds will be faster)
Configuration on demand is an incubating feature.
> Task :buildSrc:compileJava NO-SOURCE
> Task :buildSrc:compileGroovy FROM-CACHE
> Task :buildSrc:pluginDescriptors
> Task :buildSrc:processResources
> Task :buildSrc:classes
> Task :buildSrc:jar
> Task :buildSrc:assemble
> Task :buildSrc:spotlessGroovy FROM-CACHE
> Task :buildSrc:spotlessGroovyCheck UP-TO-DATE
> Task :buildSrc:spotlessGroovyGradle FROM-CACHE
> Task :buildSrc:spotlessGroovyGradleCheck UP-TO-DATE
> Task :buildSrc:spotlessCheck UP-TO-DATE
> Task :buildSrc:pluginUnderTestMetadata
> Task :buildSrc:compileTestJava NO-SOURCE
> Task :buildSrc:compileTestGroovy NO-SOURCE
> Task :buildSrc:processTestResources NO-SOURCE
> Task :buildSrc:testClasses UP-TO-DATE
> Task :buildSrc:test NO-SOURCE
> Task :buildSrc:validatePlugins FROM-CACHE
> Task :buildSrc:check UP-TO-DATE
> Task :buildSrc:build

FAILURE: Build failed with an exception.

* Where:
Build file '<https://ci-beam.apache.org/job/beam_PerformanceTests_PubsubIOIT_Python_Streaming/ws/src/sdks/python/apache_beam/testing/load_tests/build.gradle'> line: 51

* What went wrong:
A problem occurred evaluating project ':sdks:python:apache_beam:testing:load_tests'.
> Could not get unknown property 'shadowJar' for project ':runners:google-cloud-dataflow-java:****' of type org.gradle.api.Project.

* Try:
> Run with --stacktrace option to get the stack trace.
> Run with --info or --debug option to get more log output.

* Get more help at https://help.gradle.org

BUILD FAILED in 10s
10 actionable tasks: 4 executed, 4 from cache, 2 up-to-date

Publishing build scan...
https://gradle.com/s/ruxk63ctg3h76

Build step 'Invoke Gradle script' changed build result to FAILURE
Build step 'Invoke Gradle script' marked build as failure

---------------------------------------------------------------------
To unsubscribe, e-mail: builds-unsubscribe@beam.apache.org
For additional commands, e-mail: builds-help@beam.apache.org


Jenkins build is back to normal : beam_PerformanceTests_PubsubIOIT_Python_Streaming #860

Posted by Apache Jenkins Server <je...@builds.apache.org>.
See <https://ci-beam.apache.org/job/beam_PerformanceTests_PubsubIOIT_Python_Streaming/860/display/redirect?page=changes>


---------------------------------------------------------------------
To unsubscribe, e-mail: builds-unsubscribe@beam.apache.org
For additional commands, e-mail: builds-help@beam.apache.org


Build failed in Jenkins: beam_PerformanceTests_PubsubIOIT_Python_Streaming #859

Posted by Apache Jenkins Server <je...@builds.apache.org>.
See <https://ci-beam.apache.org/job/beam_PerformanceTests_PubsubIOIT_Python_Streaming/859/display/redirect?page=changes>

Changes:

[noreply] [GitHub Actions] - Verify Release Build Workflow  (#23390)


------------------------------------------
Started by timer
Running as SYSTEM
[EnvInject] - Loading node environment variables.
Building remotely on apache-beam-jenkins-9 (beam) in workspace <https://ci-beam.apache.org/job/beam_PerformanceTests_PubsubIOIT_Python_Streaming/ws/>
The recommended git tool is: NONE
No credentials specified
Wiping out workspace first.
Cloning the remote Git repository
Cloning repository https://github.com/apache/beam.git
 > git init <https://ci-beam.apache.org/job/beam_PerformanceTests_PubsubIOIT_Python_Streaming/ws/src> # timeout=10
Fetching upstream changes from https://github.com/apache/beam.git
 > git --version # timeout=10
 > git --version # 'git version 2.25.1'
 > git fetch --tags --force --progress -- https://github.com/apache/beam.git +refs/heads/*:refs/remotes/origin/* # timeout=10
 > git config remote.origin.url https://github.com/apache/beam.git # timeout=10
 > git config --add remote.origin.fetch +refs/heads/*:refs/remotes/origin/* # timeout=10
 > git config remote.origin.url https://github.com/apache/beam.git # timeout=10
Fetching upstream changes from https://github.com/apache/beam.git
 > git fetch --tags --force --progress -- https://github.com/apache/beam.git +refs/heads/*:refs/remotes/origin/* +refs/pull/${ghprbPullId}/*:refs/remotes/origin/pr/${ghprbPullId}/* # timeout=10
 > git rev-parse origin/master^{commit} # timeout=10
Checking out Revision e1596578e0fd0bfac241db3dfb138bceb07b6f5b (origin/master)
 > git config core.sparsecheckout # timeout=10
 > git checkout -f e1596578e0fd0bfac241db3dfb138bceb07b6f5b # timeout=10
Commit message: "[GitHub Actions] - Verify Release Build Workflow  (#23390)"
 > git rev-list --no-walk 8e2431c0e55237af4bd00a9786e4c150e20d4e14 # timeout=10
No emails were triggered.
[EnvInject] - Executing scripts and injecting environment variables after the SCM step.
[EnvInject] - Injecting as environment variables the properties content 
SETUPTOOLS_USE_DISTUTILS=stdlib
SPARK_LOCAL_IP=127.0.0.1

[EnvInject] - Variables injected successfully.
[beam_PerformanceTests_PubsubIOIT_Python_Streaming] $ /bin/bash -xe /tmp/jenkins8209363837533901480.sh
+ echo '*** PubsubIO Write Performance Test Python 2GB ***'
*** PubsubIO Write Performance Test Python 2GB ***
[Gradle] - Launching build.
[src] $ <https://ci-beam.apache.org/job/beam_PerformanceTests_PubsubIOIT_Python_Streaming/ws/src/gradlew> -PloadTest.mainClass=apache_beam.io.gcp.pubsub_io_perf_test -Prunner=TestDataflowRunner '-PloadTest.args=--job_name=performance-tests-psio-python-2gb1016150404 --project=apache-beam-testing --region=us-central1 --temp_location=gs://temp-storage-for-perf-tests/loadtests --publish_to_big_query=true --metrics_dataset=beam_performance --metrics_table=psio_io_2GB_results --influx_measurement=python_psio_2GB_results --influx_db_name=beam_test_metrics --influx_hostname=http://10.128.0.96:8086 --input_options='{"num_records": 2097152,"key_size": 1,"value_size": 1024}' --num_****s=5 --autoscaling_algorithm=NONE --pubsub_namespace_prefix=pubsub_io_performance_ --wait_until_finish_duration=600000 --runner=TestDataflowRunner' -PwithDataflowWorkerJar=true -PpythonVersion=3.7 --continue --max-****s=8 -Dorg.gradle.jvmargs=-Xms2g -Dorg.gradle.jvmargs=-Xmx6g -Dorg.gradle.vfs.watch=false -Pdocker-pull-licenses :sdks:python:apache_beam:testing:load_tests:run
Configuration on demand is an incubating feature.
> Task :buildSrc:compileJava NO-SOURCE
> Task :buildSrc:compileGroovy FROM-CACHE
> Task :buildSrc:pluginDescriptors
> Task :buildSrc:processResources
> Task :buildSrc:classes
> Task :buildSrc:jar
> Task :buildSrc:assemble
> Task :buildSrc:spotlessGroovy FROM-CACHE
> Task :buildSrc:spotlessGroovyCheck UP-TO-DATE
> Task :buildSrc:spotlessGroovyGradle FROM-CACHE
> Task :buildSrc:spotlessGroovyGradleCheck UP-TO-DATE
> Task :buildSrc:spotlessCheck UP-TO-DATE
> Task :buildSrc:pluginUnderTestMetadata
> Task :buildSrc:compileTestJava NO-SOURCE
> Task :buildSrc:compileTestGroovy NO-SOURCE
> Task :buildSrc:processTestResources NO-SOURCE
> Task :buildSrc:testClasses UP-TO-DATE
> Task :buildSrc:test NO-SOURCE
> Task :buildSrc:validatePlugins FROM-CACHE
> Task :buildSrc:check UP-TO-DATE
> Task :buildSrc:build

FAILURE: Build failed with an exception.

* Where:
Build file '<https://ci-beam.apache.org/job/beam_PerformanceTests_PubsubIOIT_Python_Streaming/ws/src/sdks/python/apache_beam/testing/load_tests/build.gradle'> line: 51

* What went wrong:
A problem occurred evaluating project ':sdks:python:apache_beam:testing:load_tests'.
> Could not get unknown property 'shadowJar' for project ':runners:google-cloud-dataflow-java:****' of type org.gradle.api.Project.

* Try:
> Run with --stacktrace option to get the stack trace.
> Run with --info or --debug option to get more log output.

* Get more help at https://help.gradle.org

BUILD FAILED in 1s
10 actionable tasks: 4 executed, 4 from cache, 2 up-to-date

Publishing build scan...
https://gradle.com/s/fjrxxanjsnlfo

Build step 'Invoke Gradle script' changed build result to FAILURE
Build step 'Invoke Gradle script' marked build as failure

---------------------------------------------------------------------
To unsubscribe, e-mail: builds-unsubscribe@beam.apache.org
For additional commands, e-mail: builds-help@beam.apache.org


Build failed in Jenkins: beam_PerformanceTests_PubsubIOIT_Python_Streaming #858

Posted by Apache Jenkins Server <je...@builds.apache.org>.
See <https://ci-beam.apache.org/job/beam_PerformanceTests_PubsubIOIT_Python_Streaming/858/display/redirect?page=changes>

Changes:

[Moritz Mack] [Spark dataset runner] Add direct translation of Reshuffle and

[noreply] Make GCP OAuth scopes configurable via pipeline options. (#23644)

[noreply] Update BQIO to a single scheduled executor service reduce threads


------------------------------------------
Started by timer
Running as SYSTEM
[EnvInject] - Loading node environment variables.
Building remotely on apache-beam-jenkins-9 (beam) in workspace <https://ci-beam.apache.org/job/beam_PerformanceTests_PubsubIOIT_Python_Streaming/ws/>
The recommended git tool is: NONE
No credentials specified
Wiping out workspace first.
Cloning the remote Git repository
Cloning repository https://github.com/apache/beam.git
 > git init <https://ci-beam.apache.org/job/beam_PerformanceTests_PubsubIOIT_Python_Streaming/ws/src> # timeout=10
Fetching upstream changes from https://github.com/apache/beam.git
 > git --version # timeout=10
 > git --version # 'git version 2.25.1'
 > git fetch --tags --force --progress -- https://github.com/apache/beam.git +refs/heads/*:refs/remotes/origin/* # timeout=10
 > git config remote.origin.url https://github.com/apache/beam.git # timeout=10
 > git config --add remote.origin.fetch +refs/heads/*:refs/remotes/origin/* # timeout=10
 > git config remote.origin.url https://github.com/apache/beam.git # timeout=10
Fetching upstream changes from https://github.com/apache/beam.git
 > git fetch --tags --force --progress -- https://github.com/apache/beam.git +refs/heads/*:refs/remotes/origin/* +refs/pull/${ghprbPullId}/*:refs/remotes/origin/pr/${ghprbPullId}/* # timeout=10
 > git rev-parse origin/master^{commit} # timeout=10
Checking out Revision 8e2431c0e55237af4bd00a9786e4c150e20d4e14 (origin/master)
 > git config core.sparsecheckout # timeout=10
 > git checkout -f 8e2431c0e55237af4bd00a9786e4c150e20d4e14 # timeout=10
Commit message: "Update BQIO to a single scheduled executor service reduce threads (#23234)"
 > git rev-list --no-walk b784c988643b5c4ae2e25bb2d1d5317576b858ec # timeout=10
No emails were triggered.
[EnvInject] - Executing scripts and injecting environment variables after the SCM step.
[EnvInject] - Injecting as environment variables the properties content 
SETUPTOOLS_USE_DISTUTILS=stdlib
SPARK_LOCAL_IP=127.0.0.1

[EnvInject] - Variables injected successfully.
[beam_PerformanceTests_PubsubIOIT_Python_Streaming] $ /bin/bash -xe /tmp/jenkins1381995478477040812.sh
+ echo '*** PubsubIO Write Performance Test Python 2GB ***'
*** PubsubIO Write Performance Test Python 2GB ***
[Gradle] - Launching build.
[src] $ <https://ci-beam.apache.org/job/beam_PerformanceTests_PubsubIOIT_Python_Streaming/ws/src/gradlew> -PloadTest.mainClass=apache_beam.io.gcp.pubsub_io_perf_test -Prunner=TestDataflowRunner '-PloadTest.args=--job_name=performance-tests-psio-python-2gb1015150436 --project=apache-beam-testing --region=us-central1 --temp_location=gs://temp-storage-for-perf-tests/loadtests --publish_to_big_query=true --metrics_dataset=beam_performance --metrics_table=psio_io_2GB_results --influx_measurement=python_psio_2GB_results --influx_db_name=beam_test_metrics --influx_hostname=http://10.128.0.96:8086 --input_options='{"num_records": 2097152,"key_size": 1,"value_size": 1024}' --num_****s=5 --autoscaling_algorithm=NONE --pubsub_namespace_prefix=pubsub_io_performance_ --wait_until_finish_duration=600000 --runner=TestDataflowRunner' -PwithDataflowWorkerJar=true -PpythonVersion=3.7 --continue --max-****s=8 -Dorg.gradle.jvmargs=-Xms2g -Dorg.gradle.jvmargs=-Xmx6g -Dorg.gradle.vfs.watch=false -Pdocker-pull-licenses :sdks:python:apache_beam:testing:load_tests:run
Configuration on demand is an incubating feature.
> Task :buildSrc:compileJava NO-SOURCE
> Task :buildSrc:compileGroovy FROM-CACHE
> Task :buildSrc:pluginDescriptors
> Task :buildSrc:processResources
> Task :buildSrc:classes
> Task :buildSrc:jar
> Task :buildSrc:assemble
> Task :buildSrc:spotlessGroovy FROM-CACHE
> Task :buildSrc:spotlessGroovyCheck UP-TO-DATE
> Task :buildSrc:spotlessGroovyGradle FROM-CACHE
> Task :buildSrc:spotlessGroovyGradleCheck UP-TO-DATE
> Task :buildSrc:spotlessCheck UP-TO-DATE
> Task :buildSrc:pluginUnderTestMetadata
> Task :buildSrc:compileTestJava NO-SOURCE
> Task :buildSrc:compileTestGroovy NO-SOURCE
> Task :buildSrc:processTestResources NO-SOURCE
> Task :buildSrc:testClasses UP-TO-DATE
> Task :buildSrc:test NO-SOURCE
> Task :buildSrc:validatePlugins FROM-CACHE
> Task :buildSrc:check UP-TO-DATE
> Task :buildSrc:build

FAILURE: Build failed with an exception.

* Where:
Build file '<https://ci-beam.apache.org/job/beam_PerformanceTests_PubsubIOIT_Python_Streaming/ws/src/sdks/python/apache_beam/testing/load_tests/build.gradle'> line: 51

* What went wrong:
A problem occurred evaluating project ':sdks:python:apache_beam:testing:load_tests'.
> Could not get unknown property 'shadowJar' for project ':runners:google-cloud-dataflow-java:****' of type org.gradle.api.Project.

* Try:
> Run with --stacktrace option to get the stack trace.
> Run with --info or --debug option to get more log output.

* Get more help at https://help.gradle.org

BUILD FAILED in 2s
10 actionable tasks: 4 executed, 4 from cache, 2 up-to-date

Publishing build scan...
https://gradle.com/s/6vwxm5rupq3hu

Build step 'Invoke Gradle script' changed build result to FAILURE
Build step 'Invoke Gradle script' marked build as failure

---------------------------------------------------------------------
To unsubscribe, e-mail: builds-unsubscribe@beam.apache.org
For additional commands, e-mail: builds-help@beam.apache.org


Build failed in Jenkins: beam_PerformanceTests_PubsubIOIT_Python_Streaming #857

Posted by Apache Jenkins Server <je...@builds.apache.org>.
See <https://ci-beam.apache.org/job/beam_PerformanceTests_PubsubIOIT_Python_Streaming/857/display/redirect?page=changes>

Changes:

[Kiley Sok] Add agent to open modules

[Kiley Sok] check for empty

[Kiley Sok] limit to jamm and update comments

[Kiley Sok] reuse options, pr comments

[rszper] Added content: The direct runner is not suited to production pipelines

[yixiaoshen] Remove artificial timeout in FirestoreV1IT, Dataflow runner is very slow

[Moritz Mack] Minor improvements to the tpcds gradle build for Spark

[Moritz Mack] Fix SparkSessionFactory to not fail when using Spark master local[*]

[Moritz Mack] Align translation logging for Spark dataset runner with rdd runner for

[noreply] Update

[noreply] Merge pull request #23524: Adding beam blog info to the Community page

[noreply] Update publish_release_notes to generate PR list (#23630)

[noreply] Bump Legacy dataflow container image tag (#23625)


------------------------------------------
Started by timer
Running as SYSTEM
[EnvInject] - Loading node environment variables.
Building remotely on apache-beam-jenkins-9 (beam) in workspace <https://ci-beam.apache.org/job/beam_PerformanceTests_PubsubIOIT_Python_Streaming/ws/>
The recommended git tool is: NONE
No credentials specified
Wiping out workspace first.
Cloning the remote Git repository
Cloning repository https://github.com/apache/beam.git
 > git init <https://ci-beam.apache.org/job/beam_PerformanceTests_PubsubIOIT_Python_Streaming/ws/src> # timeout=10
Fetching upstream changes from https://github.com/apache/beam.git
 > git --version # timeout=10
 > git --version # 'git version 2.25.1'
 > git fetch --tags --force --progress -- https://github.com/apache/beam.git +refs/heads/*:refs/remotes/origin/* # timeout=10
 > git config remote.origin.url https://github.com/apache/beam.git # timeout=10
 > git config --add remote.origin.fetch +refs/heads/*:refs/remotes/origin/* # timeout=10
 > git config remote.origin.url https://github.com/apache/beam.git # timeout=10
Fetching upstream changes from https://github.com/apache/beam.git
 > git fetch --tags --force --progress -- https://github.com/apache/beam.git +refs/heads/*:refs/remotes/origin/* +refs/pull/${ghprbPullId}/*:refs/remotes/origin/pr/${ghprbPullId}/* # timeout=10
 > git rev-parse origin/master^{commit} # timeout=10
Checking out Revision b784c988643b5c4ae2e25bb2d1d5317576b858ec (origin/master)
 > git config core.sparsecheckout # timeout=10
 > git checkout -f b784c988643b5c4ae2e25bb2d1d5317576b858ec # timeout=10
Commit message: "Merge pull request #23621: Minor improvements to the tpcds gradle build for Spark"
 > git rev-list --no-walk cc82c3201296f5243ec6935334165b0321d93891 # timeout=10
No emails were triggered.
[EnvInject] - Executing scripts and injecting environment variables after the SCM step.
[EnvInject] - Injecting as environment variables the properties content 
SETUPTOOLS_USE_DISTUTILS=stdlib
SPARK_LOCAL_IP=127.0.0.1

[EnvInject] - Variables injected successfully.
[beam_PerformanceTests_PubsubIOIT_Python_Streaming] $ /bin/bash -xe /tmp/jenkins4239421924779187200.sh
+ echo '*** PubsubIO Write Performance Test Python 2GB ***'
*** PubsubIO Write Performance Test Python 2GB ***
[Gradle] - Launching build.
[src] $ <https://ci-beam.apache.org/job/beam_PerformanceTests_PubsubIOIT_Python_Streaming/ws/src/gradlew> -PloadTest.mainClass=apache_beam.io.gcp.pubsub_io_perf_test -Prunner=TestDataflowRunner '-PloadTest.args=--job_name=performance-tests-psio-python-2gb1014150418 --project=apache-beam-testing --region=us-central1 --temp_location=gs://temp-storage-for-perf-tests/loadtests --publish_to_big_query=true --metrics_dataset=beam_performance --metrics_table=psio_io_2GB_results --influx_measurement=python_psio_2GB_results --influx_db_name=beam_test_metrics --influx_hostname=http://10.128.0.96:8086 --input_options='{"num_records": 2097152,"key_size": 1,"value_size": 1024}' --num_****s=5 --autoscaling_algorithm=NONE --pubsub_namespace_prefix=pubsub_io_performance_ --wait_until_finish_duration=600000 --runner=TestDataflowRunner' -PwithDataflowWorkerJar=true -PpythonVersion=3.7 --continue --max-****s=8 -Dorg.gradle.jvmargs=-Xms2g -Dorg.gradle.jvmargs=-Xmx6g -Dorg.gradle.vfs.watch=false -Pdocker-pull-licenses :sdks:python:apache_beam:testing:load_tests:run
Configuration on demand is an incubating feature.
> Task :buildSrc:compileJava NO-SOURCE
> Task :buildSrc:compileGroovy FROM-CACHE
> Task :buildSrc:pluginDescriptors
> Task :buildSrc:processResources
> Task :buildSrc:classes
> Task :buildSrc:jar
> Task :buildSrc:assemble
> Task :buildSrc:spotlessGroovy FROM-CACHE
> Task :buildSrc:spotlessGroovyCheck UP-TO-DATE
> Task :buildSrc:spotlessGroovyGradle FROM-CACHE
> Task :buildSrc:spotlessGroovyGradleCheck UP-TO-DATE
> Task :buildSrc:spotlessCheck UP-TO-DATE
> Task :buildSrc:pluginUnderTestMetadata
> Task :buildSrc:compileTestJava NO-SOURCE
> Task :buildSrc:compileTestGroovy NO-SOURCE
> Task :buildSrc:processTestResources NO-SOURCE
> Task :buildSrc:testClasses UP-TO-DATE
> Task :buildSrc:test NO-SOURCE
> Task :buildSrc:validatePlugins FROM-CACHE
> Task :buildSrc:check UP-TO-DATE
> Task :buildSrc:build

FAILURE: Build failed with an exception.

* Where:
Build file '<https://ci-beam.apache.org/job/beam_PerformanceTests_PubsubIOIT_Python_Streaming/ws/src/sdks/python/apache_beam/testing/load_tests/build.gradle'> line: 51

* What went wrong:
A problem occurred evaluating project ':sdks:python:apache_beam:testing:load_tests'.
> Could not get unknown property 'shadowJar' for project ':runners:google-cloud-dataflow-java:****' of type org.gradle.api.Project.

* Try:
> Run with --stacktrace option to get the stack trace.
> Run with --info or --debug option to get more log output.

* Get more help at https://help.gradle.org

BUILD FAILED in 1s
10 actionable tasks: 4 executed, 4 from cache, 2 up-to-date

Publishing build scan...
https://gradle.com/s/v3uedzxlgto6o

Build step 'Invoke Gradle script' changed build result to FAILURE
Build step 'Invoke Gradle script' marked build as failure

---------------------------------------------------------------------
To unsubscribe, e-mail: builds-unsubscribe@beam.apache.org
For additional commands, e-mail: builds-help@beam.apache.org


Build failed in Jenkins: beam_PerformanceTests_PubsubIOIT_Python_Streaming #856

Posted by Apache Jenkins Server <je...@builds.apache.org>.
See <https://ci-beam.apache.org/job/beam_PerformanceTests_PubsubIOIT_Python_Streaming/856/display/redirect?page=changes>

Changes:

[noreply] Migrate GcsOptions#getExecutorService to an unbounded

[noreply] (BQ Java) Explicitly set coder for multi-partition batch load writes 

[noreply] Fix typo in bootstrap_beam_venv.py (#23574)

[noreply] Bump github.com/spf13/cobra from 1.5.0 to 1.6.0 in /sdks (#23591)

[noreply] [Playground][Tour Of Beam] Datastore entities split by origin (#23088)

[noreply] use write schema only for read api (#23594)

[noreply] [Go SDK]: SingleFlight bundle descriptor requests (#23589)

[noreply] Extend a timeout to create a bt cluster. (#23617)

[noreply] Use new github output format (#23624)

[noreply] Tour of Beam frontend state management (#23420) (#23572)


------------------------------------------
Started by timer
Running as SYSTEM
[EnvInject] - Loading node environment variables.
Building remotely on apache-beam-jenkins-9 (beam) in workspace <https://ci-beam.apache.org/job/beam_PerformanceTests_PubsubIOIT_Python_Streaming/ws/>
The recommended git tool is: NONE
No credentials specified
Wiping out workspace first.
Cloning the remote Git repository
Cloning repository https://github.com/apache/beam.git
 > git init <https://ci-beam.apache.org/job/beam_PerformanceTests_PubsubIOIT_Python_Streaming/ws/src> # timeout=10
Fetching upstream changes from https://github.com/apache/beam.git
 > git --version # timeout=10
 > git --version # 'git version 2.25.1'
 > git fetch --tags --force --progress -- https://github.com/apache/beam.git +refs/heads/*:refs/remotes/origin/* # timeout=10
 > git config remote.origin.url https://github.com/apache/beam.git # timeout=10
 > git config --add remote.origin.fetch +refs/heads/*:refs/remotes/origin/* # timeout=10
 > git config remote.origin.url https://github.com/apache/beam.git # timeout=10
Fetching upstream changes from https://github.com/apache/beam.git
 > git fetch --tags --force --progress -- https://github.com/apache/beam.git +refs/heads/*:refs/remotes/origin/* +refs/pull/${ghprbPullId}/*:refs/remotes/origin/pr/${ghprbPullId}/* # timeout=10
 > git rev-parse origin/master^{commit} # timeout=10
Checking out Revision cc82c3201296f5243ec6935334165b0321d93891 (origin/master)
 > git config core.sparsecheckout # timeout=10
 > git checkout -f cc82c3201296f5243ec6935334165b0321d93891 # timeout=10
Commit message: "Tour of Beam frontend state management (#23420) (#23572)"
 > git rev-list --no-walk 1c1ecb2a36dfb256a0e5eb7ff9ac5f84601b51e2 # timeout=10
No emails were triggered.
[EnvInject] - Executing scripts and injecting environment variables after the SCM step.
[EnvInject] - Injecting as environment variables the properties content 
SETUPTOOLS_USE_DISTUTILS=stdlib
SPARK_LOCAL_IP=127.0.0.1

[EnvInject] - Variables injected successfully.
[beam_PerformanceTests_PubsubIOIT_Python_Streaming] $ /bin/bash -xe /tmp/jenkins4628287526190925814.sh
+ echo '*** PubsubIO Write Performance Test Python 2GB ***'
*** PubsubIO Write Performance Test Python 2GB ***
[Gradle] - Launching build.
[src] $ <https://ci-beam.apache.org/job/beam_PerformanceTests_PubsubIOIT_Python_Streaming/ws/src/gradlew> -PloadTest.mainClass=apache_beam.io.gcp.pubsub_io_perf_test -Prunner=TestDataflowRunner '-PloadTest.args=--job_name=performance-tests-psio-python-2gb1013150431 --project=apache-beam-testing --region=us-central1 --temp_location=gs://temp-storage-for-perf-tests/loadtests --publish_to_big_query=true --metrics_dataset=beam_performance --metrics_table=psio_io_2GB_results --influx_measurement=python_psio_2GB_results --influx_db_name=beam_test_metrics --influx_hostname=http://10.128.0.96:8086 --input_options='{"num_records": 2097152,"key_size": 1,"value_size": 1024}' --num_****s=5 --autoscaling_algorithm=NONE --pubsub_namespace_prefix=pubsub_io_performance_ --wait_until_finish_duration=600000 --runner=TestDataflowRunner' -PwithDataflowWorkerJar=true -PpythonVersion=3.7 --continue --max-****s=8 -Dorg.gradle.jvmargs=-Xms2g -Dorg.gradle.jvmargs=-Xmx6g -Dorg.gradle.vfs.watch=false -Pdocker-pull-licenses :sdks:python:apache_beam:testing:load_tests:run
Configuration on demand is an incubating feature.
> Task :buildSrc:compileJava NO-SOURCE
> Task :buildSrc:compileGroovy FROM-CACHE
> Task :buildSrc:pluginDescriptors
> Task :buildSrc:processResources
> Task :buildSrc:classes
> Task :buildSrc:jar
> Task :buildSrc:assemble
> Task :buildSrc:spotlessGroovy FROM-CACHE
> Task :buildSrc:spotlessGroovyCheck UP-TO-DATE
> Task :buildSrc:spotlessGroovyGradle FROM-CACHE
> Task :buildSrc:spotlessGroovyGradleCheck UP-TO-DATE
> Task :buildSrc:spotlessCheck UP-TO-DATE
> Task :buildSrc:pluginUnderTestMetadata
> Task :buildSrc:compileTestJava NO-SOURCE
> Task :buildSrc:compileTestGroovy NO-SOURCE
> Task :buildSrc:processTestResources NO-SOURCE
> Task :buildSrc:testClasses UP-TO-DATE
> Task :buildSrc:test NO-SOURCE
> Task :buildSrc:validatePlugins FROM-CACHE
> Task :buildSrc:check UP-TO-DATE
> Task :buildSrc:build

FAILURE: Build failed with an exception.

* Where:
Build file '<https://ci-beam.apache.org/job/beam_PerformanceTests_PubsubIOIT_Python_Streaming/ws/src/sdks/python/apache_beam/testing/load_tests/build.gradle'> line: 51

* What went wrong:
A problem occurred evaluating project ':sdks:python:apache_beam:testing:load_tests'.
> Could not get unknown property 'shadowJar' for project ':runners:google-cloud-dataflow-java:****' of type org.gradle.api.Project.

* Try:
> Run with --stacktrace option to get the stack trace.
> Run with --info or --debug option to get more log output.

* Get more help at https://help.gradle.org

BUILD FAILED in 1s
10 actionable tasks: 4 executed, 4 from cache, 2 up-to-date

Publishing build scan...
https://gradle.com/s/g6nuqrxsfxzok

Build step 'Invoke Gradle script' changed build result to FAILURE
Build step 'Invoke Gradle script' marked build as failure

---------------------------------------------------------------------
To unsubscribe, e-mail: builds-unsubscribe@beam.apache.org
For additional commands, e-mail: builds-help@beam.apache.org


Build failed in Jenkins: beam_PerformanceTests_PubsubIOIT_Python_Streaming #855

Posted by Apache Jenkins Server <je...@builds.apache.org>.
See <https://ci-beam.apache.org/job/beam_PerformanceTests_PubsubIOIT_Python_Streaming/855/display/redirect?page=changes>

Changes:

[Robert Bradshaw] Add a multi-process shared utility.

[Robert Bradshaw] Add fastener dependency.

[Robert Bradshaw] Refactor to have an explicit acquire/release API.

[Robert Bradshaw] Drop a TODO about deferred construction parameterization.

[Robert Bradshaw] Fix unused import/var.

[Moritz Mack] Replace website references to deprecated aws / kinesis modules with more

[Alexey Romanenko] [website][adhoc] Fix spellcheck errors and typos

[noreply] Add database role to SpannerConfig for role-based access control.

[noreply] Remove obsolete and deprecated bigquery native read. (#23557)

[noreply] Feature/name all java threads (#23387)

[noreply] [Go SDK] Don't construct plans in lock section. (#23583)

[noreply] Remove obsolete and deprecated bigquery native write. #23557 (#23558)

[noreply] Increase Python PostCommit timeout. (#23595)


------------------------------------------
Started by timer
Running as SYSTEM
[EnvInject] - Loading node environment variables.
Building remotely on apache-beam-jenkins-9 (beam) in workspace <https://ci-beam.apache.org/job/beam_PerformanceTests_PubsubIOIT_Python_Streaming/ws/>
The recommended git tool is: NONE
No credentials specified
Wiping out workspace first.
Cloning the remote Git repository
Cloning repository https://github.com/apache/beam.git
 > git init <https://ci-beam.apache.org/job/beam_PerformanceTests_PubsubIOIT_Python_Streaming/ws/src> # timeout=10
Fetching upstream changes from https://github.com/apache/beam.git
 > git --version # timeout=10
 > git --version # 'git version 2.25.1'
 > git fetch --tags --force --progress -- https://github.com/apache/beam.git +refs/heads/*:refs/remotes/origin/* # timeout=10
 > git config remote.origin.url https://github.com/apache/beam.git # timeout=10
 > git config --add remote.origin.fetch +refs/heads/*:refs/remotes/origin/* # timeout=10
 > git config remote.origin.url https://github.com/apache/beam.git # timeout=10
Fetching upstream changes from https://github.com/apache/beam.git
 > git fetch --tags --force --progress -- https://github.com/apache/beam.git +refs/heads/*:refs/remotes/origin/* +refs/pull/${ghprbPullId}/*:refs/remotes/origin/pr/${ghprbPullId}/* # timeout=10
 > git rev-parse origin/master^{commit} # timeout=10
Checking out Revision 1c1ecb2a36dfb256a0e5eb7ff9ac5f84601b51e2 (origin/master)
 > git config core.sparsecheckout # timeout=10
 > git checkout -f 1c1ecb2a36dfb256a0e5eb7ff9ac5f84601b51e2 # timeout=10
Commit message: "Merge pull request #23575: [website][adhoc] Fix spellcheck errors and typos"
 > git rev-list --no-walk 1d573e2f8801c9bf96a4a14a7897cae675360821 # timeout=10
No emails were triggered.
[EnvInject] - Executing scripts and injecting environment variables after the SCM step.
[EnvInject] - Injecting as environment variables the properties content 
SETUPTOOLS_USE_DISTUTILS=stdlib
SPARK_LOCAL_IP=127.0.0.1

[EnvInject] - Variables injected successfully.
[beam_PerformanceTests_PubsubIOIT_Python_Streaming] $ /bin/bash -xe /tmp/jenkins5349632332885607494.sh
+ echo '*** PubsubIO Write Performance Test Python 2GB ***'
*** PubsubIO Write Performance Test Python 2GB ***
[Gradle] - Launching build.
[src] $ <https://ci-beam.apache.org/job/beam_PerformanceTests_PubsubIOIT_Python_Streaming/ws/src/gradlew> -PloadTest.mainClass=apache_beam.io.gcp.pubsub_io_perf_test -Prunner=TestDataflowRunner '-PloadTest.args=--job_name=performance-tests-psio-python-2gb1012150737 --project=apache-beam-testing --region=us-central1 --temp_location=gs://temp-storage-for-perf-tests/loadtests --publish_to_big_query=true --metrics_dataset=beam_performance --metrics_table=psio_io_2GB_results --influx_measurement=python_psio_2GB_results --influx_db_name=beam_test_metrics --influx_hostname=http://10.128.0.96:8086 --input_options='{"num_records": 2097152,"key_size": 1,"value_size": 1024}' --num_****s=5 --autoscaling_algorithm=NONE --pubsub_namespace_prefix=pubsub_io_performance_ --wait_until_finish_duration=600000 --runner=TestDataflowRunner' -PwithDataflowWorkerJar=true -PpythonVersion=3.7 --continue --max-****s=8 -Dorg.gradle.jvmargs=-Xms2g -Dorg.gradle.jvmargs=-Xmx6g -Dorg.gradle.vfs.watch=false -Pdocker-pull-licenses :sdks:python:apache_beam:testing:load_tests:run
Configuration on demand is an incubating feature.
> Task :buildSrc:compileJava NO-SOURCE
> Task :buildSrc:compileGroovy FROM-CACHE
> Task :buildSrc:pluginDescriptors
> Task :buildSrc:processResources
> Task :buildSrc:classes
> Task :buildSrc:jar
> Task :buildSrc:assemble
> Task :buildSrc:spotlessGroovy FROM-CACHE
> Task :buildSrc:spotlessGroovyCheck UP-TO-DATE
> Task :buildSrc:spotlessGroovyGradle FROM-CACHE
> Task :buildSrc:spotlessGroovyGradleCheck UP-TO-DATE
> Task :buildSrc:spotlessCheck UP-TO-DATE
> Task :buildSrc:pluginUnderTestMetadata
> Task :buildSrc:compileTestJava NO-SOURCE
> Task :buildSrc:compileTestGroovy NO-SOURCE
> Task :buildSrc:processTestResources NO-SOURCE
> Task :buildSrc:testClasses UP-TO-DATE
> Task :buildSrc:test NO-SOURCE
> Task :buildSrc:validatePlugins FROM-CACHE
> Task :buildSrc:check UP-TO-DATE
> Task :buildSrc:build

FAILURE: Build failed with an exception.

* Where:
Build file '<https://ci-beam.apache.org/job/beam_PerformanceTests_PubsubIOIT_Python_Streaming/ws/src/sdks/python/apache_beam/testing/load_tests/build.gradle'> line: 51

* What went wrong:
A problem occurred evaluating project ':sdks:python:apache_beam:testing:load_tests'.
> Could not get unknown property 'shadowJar' for project ':runners:google-cloud-dataflow-java:****' of type org.gradle.api.Project.

* Try:
> Run with --stacktrace option to get the stack trace.
> Run with --info or --debug option to get more log output.

* Get more help at https://help.gradle.org

BUILD FAILED in 1s
10 actionable tasks: 4 executed, 4 from cache, 2 up-to-date

Publishing build scan...
https://gradle.com/s/qlsubcxnq4eyu

Build step 'Invoke Gradle script' changed build result to FAILURE
Build step 'Invoke Gradle script' marked build as failure

---------------------------------------------------------------------
To unsubscribe, e-mail: builds-unsubscribe@beam.apache.org
For additional commands, e-mail: builds-help@beam.apache.org


Build failed in Jenkins: beam_PerformanceTests_PubsubIOIT_Python_Streaming #854

Posted by Apache Jenkins Server <je...@builds.apache.org>.
See <https://ci-beam.apache.org/job/beam_PerformanceTests_PubsubIOIT_Python_Streaming/854/display/redirect?page=changes>

Changes:

[git] BEAM-13592 Add getOrderingKey in

[git] Add CHANGES entry

[git] Rename transform name according to review comment

[git] Update  to pass ordering key

[egalpin] Adds ordering key to OutgoingMessage builder, adds new coders to pubsub

[egalpin] Fixes pubsub bounded writer allowing for orderingKey

[egalpin] Alters order of pubsub message support in registrar

[egalpin] Removed publishTime and messageId in grpc pubsub client publish

[egalpin] Attempts to allow different pubsub root url for PubsubIO.Write

[egalpin] Fixes pubsub tests root url

[egalpin] Puts PubsubMessageCoder last in registrar

[egalpin] Uses MoreObjects over Objects

[egalpin] Renames PubsubMessageCoder to

[bulat.safiullin] [Website] update python-dependencies.md link #23478

[bulat.safiullin] [Website] update styles of iframe with video #23499

[bulat.safiullin] [Website] add version.html to shortcodes, update jet.md 22985

[Moritz Mack] Downgrade Scala version in Spark job-server to prevent Scala

[noreply] Support named databases in Firestore connector. Fix and enable Firestore

[noreply] [fixes #23000] Update the Python SDK harness state cache to be a loading

[noreply] Fix permission for Build python wheel branch_repo_nightly step (#23563)

[noreply] [Playground] complexity indicator (#23477)

[noreply] Reolling forward property-based tests for coders (#23425)

[noreply] Updated README for jupyterlab-sidepanel

[noreply] fix distribution example in golang guide (#23567)


------------------------------------------
Started by timer
Running as SYSTEM
[EnvInject] - Loading node environment variables.
Building remotely on apache-beam-jenkins-11 (beam) in workspace <https://ci-beam.apache.org/job/beam_PerformanceTests_PubsubIOIT_Python_Streaming/ws/>
The recommended git tool is: NONE
No credentials specified
Wiping out workspace first.
Cloning the remote Git repository
Cloning repository https://github.com/apache/beam.git
 > git init <https://ci-beam.apache.org/job/beam_PerformanceTests_PubsubIOIT_Python_Streaming/ws/src> # timeout=10
Fetching upstream changes from https://github.com/apache/beam.git
 > git --version # timeout=10
 > git --version # 'git version 2.25.1'
 > git fetch --tags --force --progress -- https://github.com/apache/beam.git +refs/heads/*:refs/remotes/origin/* # timeout=10
 > git config remote.origin.url https://github.com/apache/beam.git # timeout=10
 > git config --add remote.origin.fetch +refs/heads/*:refs/remotes/origin/* # timeout=10
 > git config remote.origin.url https://github.com/apache/beam.git # timeout=10
Fetching upstream changes from https://github.com/apache/beam.git
 > git fetch --tags --force --progress -- https://github.com/apache/beam.git +refs/heads/*:refs/remotes/origin/* +refs/pull/${ghprbPullId}/*:refs/remotes/origin/pr/${ghprbPullId}/* # timeout=10
 > git rev-parse origin/master^{commit} # timeout=10
Checking out Revision 1d573e2f8801c9bf96a4a14a7897cae675360821 (origin/master)
 > git config core.sparsecheckout # timeout=10
 > git checkout -f 1d573e2f8801c9bf96a4a14a7897cae675360821 # timeout=10
Commit message: "Merge pull request #22216 from gemelen/beam-13592-pubsub-java-orderingkey"
 > git rev-list --no-walk b94cff209cc8d1ae61cc916ff6b0b68561dc34c8 # timeout=10
No emails were triggered.
[EnvInject] - Executing scripts and injecting environment variables after the SCM step.
[EnvInject] - Injecting as environment variables the properties content 
SETUPTOOLS_USE_DISTUTILS=stdlib
SPARK_LOCAL_IP=127.0.0.1

[EnvInject] - Variables injected successfully.
[beam_PerformanceTests_PubsubIOIT_Python_Streaming] $ /bin/bash -xe /tmp/jenkins3472055826150679903.sh
+ echo '*** PubsubIO Write Performance Test Python 2GB ***'
*** PubsubIO Write Performance Test Python 2GB ***
[Gradle] - Launching build.
[src] $ <https://ci-beam.apache.org/job/beam_PerformanceTests_PubsubIOIT_Python_Streaming/ws/src/gradlew> -PloadTest.mainClass=apache_beam.io.gcp.pubsub_io_perf_test -Prunner=TestDataflowRunner '-PloadTest.args=--job_name=performance-tests-psio-python-2gb1011150503 --project=apache-beam-testing --region=us-central1 --temp_location=gs://temp-storage-for-perf-tests/loadtests --publish_to_big_query=true --metrics_dataset=beam_performance --metrics_table=psio_io_2GB_results --influx_measurement=python_psio_2GB_results --influx_db_name=beam_test_metrics --influx_hostname=http://10.128.0.96:8086 --input_options='{"num_records": 2097152,"key_size": 1,"value_size": 1024}' --num_****s=5 --autoscaling_algorithm=NONE --pubsub_namespace_prefix=pubsub_io_performance_ --wait_until_finish_duration=600000 --runner=TestDataflowRunner' -PwithDataflowWorkerJar=true -PpythonVersion=3.7 --continue --max-****s=8 -Dorg.gradle.jvmargs=-Xms2g -Dorg.gradle.jvmargs=-Xmx6g -Dorg.gradle.vfs.watch=false -Pdocker-pull-licenses :sdks:python:apache_beam:testing:load_tests:run
Starting a Gradle Daemon, 2 busy Daemons could not be reused, use --status for details
Configuration on demand is an incubating feature.
> Task :buildSrc:compileJava NO-SOURCE
> Task :buildSrc:compileGroovy FROM-CACHE
> Task :buildSrc:pluginDescriptors
> Task :buildSrc:processResources
> Task :buildSrc:classes
> Task :buildSrc:jar
> Task :buildSrc:assemble
> Task :buildSrc:spotlessGroovy FROM-CACHE
> Task :buildSrc:spotlessGroovyCheck UP-TO-DATE
> Task :buildSrc:spotlessGroovyGradle FROM-CACHE
> Task :buildSrc:spotlessGroovyGradleCheck UP-TO-DATE
> Task :buildSrc:spotlessCheck UP-TO-DATE
> Task :buildSrc:pluginUnderTestMetadata
> Task :buildSrc:compileTestJava NO-SOURCE
> Task :buildSrc:compileTestGroovy NO-SOURCE
> Task :buildSrc:processTestResources NO-SOURCE
> Task :buildSrc:testClasses UP-TO-DATE
> Task :buildSrc:test NO-SOURCE
> Task :buildSrc:validatePlugins FROM-CACHE
> Task :buildSrc:check UP-TO-DATE
> Task :buildSrc:build

FAILURE: Build failed with an exception.

* Where:
Build file '<https://ci-beam.apache.org/job/beam_PerformanceTests_PubsubIOIT_Python_Streaming/ws/src/sdks/python/apache_beam/testing/load_tests/build.gradle'> line: 51

* What went wrong:
A problem occurred evaluating project ':sdks:python:apache_beam:testing:load_tests'.
> Could not get unknown property 'shadowJar' for project ':runners:google-cloud-dataflow-java:****' of type org.gradle.api.Project.

* Try:
> Run with --stacktrace option to get the stack trace.
> Run with --info or --debug option to get more log output.

* Get more help at https://help.gradle.org

BUILD FAILED in 11s
10 actionable tasks: 4 executed, 4 from cache, 2 up-to-date

Publishing build scan...
https://gradle.com/s/aj54cyab74ffy

Build step 'Invoke Gradle script' changed build result to FAILURE
Build step 'Invoke Gradle script' marked build as failure

---------------------------------------------------------------------
To unsubscribe, e-mail: builds-unsubscribe@beam.apache.org
For additional commands, e-mail: builds-help@beam.apache.org


Build failed in Jenkins: beam_PerformanceTests_PubsubIOIT_Python_Streaming #853

Posted by Apache Jenkins Server <je...@builds.apache.org>.
See <https://ci-beam.apache.org/job/beam_PerformanceTests_PubsubIOIT_Python_Streaming/853/display/redirect>

Changes:


------------------------------------------
Started by timer
Running as SYSTEM
[EnvInject] - Loading node environment variables.
Building remotely on apache-beam-jenkins-9 (beam) in workspace <https://ci-beam.apache.org/job/beam_PerformanceTests_PubsubIOIT_Python_Streaming/ws/>
The recommended git tool is: NONE
No credentials specified
Wiping out workspace first.
Cloning the remote Git repository
Cloning repository https://github.com/apache/beam.git
 > git init <https://ci-beam.apache.org/job/beam_PerformanceTests_PubsubIOIT_Python_Streaming/ws/src> # timeout=10
Fetching upstream changes from https://github.com/apache/beam.git
 > git --version # timeout=10
 > git --version # 'git version 2.25.1'
 > git fetch --tags --force --progress -- https://github.com/apache/beam.git +refs/heads/*:refs/remotes/origin/* # timeout=10
 > git config remote.origin.url https://github.com/apache/beam.git # timeout=10
 > git config --add remote.origin.fetch +refs/heads/*:refs/remotes/origin/* # timeout=10
 > git config remote.origin.url https://github.com/apache/beam.git # timeout=10
Fetching upstream changes from https://github.com/apache/beam.git
 > git fetch --tags --force --progress -- https://github.com/apache/beam.git +refs/heads/*:refs/remotes/origin/* +refs/pull/${ghprbPullId}/*:refs/remotes/origin/pr/${ghprbPullId}/* # timeout=10
 > git rev-parse origin/master^{commit} # timeout=10
Checking out Revision b94cff209cc8d1ae61cc916ff6b0b68561dc34c8 (origin/master)
 > git config core.sparsecheckout # timeout=10
 > git checkout -f b94cff209cc8d1ae61cc916ff6b0b68561dc34c8 # timeout=10
Commit message: "Merge pull request #23547: update bom to the latest one."
 > git rev-list --no-walk b94cff209cc8d1ae61cc916ff6b0b68561dc34c8 # timeout=10
No emails were triggered.
[EnvInject] - Executing scripts and injecting environment variables after the SCM step.
[EnvInject] - Injecting as environment variables the properties content 
SETUPTOOLS_USE_DISTUTILS=stdlib
SPARK_LOCAL_IP=127.0.0.1

[EnvInject] - Variables injected successfully.
[beam_PerformanceTests_PubsubIOIT_Python_Streaming] $ /bin/bash -xe /tmp/jenkins2781840581994273718.sh
+ echo '*** PubsubIO Write Performance Test Python 2GB ***'
*** PubsubIO Write Performance Test Python 2GB ***
[Gradle] - Launching build.
[src] $ <https://ci-beam.apache.org/job/beam_PerformanceTests_PubsubIOIT_Python_Streaming/ws/src/gradlew> -PloadTest.mainClass=apache_beam.io.gcp.pubsub_io_perf_test -Prunner=TestDataflowRunner '-PloadTest.args=--job_name=performance-tests-psio-python-2gb1010150426 --project=apache-beam-testing --region=us-central1 --temp_location=gs://temp-storage-for-perf-tests/loadtests --publish_to_big_query=true --metrics_dataset=beam_performance --metrics_table=psio_io_2GB_results --influx_measurement=python_psio_2GB_results --influx_db_name=beam_test_metrics --influx_hostname=http://10.128.0.96:8086 --input_options='{"num_records": 2097152,"key_size": 1,"value_size": 1024}' --num_****s=5 --autoscaling_algorithm=NONE --pubsub_namespace_prefix=pubsub_io_performance_ --wait_until_finish_duration=600000 --runner=TestDataflowRunner' -PwithDataflowWorkerJar=true -PpythonVersion=3.7 --continue --max-****s=8 -Dorg.gradle.jvmargs=-Xms2g -Dorg.gradle.jvmargs=-Xmx6g -Dorg.gradle.vfs.watch=false -Pdocker-pull-licenses :sdks:python:apache_beam:testing:load_tests:run
Configuration on demand is an incubating feature.
> Task :buildSrc:compileJava NO-SOURCE
> Task :buildSrc:compileGroovy FROM-CACHE
> Task :buildSrc:pluginDescriptors
> Task :buildSrc:processResources
> Task :buildSrc:classes
> Task :buildSrc:jar
> Task :buildSrc:assemble
> Task :buildSrc:spotlessGroovy FROM-CACHE
> Task :buildSrc:spotlessGroovyCheck UP-TO-DATE
> Task :buildSrc:spotlessGroovyGradle FROM-CACHE
> Task :buildSrc:spotlessGroovyGradleCheck UP-TO-DATE
> Task :buildSrc:spotlessCheck UP-TO-DATE
> Task :buildSrc:pluginUnderTestMetadata
> Task :buildSrc:compileTestJava NO-SOURCE
> Task :buildSrc:compileTestGroovy NO-SOURCE
> Task :buildSrc:processTestResources NO-SOURCE
> Task :buildSrc:testClasses UP-TO-DATE
> Task :buildSrc:test NO-SOURCE
> Task :buildSrc:validatePlugins FROM-CACHE
> Task :buildSrc:check UP-TO-DATE
> Task :buildSrc:build

FAILURE: Build failed with an exception.

* Where:
Build file '<https://ci-beam.apache.org/job/beam_PerformanceTests_PubsubIOIT_Python_Streaming/ws/src/sdks/python/apache_beam/testing/load_tests/build.gradle'> line: 51

* What went wrong:
A problem occurred evaluating project ':sdks:python:apache_beam:testing:load_tests'.
> Could not get unknown property 'shadowJar' for project ':runners:google-cloud-dataflow-java:****' of type org.gradle.api.Project.

* Try:
> Run with --stacktrace option to get the stack trace.
> Run with --info or --debug option to get more log output.

* Get more help at https://help.gradle.org

BUILD FAILED in 1s
10 actionable tasks: 4 executed, 4 from cache, 2 up-to-date

Publishing build scan...
https://gradle.com/s/pha226dvkvn6q

Build step 'Invoke Gradle script' changed build result to FAILURE
Build step 'Invoke Gradle script' marked build as failure

---------------------------------------------------------------------
To unsubscribe, e-mail: builds-unsubscribe@beam.apache.org
For additional commands, e-mail: builds-help@beam.apache.org


Build failed in Jenkins: beam_PerformanceTests_PubsubIOIT_Python_Streaming #852

Posted by Apache Jenkins Server <je...@builds.apache.org>.
See <https://ci-beam.apache.org/job/beam_PerformanceTests_PubsubIOIT_Python_Streaming/852/display/redirect>

Changes:


------------------------------------------
Started by timer
Running as SYSTEM
[EnvInject] - Loading node environment variables.
Building remotely on apache-beam-jenkins-9 (beam) in workspace <https://ci-beam.apache.org/job/beam_PerformanceTests_PubsubIOIT_Python_Streaming/ws/>
The recommended git tool is: NONE
No credentials specified
Wiping out workspace first.
Cloning the remote Git repository
Cloning repository https://github.com/apache/beam.git
 > git init <https://ci-beam.apache.org/job/beam_PerformanceTests_PubsubIOIT_Python_Streaming/ws/src> # timeout=10
Fetching upstream changes from https://github.com/apache/beam.git
 > git --version # timeout=10
 > git --version # 'git version 2.25.1'
 > git fetch --tags --force --progress -- https://github.com/apache/beam.git +refs/heads/*:refs/remotes/origin/* # timeout=10
 > git config remote.origin.url https://github.com/apache/beam.git # timeout=10
 > git config --add remote.origin.fetch +refs/heads/*:refs/remotes/origin/* # timeout=10
 > git config remote.origin.url https://github.com/apache/beam.git # timeout=10
Fetching upstream changes from https://github.com/apache/beam.git
 > git fetch --tags --force --progress -- https://github.com/apache/beam.git +refs/heads/*:refs/remotes/origin/* +refs/pull/${ghprbPullId}/*:refs/remotes/origin/pr/${ghprbPullId}/* # timeout=10
 > git rev-parse origin/master^{commit} # timeout=10
Checking out Revision b94cff209cc8d1ae61cc916ff6b0b68561dc34c8 (origin/master)
 > git config core.sparsecheckout # timeout=10
 > git checkout -f b94cff209cc8d1ae61cc916ff6b0b68561dc34c8 # timeout=10
Commit message: "Merge pull request #23547: update bom to the latest one."
 > git rev-list --no-walk b94cff209cc8d1ae61cc916ff6b0b68561dc34c8 # timeout=10
No emails were triggered.
[EnvInject] - Executing scripts and injecting environment variables after the SCM step.
[EnvInject] - Injecting as environment variables the properties content 
SETUPTOOLS_USE_DISTUTILS=stdlib
SPARK_LOCAL_IP=127.0.0.1

[EnvInject] - Variables injected successfully.
[beam_PerformanceTests_PubsubIOIT_Python_Streaming] $ /bin/bash -xe /tmp/jenkins860181229328134681.sh
+ echo '*** PubsubIO Write Performance Test Python 2GB ***'
*** PubsubIO Write Performance Test Python 2GB ***
[Gradle] - Launching build.
[src] $ <https://ci-beam.apache.org/job/beam_PerformanceTests_PubsubIOIT_Python_Streaming/ws/src/gradlew> -PloadTest.mainClass=apache_beam.io.gcp.pubsub_io_perf_test -Prunner=TestDataflowRunner '-PloadTest.args=--job_name=performance-tests-psio-python-2gb1009150429 --project=apache-beam-testing --region=us-central1 --temp_location=gs://temp-storage-for-perf-tests/loadtests --publish_to_big_query=true --metrics_dataset=beam_performance --metrics_table=psio_io_2GB_results --influx_measurement=python_psio_2GB_results --influx_db_name=beam_test_metrics --influx_hostname=http://10.128.0.96:8086 --input_options='{"num_records": 2097152,"key_size": 1,"value_size": 1024}' --num_****s=5 --autoscaling_algorithm=NONE --pubsub_namespace_prefix=pubsub_io_performance_ --wait_until_finish_duration=600000 --runner=TestDataflowRunner' -PwithDataflowWorkerJar=true -PpythonVersion=3.7 --continue --max-****s=8 -Dorg.gradle.jvmargs=-Xms2g -Dorg.gradle.jvmargs=-Xmx6g -Dorg.gradle.vfs.watch=false -Pdocker-pull-licenses :sdks:python:apache_beam:testing:load_tests:run
Configuration on demand is an incubating feature.
> Task :buildSrc:compileJava NO-SOURCE
> Task :buildSrc:compileGroovy FROM-CACHE
> Task :buildSrc:pluginDescriptors
> Task :buildSrc:processResources
> Task :buildSrc:classes
> Task :buildSrc:jar
> Task :buildSrc:assemble
> Task :buildSrc:spotlessGroovy FROM-CACHE
> Task :buildSrc:spotlessGroovyCheck UP-TO-DATE
> Task :buildSrc:spotlessGroovyGradle FROM-CACHE
> Task :buildSrc:spotlessGroovyGradleCheck UP-TO-DATE
> Task :buildSrc:spotlessCheck UP-TO-DATE
> Task :buildSrc:pluginUnderTestMetadata
> Task :buildSrc:compileTestJava NO-SOURCE
> Task :buildSrc:compileTestGroovy NO-SOURCE
> Task :buildSrc:processTestResources NO-SOURCE
> Task :buildSrc:testClasses UP-TO-DATE
> Task :buildSrc:test NO-SOURCE
> Task :buildSrc:validatePlugins FROM-CACHE
> Task :buildSrc:check UP-TO-DATE
> Task :buildSrc:build

FAILURE: Build failed with an exception.

* Where:
Build file '<https://ci-beam.apache.org/job/beam_PerformanceTests_PubsubIOIT_Python_Streaming/ws/src/sdks/python/apache_beam/testing/load_tests/build.gradle'> line: 51

* What went wrong:
A problem occurred evaluating project ':sdks:python:apache_beam:testing:load_tests'.
> Could not get unknown property 'shadowJar' for project ':runners:google-cloud-dataflow-java:****' of type org.gradle.api.Project.

* Try:
> Run with --stacktrace option to get the stack trace.
> Run with --info or --debug option to get more log output.

* Get more help at https://help.gradle.org

BUILD FAILED in 1s
10 actionable tasks: 4 executed, 4 from cache, 2 up-to-date

Publishing build scan...
https://gradle.com/s/chm5n65nn4kuq

Build step 'Invoke Gradle script' changed build result to FAILURE
Build step 'Invoke Gradle script' marked build as failure

---------------------------------------------------------------------
To unsubscribe, e-mail: builds-unsubscribe@beam.apache.org
For additional commands, e-mail: builds-help@beam.apache.org


Build failed in Jenkins: beam_PerformanceTests_PubsubIOIT_Python_Streaming #851

Posted by Apache Jenkins Server <je...@builds.apache.org>.
See <https://ci-beam.apache.org/job/beam_PerformanceTests_PubsubIOIT_Python_Streaming/851/display/redirect?page=changes>

Changes:

[Moritz Mack] Correctly detect retryable TransientKinesisExceptions (fixes #23517)

[noreply] Fix small error message typo

[noreply] Fixing right nav on Get Started page (#23543)

[noreply] Bump google.golang.org/grpc from 1.49.0 to 1.50.0 in /sdks (#23533)

[noreply] Merge pull request #23547: update bom to the latest one.


------------------------------------------
Started by timer
Running as SYSTEM
[EnvInject] - Loading node environment variables.
Building remotely on apache-beam-jenkins-11 (beam) in workspace <https://ci-beam.apache.org/job/beam_PerformanceTests_PubsubIOIT_Python_Streaming/ws/>
The recommended git tool is: NONE
No credentials specified
Wiping out workspace first.
Cloning the remote Git repository
Cloning repository https://github.com/apache/beam.git
 > git init <https://ci-beam.apache.org/job/beam_PerformanceTests_PubsubIOIT_Python_Streaming/ws/src> # timeout=10
Fetching upstream changes from https://github.com/apache/beam.git
 > git --version # timeout=10
 > git --version # 'git version 2.25.1'
 > git fetch --tags --force --progress -- https://github.com/apache/beam.git +refs/heads/*:refs/remotes/origin/* # timeout=10
 > git config remote.origin.url https://github.com/apache/beam.git # timeout=10
 > git config --add remote.origin.fetch +refs/heads/*:refs/remotes/origin/* # timeout=10
 > git config remote.origin.url https://github.com/apache/beam.git # timeout=10
Fetching upstream changes from https://github.com/apache/beam.git
 > git fetch --tags --force --progress -- https://github.com/apache/beam.git +refs/heads/*:refs/remotes/origin/* +refs/pull/${ghprbPullId}/*:refs/remotes/origin/pr/${ghprbPullId}/* # timeout=10
 > git rev-parse origin/master^{commit} # timeout=10
Checking out Revision b94cff209cc8d1ae61cc916ff6b0b68561dc34c8 (origin/master)
 > git config core.sparsecheckout # timeout=10
 > git checkout -f b94cff209cc8d1ae61cc916ff6b0b68561dc34c8 # timeout=10
Commit message: "Merge pull request #23547: update bom to the latest one."
 > git rev-list --no-walk fc6f400f9abbbe213b5573592cf7a938b5bf16d5 # timeout=10
No emails were triggered.
[EnvInject] - Executing scripts and injecting environment variables after the SCM step.
[EnvInject] - Injecting as environment variables the properties content 
SETUPTOOLS_USE_DISTUTILS=stdlib
SPARK_LOCAL_IP=127.0.0.1

[EnvInject] - Variables injected successfully.
[beam_PerformanceTests_PubsubIOIT_Python_Streaming] $ /bin/bash -xe /tmp/jenkins7190073281225676120.sh
+ echo '*** PubsubIO Write Performance Test Python 2GB ***'
*** PubsubIO Write Performance Test Python 2GB ***
[Gradle] - Launching build.
[src] $ <https://ci-beam.apache.org/job/beam_PerformanceTests_PubsubIOIT_Python_Streaming/ws/src/gradlew> -PloadTest.mainClass=apache_beam.io.gcp.pubsub_io_perf_test -Prunner=TestDataflowRunner '-PloadTest.args=--job_name=performance-tests-psio-python-2gb1008150413 --project=apache-beam-testing --region=us-central1 --temp_location=gs://temp-storage-for-perf-tests/loadtests --publish_to_big_query=true --metrics_dataset=beam_performance --metrics_table=psio_io_2GB_results --influx_measurement=python_psio_2GB_results --influx_db_name=beam_test_metrics --influx_hostname=http://10.128.0.96:8086 --input_options='{"num_records": 2097152,"key_size": 1,"value_size": 1024}' --num_****s=5 --autoscaling_algorithm=NONE --pubsub_namespace_prefix=pubsub_io_performance_ --wait_until_finish_duration=600000 --runner=TestDataflowRunner' -PwithDataflowWorkerJar=true -PpythonVersion=3.7 --continue --max-****s=8 -Dorg.gradle.jvmargs=-Xms2g -Dorg.gradle.jvmargs=-Xmx6g -Dorg.gradle.vfs.watch=false -Pdocker-pull-licenses :sdks:python:apache_beam:testing:load_tests:run
Starting a Gradle Daemon, 2 busy Daemons could not be reused, use --status for details
Configuration on demand is an incubating feature.
> Task :buildSrc:compileJava NO-SOURCE
> Task :buildSrc:compileGroovy FROM-CACHE
> Task :buildSrc:pluginDescriptors
> Task :buildSrc:processResources
> Task :buildSrc:classes
> Task :buildSrc:jar
> Task :buildSrc:assemble
> Task :buildSrc:spotlessGroovy FROM-CACHE
> Task :buildSrc:spotlessGroovyCheck UP-TO-DATE
> Task :buildSrc:spotlessGroovyGradle FROM-CACHE
> Task :buildSrc:spotlessGroovyGradleCheck UP-TO-DATE
> Task :buildSrc:spotlessCheck UP-TO-DATE
> Task :buildSrc:pluginUnderTestMetadata
> Task :buildSrc:compileTestJava NO-SOURCE
> Task :buildSrc:compileTestGroovy NO-SOURCE
> Task :buildSrc:processTestResources NO-SOURCE
> Task :buildSrc:testClasses UP-TO-DATE
> Task :buildSrc:test NO-SOURCE
> Task :buildSrc:validatePlugins FROM-CACHE
> Task :buildSrc:check UP-TO-DATE
> Task :buildSrc:build

FAILURE: Build failed with an exception.

* Where:
Build file '<https://ci-beam.apache.org/job/beam_PerformanceTests_PubsubIOIT_Python_Streaming/ws/src/sdks/python/apache_beam/testing/load_tests/build.gradle'> line: 51

* What went wrong:
A problem occurred evaluating project ':sdks:python:apache_beam:testing:load_tests'.
> Could not get unknown property 'shadowJar' for project ':runners:google-cloud-dataflow-java:****' of type org.gradle.api.Project.

* Try:
> Run with --stacktrace option to get the stack trace.
> Run with --info or --debug option to get more log output.

* Get more help at https://help.gradle.org

BUILD FAILED in 12s
10 actionable tasks: 4 executed, 4 from cache, 2 up-to-date

Publishing build scan...
https://gradle.com/s/bphst2uaetdsm

Build step 'Invoke Gradle script' changed build result to FAILURE
Build step 'Invoke Gradle script' marked build as failure

---------------------------------------------------------------------
To unsubscribe, e-mail: builds-unsubscribe@beam.apache.org
For additional commands, e-mail: builds-help@beam.apache.org


Build failed in Jenkins: beam_PerformanceTests_PubsubIOIT_Python_Streaming #850

Posted by Apache Jenkins Server <je...@builds.apache.org>.
See <https://ci-beam.apache.org/job/beam_PerformanceTests_PubsubIOIT_Python_Streaming/850/display/redirect?page=changes>

Changes:

[toran.sahu] fix typo - s/befrehand/beforehand

[noreply] [Website] update links to https (#23523)

[noreply] Support custom avro DatumReader when reading from BigQuery (#22718)

[noreply] Rename 'clean' Gradle task that required Flutter and has been breaking

[noreply] Model handler unit test (#23506)

[noreply] Content/multi model pipelines (#23498)

[noreply] [Tour of Beam][Frontend] Content Tree and SDK models (#23316) (#23417)

[noreply] Fix bug where `astype(CategoricalDtype)` is rejected (#23513)

[noreply] Bump actions/stale from 5 to 6 (#23331)


------------------------------------------
Started by timer
Running as SYSTEM
[EnvInject] - Loading node environment variables.
Building remotely on apache-beam-jenkins-11 (beam) in workspace <https://ci-beam.apache.org/job/beam_PerformanceTests_PubsubIOIT_Python_Streaming/ws/>
The recommended git tool is: NONE
No credentials specified
Wiping out workspace first.
Cloning the remote Git repository
Cloning repository https://github.com/apache/beam.git
 > git init <https://ci-beam.apache.org/job/beam_PerformanceTests_PubsubIOIT_Python_Streaming/ws/src> # timeout=10
Fetching upstream changes from https://github.com/apache/beam.git
 > git --version # timeout=10
 > git --version # 'git version 2.25.1'
 > git fetch --tags --force --progress -- https://github.com/apache/beam.git +refs/heads/*:refs/remotes/origin/* # timeout=10
 > git config remote.origin.url https://github.com/apache/beam.git # timeout=10
 > git config --add remote.origin.fetch +refs/heads/*:refs/remotes/origin/* # timeout=10
 > git config remote.origin.url https://github.com/apache/beam.git # timeout=10
Fetching upstream changes from https://github.com/apache/beam.git
 > git fetch --tags --force --progress -- https://github.com/apache/beam.git +refs/heads/*:refs/remotes/origin/* +refs/pull/${ghprbPullId}/*:refs/remotes/origin/pr/${ghprbPullId}/* # timeout=10
 > git rev-parse origin/master^{commit} # timeout=10
Checking out Revision fc6f400f9abbbe213b5573592cf7a938b5bf16d5 (origin/master)
 > git config core.sparsecheckout # timeout=10
 > git checkout -f fc6f400f9abbbe213b5573592cf7a938b5bf16d5 # timeout=10
Commit message: "Bump actions/stale from 5 to 6 (#23331)"
 > git rev-list --no-walk c8075de3799a3443ec287cc4cbafe49fa6397e97 # timeout=10
No emails were triggered.
[EnvInject] - Executing scripts and injecting environment variables after the SCM step.
[EnvInject] - Injecting as environment variables the properties content 
SETUPTOOLS_USE_DISTUTILS=stdlib
SPARK_LOCAL_IP=127.0.0.1

[EnvInject] - Variables injected successfully.
[beam_PerformanceTests_PubsubIOIT_Python_Streaming] $ /bin/bash -xe /tmp/jenkins7750031623089907971.sh
+ echo '*** PubsubIO Write Performance Test Python 2GB ***'
*** PubsubIO Write Performance Test Python 2GB ***
[Gradle] - Launching build.
[src] $ <https://ci-beam.apache.org/job/beam_PerformanceTests_PubsubIOIT_Python_Streaming/ws/src/gradlew> -PloadTest.mainClass=apache_beam.io.gcp.pubsub_io_perf_test -Prunner=TestDataflowRunner '-PloadTest.args=--job_name=performance-tests-psio-python-2gb1007150424 --project=apache-beam-testing --region=us-central1 --temp_location=gs://temp-storage-for-perf-tests/loadtests --publish_to_big_query=true --metrics_dataset=beam_performance --metrics_table=psio_io_2GB_results --influx_measurement=python_psio_2GB_results --influx_db_name=beam_test_metrics --influx_hostname=http://10.128.0.96:8086 --input_options='{"num_records": 2097152,"key_size": 1,"value_size": 1024}' --num_****s=5 --autoscaling_algorithm=NONE --pubsub_namespace_prefix=pubsub_io_performance_ --wait_until_finish_duration=600000 --runner=TestDataflowRunner' -PwithDataflowWorkerJar=true -PpythonVersion=3.7 --continue --max-****s=8 -Dorg.gradle.jvmargs=-Xms2g -Dorg.gradle.jvmargs=-Xmx6g -Dorg.gradle.vfs.watch=false -Pdocker-pull-licenses :sdks:python:apache_beam:testing:load_tests:run
Configuration on demand is an incubating feature.
> Task :buildSrc:compileJava NO-SOURCE
> Task :buildSrc:compileGroovy FROM-CACHE
> Task :buildSrc:pluginDescriptors
> Task :buildSrc:processResources
> Task :buildSrc:classes
> Task :buildSrc:jar
> Task :buildSrc:assemble
> Task :buildSrc:spotlessGroovy FROM-CACHE
> Task :buildSrc:spotlessGroovyCheck UP-TO-DATE
> Task :buildSrc:spotlessGroovyGradle FROM-CACHE
> Task :buildSrc:spotlessGroovyGradleCheck UP-TO-DATE
> Task :buildSrc:spotlessCheck UP-TO-DATE
> Task :buildSrc:pluginUnderTestMetadata
> Task :buildSrc:compileTestJava NO-SOURCE
> Task :buildSrc:compileTestGroovy NO-SOURCE
> Task :buildSrc:processTestResources NO-SOURCE
> Task :buildSrc:testClasses UP-TO-DATE
> Task :buildSrc:test NO-SOURCE
> Task :buildSrc:validatePlugins FROM-CACHE
> Task :buildSrc:check UP-TO-DATE
> Task :buildSrc:build

FAILURE: Build failed with an exception.

* Where:
Build file '<https://ci-beam.apache.org/job/beam_PerformanceTests_PubsubIOIT_Python_Streaming/ws/src/sdks/python/apache_beam/testing/load_tests/build.gradle'> line: 51

* What went wrong:
A problem occurred evaluating project ':sdks:python:apache_beam:testing:load_tests'.
> Could not get unknown property 'shadowJar' for project ':runners:google-cloud-dataflow-java:****' of type org.gradle.api.Project.

* Try:
> Run with --stacktrace option to get the stack trace.
> Run with --info or --debug option to get more log output.

* Get more help at https://help.gradle.org

BUILD FAILED in 2s
10 actionable tasks: 4 executed, 4 from cache, 2 up-to-date

Publishing build scan...
https://gradle.com/s/buc4wwnwoacyy

Build step 'Invoke Gradle script' changed build result to FAILURE
Build step 'Invoke Gradle script' marked build as failure

---------------------------------------------------------------------
To unsubscribe, e-mail: builds-unsubscribe@beam.apache.org
For additional commands, e-mail: builds-help@beam.apache.org


Build failed in Jenkins: beam_PerformanceTests_PubsubIOIT_Python_Streaming #849

Posted by Apache Jenkins Server <je...@builds.apache.org>.
See <https://ci-beam.apache.org/job/beam_PerformanceTests_PubsubIOIT_Python_Streaming/849/display/redirect?page=changes>

Changes:

[noreply] Add more typescript examples to the programming guide. (#23058)

[noreply] Merge pull request #23505: opt in for schema update. addresses #23504

[noreply] fix: only report backlog bytes on data records (#23493)

[noreply] Fix broken link in online clustering documentation (#23516)

[noreply] Grant actions using GITHUB_TOKEN the appropriate permission set (#23521)

[noreply] Fix failing Py37 BQ file loads test (#23334)


------------------------------------------
Started by timer
Running as SYSTEM
[EnvInject] - Loading node environment variables.
Building remotely on apache-beam-jenkins-6 (beam) in workspace <https://ci-beam.apache.org/job/beam_PerformanceTests_PubsubIOIT_Python_Streaming/ws/>
The recommended git tool is: NONE
No credentials specified
Wiping out workspace first.
Cloning the remote Git repository
Cloning repository https://github.com/apache/beam.git
 > git init <https://ci-beam.apache.org/job/beam_PerformanceTests_PubsubIOIT_Python_Streaming/ws/src> # timeout=10
Fetching upstream changes from https://github.com/apache/beam.git
 > git --version # timeout=10
 > git --version # 'git version 2.25.1'
 > git fetch --tags --force --progress -- https://github.com/apache/beam.git +refs/heads/*:refs/remotes/origin/* # timeout=10
 > git config remote.origin.url https://github.com/apache/beam.git # timeout=10
 > git config --add remote.origin.fetch +refs/heads/*:refs/remotes/origin/* # timeout=10
 > git config remote.origin.url https://github.com/apache/beam.git # timeout=10
Fetching upstream changes from https://github.com/apache/beam.git
 > git fetch --tags --force --progress -- https://github.com/apache/beam.git +refs/heads/*:refs/remotes/origin/* +refs/pull/${ghprbPullId}/*:refs/remotes/origin/pr/${ghprbPullId}/* # timeout=10
 > git rev-parse origin/master^{commit} # timeout=10
Checking out Revision c8075de3799a3443ec287cc4cbafe49fa6397e97 (origin/master)
 > git config core.sparsecheckout # timeout=10
 > git checkout -f c8075de3799a3443ec287cc4cbafe49fa6397e97 # timeout=10
Commit message: "Fix failing Py37 BQ file loads test (#23334)"
 > git rev-list --no-walk b7b71361590b4fa8bac32a4541058bafdf0d1df1 # timeout=10
No emails were triggered.
[EnvInject] - Executing scripts and injecting environment variables after the SCM step.
[EnvInject] - Injecting as environment variables the properties content 
SETUPTOOLS_USE_DISTUTILS=stdlib
SPARK_LOCAL_IP=127.0.0.1

[EnvInject] - Variables injected successfully.
[beam_PerformanceTests_PubsubIOIT_Python_Streaming] $ /bin/bash -xe /tmp/jenkins3178645841622756262.sh
+ echo '*** PubsubIO Write Performance Test Python 2GB ***'
*** PubsubIO Write Performance Test Python 2GB ***
[Gradle] - Launching build.
[src] $ <https://ci-beam.apache.org/job/beam_PerformanceTests_PubsubIOIT_Python_Streaming/ws/src/gradlew> -PloadTest.mainClass=apache_beam.io.gcp.pubsub_io_perf_test -Prunner=TestDataflowRunner '-PloadTest.args=--job_name=performance-tests-psio-python-2gb1006150444 --project=apache-beam-testing --region=us-central1 --temp_location=gs://temp-storage-for-perf-tests/loadtests --publish_to_big_query=true --metrics_dataset=beam_performance --metrics_table=psio_io_2GB_results --influx_measurement=python_psio_2GB_results --influx_db_name=beam_test_metrics --influx_hostname=http://10.128.0.96:8086 --input_options='{"num_records": 2097152,"key_size": 1,"value_size": 1024}' --num_****s=5 --autoscaling_algorithm=NONE --pubsub_namespace_prefix=pubsub_io_performance_ --wait_until_finish_duration=600000 --runner=TestDataflowRunner' -PwithDataflowWorkerJar=true -PpythonVersion=3.7 --continue --max-****s=8 -Dorg.gradle.jvmargs=-Xms2g -Dorg.gradle.jvmargs=-Xmx6g -Dorg.gradle.vfs.watch=false -Pdocker-pull-licenses :sdks:python:apache_beam:testing:load_tests:run
Starting a Gradle Daemon, 2 busy and 1 incompatible Daemons could not be reused, use --status for details
Configuration on demand is an incubating feature.
> Task :buildSrc:compileJava NO-SOURCE
> Task :buildSrc:compileGroovy FROM-CACHE
> Task :buildSrc:pluginDescriptors
> Task :buildSrc:processResources
> Task :buildSrc:classes
> Task :buildSrc:jar
> Task :buildSrc:assemble
> Task :buildSrc:spotlessGroovy FROM-CACHE
> Task :buildSrc:spotlessGroovyCheck UP-TO-DATE
> Task :buildSrc:spotlessGroovyGradle FROM-CACHE
> Task :buildSrc:spotlessGroovyGradleCheck UP-TO-DATE
> Task :buildSrc:spotlessCheck UP-TO-DATE
> Task :buildSrc:pluginUnderTestMetadata
> Task :buildSrc:compileTestJava NO-SOURCE
> Task :buildSrc:compileTestGroovy NO-SOURCE
> Task :buildSrc:processTestResources NO-SOURCE
> Task :buildSrc:testClasses UP-TO-DATE
> Task :buildSrc:test NO-SOURCE
> Task :buildSrc:validatePlugins FROM-CACHE
> Task :buildSrc:check UP-TO-DATE
> Task :buildSrc:build

FAILURE: Build failed with an exception.

* Where:
Build file '<https://ci-beam.apache.org/job/beam_PerformanceTests_PubsubIOIT_Python_Streaming/ws/src/sdks/python/apache_beam/testing/load_tests/build.gradle'> line: 51

* What went wrong:
A problem occurred evaluating project ':sdks:python:apache_beam:testing:load_tests'.
> Could not get unknown property 'shadowJar' for project ':runners:google-cloud-dataflow-java:****' of type org.gradle.api.Project.

* Try:
> Run with --stacktrace option to get the stack trace.
> Run with --info or --debug option to get more log output.

* Get more help at https://help.gradle.org

BUILD FAILED in 18s
10 actionable tasks: 4 executed, 4 from cache, 2 up-to-date

Publishing build scan...
https://gradle.com/s/hq5shvrvepcf4

Build step 'Invoke Gradle script' changed build result to FAILURE
Build step 'Invoke Gradle script' marked build as failure

---------------------------------------------------------------------
To unsubscribe, e-mail: builds-unsubscribe@beam.apache.org
For additional commands, e-mail: builds-help@beam.apache.org


Build failed in Jenkins: beam_PerformanceTests_PubsubIOIT_Python_Streaming #848

Posted by Apache Jenkins Server <je...@builds.apache.org>.
See <https://ci-beam.apache.org/job/beam_PerformanceTests_PubsubIOIT_Python_Streaming/848/display/redirect?page=changes>

Changes:

[ningkang0957] Prep sidepanel 3.0.0 release

[noreply] Documented supported PyTorch versions (#22974)

[noreply] [Go SDK] Add fake impulse for inputs in Xlang Transform (#23383)

[noreply] Write permissions for issue closer/assigner

[noreply] GA Migration Adding Removal of /.m2/settings.xml (#23481)

[noreply] Bump google-cloud-spanner version for py containers (#23480)

[Moritz Mack] Ensure Java JMH benchmark tasks run sequentially to prevent failure when

[Moritz Mack] Fix validation of measurement name in InfluxDBPublisher (addresses

[noreply] group_id (#23445)

[noreply] Give issue tagger permission to write issues (#23485)

[noreply] Update UID (#23486)

[noreply] Improve error message in GcsUtil (#23482)


------------------------------------------
Started by timer
Running as SYSTEM
[EnvInject] - Loading node environment variables.
Building remotely on apache-beam-jenkins-11 (beam) in workspace <https://ci-beam.apache.org/job/beam_PerformanceTests_PubsubIOIT_Python_Streaming/ws/>
The recommended git tool is: NONE
No credentials specified
Wiping out workspace first.
Cloning the remote Git repository
Cloning repository https://github.com/apache/beam.git
 > git init <https://ci-beam.apache.org/job/beam_PerformanceTests_PubsubIOIT_Python_Streaming/ws/src> # timeout=10
Fetching upstream changes from https://github.com/apache/beam.git
 > git --version # timeout=10
 > git --version # 'git version 2.25.1'
 > git fetch --tags --force --progress -- https://github.com/apache/beam.git +refs/heads/*:refs/remotes/origin/* # timeout=10
 > git config remote.origin.url https://github.com/apache/beam.git # timeout=10
 > git config --add remote.origin.fetch +refs/heads/*:refs/remotes/origin/* # timeout=10
 > git config remote.origin.url https://github.com/apache/beam.git # timeout=10
Fetching upstream changes from https://github.com/apache/beam.git
 > git fetch --tags --force --progress -- https://github.com/apache/beam.git +refs/heads/*:refs/remotes/origin/* +refs/pull/${ghprbPullId}/*:refs/remotes/origin/pr/${ghprbPullId}/* # timeout=10
 > git rev-parse origin/master^{commit} # timeout=10
Checking out Revision b7b71361590b4fa8bac32a4541058bafdf0d1df1 (origin/master)
 > git config core.sparsecheckout # timeout=10
 > git checkout -f b7b71361590b4fa8bac32a4541058bafdf0d1df1 # timeout=10
Commit message: "Improve error message in GcsUtil (#23482)"
 > git rev-list --no-walk 72237d61baf39333db034607491ee2720708cf7e # timeout=10
No emails were triggered.
[EnvInject] - Executing scripts and injecting environment variables after the SCM step.
[EnvInject] - Injecting as environment variables the properties content 
SETUPTOOLS_USE_DISTUTILS=stdlib
SPARK_LOCAL_IP=127.0.0.1

[EnvInject] - Variables injected successfully.
[beam_PerformanceTests_PubsubIOIT_Python_Streaming] $ /bin/bash -xe /tmp/jenkins925664673916669339.sh
+ echo '*** PubsubIO Write Performance Test Python 2GB ***'
*** PubsubIO Write Performance Test Python 2GB ***
[Gradle] - Launching build.
[src] $ <https://ci-beam.apache.org/job/beam_PerformanceTests_PubsubIOIT_Python_Streaming/ws/src/gradlew> -PloadTest.mainClass=apache_beam.io.gcp.pubsub_io_perf_test -Prunner=TestDataflowRunner '-PloadTest.args=--job_name=performance-tests-psio-python-2gb1005150422 --project=apache-beam-testing --region=us-central1 --temp_location=gs://temp-storage-for-perf-tests/loadtests --publish_to_big_query=true --metrics_dataset=beam_performance --metrics_table=psio_io_2GB_results --influx_measurement=python_psio_2GB_results --influx_db_name=beam_test_metrics --influx_hostname=http://10.128.0.96:8086 --input_options='{"num_records": 2097152,"key_size": 1,"value_size": 1024}' --num_****s=5 --autoscaling_algorithm=NONE --pubsub_namespace_prefix=pubsub_io_performance_ --wait_until_finish_duration=600000 --runner=TestDataflowRunner' -PwithDataflowWorkerJar=true -PpythonVersion=3.7 --continue --max-****s=8 -Dorg.gradle.jvmargs=-Xms2g -Dorg.gradle.jvmargs=-Xmx6g -Dorg.gradle.vfs.watch=false -Pdocker-pull-licenses :sdks:python:apache_beam:testing:load_tests:run
Starting a Gradle Daemon, 1 busy Daemon could not be reused, use --status for details
Configuration on demand is an incubating feature.
> Task :buildSrc:compileJava NO-SOURCE
> Task :buildSrc:compileGroovy FROM-CACHE
> Task :buildSrc:pluginDescriptors
> Task :buildSrc:processResources
> Task :buildSrc:classes
> Task :buildSrc:jar
> Task :buildSrc:assemble
> Task :buildSrc:spotlessGroovy FROM-CACHE
> Task :buildSrc:spotlessGroovyCheck UP-TO-DATE
> Task :buildSrc:spotlessGroovyGradle FROM-CACHE
> Task :buildSrc:spotlessGroovyGradleCheck UP-TO-DATE
> Task :buildSrc:spotlessCheck UP-TO-DATE
> Task :buildSrc:pluginUnderTestMetadata
> Task :buildSrc:compileTestJava NO-SOURCE
> Task :buildSrc:compileTestGroovy NO-SOURCE
> Task :buildSrc:processTestResources NO-SOURCE
> Task :buildSrc:testClasses UP-TO-DATE
> Task :buildSrc:test NO-SOURCE
> Task :buildSrc:validatePlugins FROM-CACHE
> Task :buildSrc:check UP-TO-DATE
> Task :buildSrc:build

FAILURE: Build failed with an exception.

* Where:
Build file '<https://ci-beam.apache.org/job/beam_PerformanceTests_PubsubIOIT_Python_Streaming/ws/src/sdks/python/apache_beam/testing/load_tests/build.gradle'> line: 51

* What went wrong:
A problem occurred evaluating project ':sdks:python:apache_beam:testing:load_tests'.
> Could not get unknown property 'shadowJar' for project ':runners:google-cloud-dataflow-java:****' of type org.gradle.api.Project.

* Try:
> Run with --stacktrace option to get the stack trace.
> Run with --info or --debug option to get more log output.

* Get more help at https://help.gradle.org

BUILD FAILED in 12s
10 actionable tasks: 4 executed, 4 from cache, 2 up-to-date

Publishing build scan...
https://gradle.com/s/3ghkjyszytaly

Build step 'Invoke Gradle script' changed build result to FAILURE
Build step 'Invoke Gradle script' marked build as failure

---------------------------------------------------------------------
To unsubscribe, e-mail: builds-unsubscribe@beam.apache.org
For additional commands, e-mail: builds-help@beam.apache.org


Build failed in Jenkins: beam_PerformanceTests_PubsubIOIT_Python_Streaming #847

Posted by Apache Jenkins Server <je...@builds.apache.org>.
See <https://ci-beam.apache.org/job/beam_PerformanceTests_PubsubIOIT_Python_Streaming/847/display/redirect?page=changes>

Changes:

[bulat.safiullin] [Website] fix navbar footer overlap #22698

[noreply] [Website] Add new Java quickstart (#22747)

[Robert Bradshaw] Require time-bound flag for non-UW streaming Python jobs for new SDKs.

[noreply] Fix JdbcIOIT, which seems to have never worked (#21796)

[noreply] Support DECIMAL logical type in python SDK (#23014)

[noreply] AI/ML pipelines master page documentation (#23443)

[noreply] Fix go fmt error (#23474)

[noreply] Revert "Add drop_example flag to the RunInference and Model Handler


------------------------------------------
Started by timer
Running as SYSTEM
[EnvInject] - Loading node environment variables.
Building remotely on apache-beam-jenkins-13 (beam) in workspace <https://ci-beam.apache.org/job/beam_PerformanceTests_PubsubIOIT_Python_Streaming/ws/>
The recommended git tool is: NONE
No credentials specified
Wiping out workspace first.
Cloning the remote Git repository
Cloning repository https://github.com/apache/beam.git
 > git init <https://ci-beam.apache.org/job/beam_PerformanceTests_PubsubIOIT_Python_Streaming/ws/src> # timeout=10
Fetching upstream changes from https://github.com/apache/beam.git
 > git --version # timeout=10
 > git --version # 'git version 2.25.1'
 > git fetch --tags --force --progress -- https://github.com/apache/beam.git +refs/heads/*:refs/remotes/origin/* # timeout=10
 > git config remote.origin.url https://github.com/apache/beam.git # timeout=10
 > git config --add remote.origin.fetch +refs/heads/*:refs/remotes/origin/* # timeout=10
 > git config remote.origin.url https://github.com/apache/beam.git # timeout=10
Fetching upstream changes from https://github.com/apache/beam.git
 > git fetch --tags --force --progress -- https://github.com/apache/beam.git +refs/heads/*:refs/remotes/origin/* +refs/pull/${ghprbPullId}/*:refs/remotes/origin/pr/${ghprbPullId}/* # timeout=10
 > git rev-parse origin/master^{commit} # timeout=10
Checking out Revision 72237d61baf39333db034607491ee2720708cf7e (origin/master)
 > git config core.sparsecheckout # timeout=10
 > git checkout -f 72237d61baf39333db034607491ee2720708cf7e # timeout=10
Commit message: "Revert "Add drop_example flag to the RunInference and Model Handler (#23266)" (#23392)"
 > git rev-list --no-walk 8ac77a99ba52e70f014db047dd961fdda598e001 # timeout=10
No emails were triggered.
[EnvInject] - Executing scripts and injecting environment variables after the SCM step.
[EnvInject] - Injecting as environment variables the properties content 
SETUPTOOLS_USE_DISTUTILS=stdlib
SPARK_LOCAL_IP=127.0.0.1

[EnvInject] - Variables injected successfully.
[beam_PerformanceTests_PubsubIOIT_Python_Streaming] $ /bin/bash -xe /tmp/jenkins4353706877099509509.sh
+ echo '*** PubsubIO Write Performance Test Python 2GB ***'
*** PubsubIO Write Performance Test Python 2GB ***
[Gradle] - Launching build.
[src] $ <https://ci-beam.apache.org/job/beam_PerformanceTests_PubsubIOIT_Python_Streaming/ws/src/gradlew> -PloadTest.mainClass=apache_beam.io.gcp.pubsub_io_perf_test -Prunner=TestDataflowRunner '-PloadTest.args=--job_name=performance-tests-psio-python-2gb1004150420 --project=apache-beam-testing --region=us-central1 --temp_location=gs://temp-storage-for-perf-tests/loadtests --publish_to_big_query=true --metrics_dataset=beam_performance --metrics_table=psio_io_2GB_results --influx_measurement=python_psio_2GB_results --influx_db_name=beam_test_metrics --influx_hostname=http://10.128.0.96:8086 --input_options='{"num_records": 2097152,"key_size": 1,"value_size": 1024}' --num_****s=5 --autoscaling_algorithm=NONE --pubsub_namespace_prefix=pubsub_io_performance_ --wait_until_finish_duration=600000 --runner=TestDataflowRunner' -PwithDataflowWorkerJar=true -PpythonVersion=3.7 --continue --max-****s=8 -Dorg.gradle.jvmargs=-Xms2g -Dorg.gradle.jvmargs=-Xmx6g -Dorg.gradle.vfs.watch=false -Pdocker-pull-licenses :sdks:python:apache_beam:testing:load_tests:run
Starting a Gradle Daemon, 3 busy Daemons could not be reused, use --status for details
Configuration on demand is an incubating feature.
> Task :buildSrc:compileJava NO-SOURCE
> Task :buildSrc:compileGroovy FROM-CACHE
> Task :buildSrc:pluginDescriptors
> Task :buildSrc:processResources
> Task :buildSrc:classes
> Task :buildSrc:jar
> Task :buildSrc:assemble
> Task :buildSrc:spotlessGroovy FROM-CACHE
> Task :buildSrc:spotlessGroovyCheck UP-TO-DATE
> Task :buildSrc:spotlessGroovyGradle FROM-CACHE
> Task :buildSrc:spotlessGroovyGradleCheck UP-TO-DATE
> Task :buildSrc:spotlessCheck UP-TO-DATE
> Task :buildSrc:pluginUnderTestMetadata
> Task :buildSrc:compileTestJava NO-SOURCE
> Task :buildSrc:compileTestGroovy NO-SOURCE
> Task :buildSrc:processTestResources NO-SOURCE
> Task :buildSrc:testClasses UP-TO-DATE
> Task :buildSrc:test NO-SOURCE
> Task :buildSrc:validatePlugins FROM-CACHE
> Task :buildSrc:check UP-TO-DATE
> Task :buildSrc:build

FAILURE: Build failed with an exception.

* Where:
Build file '<https://ci-beam.apache.org/job/beam_PerformanceTests_PubsubIOIT_Python_Streaming/ws/src/sdks/python/apache_beam/testing/load_tests/build.gradle'> line: 51

* What went wrong:
A problem occurred evaluating project ':sdks:python:apache_beam:testing:load_tests'.
> Could not get unknown property 'shadowJar' for project ':runners:google-cloud-dataflow-java:****' of type org.gradle.api.Project.

* Try:
> Run with --stacktrace option to get the stack trace.
> Run with --info or --debug option to get more log output.

* Get more help at https://help.gradle.org

BUILD FAILED in 36s
10 actionable tasks: 4 executed, 4 from cache, 2 up-to-date

Publishing build scan...
https://gradle.com/s/4jdwbjlpeh43w

Build step 'Invoke Gradle script' changed build result to FAILURE
Build step 'Invoke Gradle script' marked build as failure

---------------------------------------------------------------------
To unsubscribe, e-mail: builds-unsubscribe@beam.apache.org
For additional commands, e-mail: builds-help@beam.apache.org


Build failed in Jenkins: beam_PerformanceTests_PubsubIOIT_Python_Streaming #846

Posted by Apache Jenkins Server <je...@builds.apache.org>.
See <https://ci-beam.apache.org/job/beam_PerformanceTests_PubsubIOIT_Python_Streaming/846/display/redirect?page=changes>

Changes:

[noreply] [Tour Of Beam] return taskSnippetId/solutionSnippedId (#23419)

[noreply] Beam 21465 add requires stable input (#23230)


------------------------------------------
Started by timer
Running as SYSTEM
[EnvInject] - Loading node environment variables.
Building remotely on apache-beam-jenkins-11 (beam) in workspace <https://ci-beam.apache.org/job/beam_PerformanceTests_PubsubIOIT_Python_Streaming/ws/>
The recommended git tool is: NONE
No credentials specified
Wiping out workspace first.
Cloning the remote Git repository
Cloning repository https://github.com/apache/beam.git
 > git init <https://ci-beam.apache.org/job/beam_PerformanceTests_PubsubIOIT_Python_Streaming/ws/src> # timeout=10
Fetching upstream changes from https://github.com/apache/beam.git
 > git --version # timeout=10
 > git --version # 'git version 2.25.1'
 > git fetch --tags --force --progress -- https://github.com/apache/beam.git +refs/heads/*:refs/remotes/origin/* # timeout=10
 > git config remote.origin.url https://github.com/apache/beam.git # timeout=10
 > git config --add remote.origin.fetch +refs/heads/*:refs/remotes/origin/* # timeout=10
 > git config remote.origin.url https://github.com/apache/beam.git # timeout=10
Fetching upstream changes from https://github.com/apache/beam.git
 > git fetch --tags --force --progress -- https://github.com/apache/beam.git +refs/heads/*:refs/remotes/origin/* +refs/pull/${ghprbPullId}/*:refs/remotes/origin/pr/${ghprbPullId}/* # timeout=10
 > git rev-parse origin/master^{commit} # timeout=10
Checking out Revision 8ac77a99ba52e70f014db047dd961fdda598e001 (origin/master)
 > git config core.sparsecheckout # timeout=10
 > git checkout -f 8ac77a99ba52e70f014db047dd961fdda598e001 # timeout=10
Commit message: "Beam 21465 add requires stable input (#23230)"
 > git rev-list --no-walk 3c7a3d40ce12eef5f4d361c67f1286b487847f65 # timeout=10
No emails were triggered.
[EnvInject] - Executing scripts and injecting environment variables after the SCM step.
[EnvInject] - Injecting as environment variables the properties content 
SETUPTOOLS_USE_DISTUTILS=stdlib
SPARK_LOCAL_IP=127.0.0.1

[EnvInject] - Variables injected successfully.
[beam_PerformanceTests_PubsubIOIT_Python_Streaming] $ /bin/bash -xe /tmp/jenkins4317345647147958772.sh
+ echo '*** PubsubIO Write Performance Test Python 2GB ***'
*** PubsubIO Write Performance Test Python 2GB ***
[Gradle] - Launching build.
[src] $ <https://ci-beam.apache.org/job/beam_PerformanceTests_PubsubIOIT_Python_Streaming/ws/src/gradlew> -PloadTest.mainClass=apache_beam.io.gcp.pubsub_io_perf_test -Prunner=TestDataflowRunner '-PloadTest.args=--job_name=performance-tests-psio-python-2gb1003150428 --project=apache-beam-testing --region=us-central1 --temp_location=gs://temp-storage-for-perf-tests/loadtests --publish_to_big_query=true --metrics_dataset=beam_performance --metrics_table=psio_io_2GB_results --influx_measurement=python_psio_2GB_results --influx_db_name=beam_test_metrics --influx_hostname=http://10.128.0.96:8086 --input_options='{"num_records": 2097152,"key_size": 1,"value_size": 1024}' --num_****s=5 --autoscaling_algorithm=NONE --pubsub_namespace_prefix=pubsub_io_performance_ --wait_until_finish_duration=600000 --runner=TestDataflowRunner' -PwithDataflowWorkerJar=true -PpythonVersion=3.7 --continue --max-****s=8 -Dorg.gradle.jvmargs=-Xms2g -Dorg.gradle.jvmargs=-Xmx6g -Dorg.gradle.vfs.watch=false -Pdocker-pull-licenses :sdks:python:apache_beam:testing:load_tests:run
Starting a Gradle Daemon (subsequent builds will be faster)
Configuration on demand is an incubating feature.
> Task :buildSrc:compileJava NO-SOURCE
> Task :buildSrc:compileGroovy FROM-CACHE
> Task :buildSrc:pluginDescriptors
> Task :buildSrc:processResources
> Task :buildSrc:classes
> Task :buildSrc:jar
> Task :buildSrc:assemble
> Task :buildSrc:spotlessGroovy FROM-CACHE
> Task :buildSrc:spotlessGroovyCheck UP-TO-DATE
> Task :buildSrc:spotlessGroovyGradle FROM-CACHE
> Task :buildSrc:spotlessGroovyGradleCheck UP-TO-DATE
> Task :buildSrc:spotlessCheck UP-TO-DATE
> Task :buildSrc:pluginUnderTestMetadata
> Task :buildSrc:compileTestJava NO-SOURCE
> Task :buildSrc:compileTestGroovy NO-SOURCE
> Task :buildSrc:processTestResources NO-SOURCE
> Task :buildSrc:testClasses UP-TO-DATE
> Task :buildSrc:test NO-SOURCE
> Task :buildSrc:validatePlugins FROM-CACHE
> Task :buildSrc:check UP-TO-DATE
> Task :buildSrc:build

FAILURE: Build failed with an exception.

* Where:
Build file '<https://ci-beam.apache.org/job/beam_PerformanceTests_PubsubIOIT_Python_Streaming/ws/src/sdks/python/apache_beam/testing/load_tests/build.gradle'> line: 51

* What went wrong:
A problem occurred evaluating project ':sdks:python:apache_beam:testing:load_tests'.
> Could not get unknown property 'shadowJar' for project ':runners:google-cloud-dataflow-java:****' of type org.gradle.api.Project.

* Try:
> Run with --stacktrace option to get the stack trace.
> Run with --info or --debug option to get more log output.

* Get more help at https://help.gradle.org

BUILD FAILED in 10s
10 actionable tasks: 4 executed, 4 from cache, 2 up-to-date

Publishing build scan...
https://gradle.com/s/olk373asgbgb2

Build step 'Invoke Gradle script' changed build result to FAILURE
Build step 'Invoke Gradle script' marked build as failure

---------------------------------------------------------------------
To unsubscribe, e-mail: builds-unsubscribe@beam.apache.org
For additional commands, e-mail: builds-help@beam.apache.org


Build failed in Jenkins: beam_PerformanceTests_PubsubIOIT_Python_Streaming #845

Posted by Apache Jenkins Server <je...@builds.apache.org>.
See <https://ci-beam.apache.org/job/beam_PerformanceTests_PubsubIOIT_Python_Streaming/845/display/redirect>

Changes:


------------------------------------------
Started by timer
Running as SYSTEM
[EnvInject] - Loading node environment variables.
Building remotely on apache-beam-jenkins-11 (beam) in workspace <https://ci-beam.apache.org/job/beam_PerformanceTests_PubsubIOIT_Python_Streaming/ws/>
The recommended git tool is: NONE
No credentials specified
Wiping out workspace first.
Cloning the remote Git repository
Cloning repository https://github.com/apache/beam.git
 > git init <https://ci-beam.apache.org/job/beam_PerformanceTests_PubsubIOIT_Python_Streaming/ws/src> # timeout=10
Fetching upstream changes from https://github.com/apache/beam.git
 > git --version # timeout=10
 > git --version # 'git version 2.25.1'
 > git fetch --tags --force --progress -- https://github.com/apache/beam.git +refs/heads/*:refs/remotes/origin/* # timeout=10
 > git config remote.origin.url https://github.com/apache/beam.git # timeout=10
 > git config --add remote.origin.fetch +refs/heads/*:refs/remotes/origin/* # timeout=10
 > git config remote.origin.url https://github.com/apache/beam.git # timeout=10
Fetching upstream changes from https://github.com/apache/beam.git
 > git fetch --tags --force --progress -- https://github.com/apache/beam.git +refs/heads/*:refs/remotes/origin/* +refs/pull/${ghprbPullId}/*:refs/remotes/origin/pr/${ghprbPullId}/* # timeout=10
 > git rev-parse origin/master^{commit} # timeout=10
Checking out Revision 3c7a3d40ce12eef5f4d361c67f1286b487847f65 (origin/master)
 > git config core.sparsecheckout # timeout=10
 > git checkout -f 3c7a3d40ce12eef5f4d361c67f1286b487847f65 # timeout=10
Commit message: "JdbcIO fetchSize can be set to Integer.MIN_VALUE (#23444)"
 > git rev-list --no-walk 3c7a3d40ce12eef5f4d361c67f1286b487847f65 # timeout=10
No emails were triggered.
[EnvInject] - Executing scripts and injecting environment variables after the SCM step.
[EnvInject] - Injecting as environment variables the properties content 
SETUPTOOLS_USE_DISTUTILS=stdlib
SPARK_LOCAL_IP=127.0.0.1

[EnvInject] - Variables injected successfully.
[beam_PerformanceTests_PubsubIOIT_Python_Streaming] $ /bin/bash -xe /tmp/jenkins3005541339403567610.sh
+ echo '*** PubsubIO Write Performance Test Python 2GB ***'
*** PubsubIO Write Performance Test Python 2GB ***
[Gradle] - Launching build.
[src] $ <https://ci-beam.apache.org/job/beam_PerformanceTests_PubsubIOIT_Python_Streaming/ws/src/gradlew> -PloadTest.mainClass=apache_beam.io.gcp.pubsub_io_perf_test -Prunner=TestDataflowRunner '-PloadTest.args=--job_name=performance-tests-psio-python-2gb1002150426 --project=apache-beam-testing --region=us-central1 --temp_location=gs://temp-storage-for-perf-tests/loadtests --publish_to_big_query=true --metrics_dataset=beam_performance --metrics_table=psio_io_2GB_results --influx_measurement=python_psio_2GB_results --influx_db_name=beam_test_metrics --influx_hostname=http://10.128.0.96:8086 --input_options='{"num_records": 2097152,"key_size": 1,"value_size": 1024}' --num_****s=5 --autoscaling_algorithm=NONE --pubsub_namespace_prefix=pubsub_io_performance_ --wait_until_finish_duration=600000 --runner=TestDataflowRunner' -PwithDataflowWorkerJar=true -PpythonVersion=3.7 --continue --max-****s=8 -Dorg.gradle.jvmargs=-Xms2g -Dorg.gradle.jvmargs=-Xmx6g -Dorg.gradle.vfs.watch=false -Pdocker-pull-licenses :sdks:python:apache_beam:testing:load_tests:run
Starting a Gradle Daemon, 1 busy Daemon could not be reused, use --status for details
Configuration on demand is an incubating feature.
> Task :buildSrc:compileJava NO-SOURCE
> Task :buildSrc:compileGroovy FROM-CACHE
> Task :buildSrc:pluginDescriptors
> Task :buildSrc:processResources
> Task :buildSrc:classes
> Task :buildSrc:jar
> Task :buildSrc:assemble
> Task :buildSrc:spotlessGroovy FROM-CACHE
> Task :buildSrc:spotlessGroovyCheck UP-TO-DATE
> Task :buildSrc:spotlessGroovyGradle FROM-CACHE
> Task :buildSrc:spotlessGroovyGradleCheck UP-TO-DATE
> Task :buildSrc:spotlessCheck UP-TO-DATE
> Task :buildSrc:pluginUnderTestMetadata
> Task :buildSrc:compileTestJava NO-SOURCE
> Task :buildSrc:compileTestGroovy NO-SOURCE
> Task :buildSrc:processTestResources NO-SOURCE
> Task :buildSrc:testClasses UP-TO-DATE
> Task :buildSrc:test NO-SOURCE
> Task :buildSrc:validatePlugins FROM-CACHE
> Task :buildSrc:check UP-TO-DATE
> Task :buildSrc:build

FAILURE: Build failed with an exception.

* Where:
Build file '<https://ci-beam.apache.org/job/beam_PerformanceTests_PubsubIOIT_Python_Streaming/ws/src/sdks/python/apache_beam/testing/load_tests/build.gradle'> line: 51

* What went wrong:
A problem occurred evaluating project ':sdks:python:apache_beam:testing:load_tests'.
> Could not get unknown property 'shadowJar' for project ':runners:google-cloud-dataflow-java:****' of type org.gradle.api.Project.

* Try:
> Run with --stacktrace option to get the stack trace.
> Run with --info or --debug option to get more log output.

* Get more help at https://help.gradle.org

BUILD FAILED in 10s
10 actionable tasks: 4 executed, 4 from cache, 2 up-to-date

Publishing build scan...
https://gradle.com/s/aezpofrsgismk

Build step 'Invoke Gradle script' changed build result to FAILURE
Build step 'Invoke Gradle script' marked build as failure

---------------------------------------------------------------------
To unsubscribe, e-mail: builds-unsubscribe@beam.apache.org
For additional commands, e-mail: builds-help@beam.apache.org


Build failed in Jenkins: beam_PerformanceTests_PubsubIOIT_Python_Streaming #844

Posted by Apache Jenkins Server <je...@builds.apache.org>.
See <https://ci-beam.apache.org/job/beam_PerformanceTests_PubsubIOIT_Python_Streaming/844/display/redirect?page=changes>

Changes:

[Robert Bradshaw] Batch encoding and decoding of schema data.

[Robert Bradshaw] Add microbenchmark for batch row encoding.

[Robert Bradshaw] Add batch testing for standard row coders.

[noreply] Relax `pip` check in setup.py to allow installation via other package

[noreply] replaced tabs with spaces in readme file (#23446)

[noreply] [Playground] [Backend] Adding the tags field to the example response

[noreply] [Playground] [Backend] Edited the function for getting executable name

[noreply] Fix type inference for set/delete attr. (#23242)

[noreply] Support VR test including TestStream for Spark runner in streaming mode

[noreply] Add cron job to trigger Java JMH micro-benchmarks weekly  (#23388)

[noreply] JdbcIO fetchSize can be set to Integer.MIN_VALUE (#23444)


------------------------------------------
Started by timer
Running as SYSTEM
[EnvInject] - Loading node environment variables.
Building remotely on apache-beam-jenkins-11 (beam) in workspace <https://ci-beam.apache.org/job/beam_PerformanceTests_PubsubIOIT_Python_Streaming/ws/>
The recommended git tool is: NONE
No credentials specified
Wiping out workspace first.
Cloning the remote Git repository
Cloning repository https://github.com/apache/beam.git
 > git init <https://ci-beam.apache.org/job/beam_PerformanceTests_PubsubIOIT_Python_Streaming/ws/src> # timeout=10
Fetching upstream changes from https://github.com/apache/beam.git
 > git --version # timeout=10
 > git --version # 'git version 2.25.1'
 > git fetch --tags --force --progress -- https://github.com/apache/beam.git +refs/heads/*:refs/remotes/origin/* # timeout=10
 > git config remote.origin.url https://github.com/apache/beam.git # timeout=10
 > git config --add remote.origin.fetch +refs/heads/*:refs/remotes/origin/* # timeout=10
 > git config remote.origin.url https://github.com/apache/beam.git # timeout=10
Fetching upstream changes from https://github.com/apache/beam.git
 > git fetch --tags --force --progress -- https://github.com/apache/beam.git +refs/heads/*:refs/remotes/origin/* +refs/pull/${ghprbPullId}/*:refs/remotes/origin/pr/${ghprbPullId}/* # timeout=10
 > git rev-parse origin/master^{commit} # timeout=10
Checking out Revision 3c7a3d40ce12eef5f4d361c67f1286b487847f65 (origin/master)
 > git config core.sparsecheckout # timeout=10
 > git checkout -f 3c7a3d40ce12eef5f4d361c67f1286b487847f65 # timeout=10
Commit message: "JdbcIO fetchSize can be set to Integer.MIN_VALUE (#23444)"
 > git rev-list --no-walk f2d426d2d2c088a573ab5a96e6e6bfc1bbf45b21 # timeout=10
No emails were triggered.
[EnvInject] - Executing scripts and injecting environment variables after the SCM step.
[EnvInject] - Injecting as environment variables the properties content 
SETUPTOOLS_USE_DISTUTILS=stdlib
SPARK_LOCAL_IP=127.0.0.1

[EnvInject] - Variables injected successfully.
[beam_PerformanceTests_PubsubIOIT_Python_Streaming] $ /bin/bash -xe /tmp/jenkins1001766748215315454.sh
+ echo '*** PubsubIO Write Performance Test Python 2GB ***'
*** PubsubIO Write Performance Test Python 2GB ***
[Gradle] - Launching build.
[src] $ <https://ci-beam.apache.org/job/beam_PerformanceTests_PubsubIOIT_Python_Streaming/ws/src/gradlew> -PloadTest.mainClass=apache_beam.io.gcp.pubsub_io_perf_test -Prunner=TestDataflowRunner '-PloadTest.args=--job_name=performance-tests-psio-python-2gb1001150421 --project=apache-beam-testing --region=us-central1 --temp_location=gs://temp-storage-for-perf-tests/loadtests --publish_to_big_query=true --metrics_dataset=beam_performance --metrics_table=psio_io_2GB_results --influx_measurement=python_psio_2GB_results --influx_db_name=beam_test_metrics --influx_hostname=http://10.128.0.96:8086 --input_options='{"num_records": 2097152,"key_size": 1,"value_size": 1024}' --num_****s=5 --autoscaling_algorithm=NONE --pubsub_namespace_prefix=pubsub_io_performance_ --wait_until_finish_duration=600000 --runner=TestDataflowRunner' -PwithDataflowWorkerJar=true -PpythonVersion=3.7 --continue --max-****s=8 -Dorg.gradle.jvmargs=-Xms2g -Dorg.gradle.jvmargs=-Xmx6g -Dorg.gradle.vfs.watch=false -Pdocker-pull-licenses :sdks:python:apache_beam:testing:load_tests:run
Starting a Gradle Daemon (subsequent builds will be faster)
Configuration on demand is an incubating feature.
> Task :buildSrc:compileJava NO-SOURCE
> Task :buildSrc:compileGroovy FROM-CACHE
> Task :buildSrc:pluginDescriptors
> Task :buildSrc:processResources
> Task :buildSrc:classes
> Task :buildSrc:jar
> Task :buildSrc:assemble
> Task :buildSrc:spotlessGroovy FROM-CACHE
> Task :buildSrc:spotlessGroovyCheck UP-TO-DATE
> Task :buildSrc:spotlessGroovyGradle FROM-CACHE
> Task :buildSrc:spotlessGroovyGradleCheck UP-TO-DATE
> Task :buildSrc:spotlessCheck UP-TO-DATE
> Task :buildSrc:pluginUnderTestMetadata
> Task :buildSrc:compileTestJava NO-SOURCE
> Task :buildSrc:compileTestGroovy NO-SOURCE
> Task :buildSrc:processTestResources NO-SOURCE
> Task :buildSrc:testClasses UP-TO-DATE
> Task :buildSrc:test NO-SOURCE
> Task :buildSrc:validatePlugins FROM-CACHE
> Task :buildSrc:check UP-TO-DATE
> Task :buildSrc:build

FAILURE: Build failed with an exception.

* Where:
Build file '<https://ci-beam.apache.org/job/beam_PerformanceTests_PubsubIOIT_Python_Streaming/ws/src/sdks/python/apache_beam/testing/load_tests/build.gradle'> line: 51

* What went wrong:
A problem occurred evaluating project ':sdks:python:apache_beam:testing:load_tests'.
> Could not get unknown property 'shadowJar' for project ':runners:google-cloud-dataflow-java:****' of type org.gradle.api.Project.

* Try:
> Run with --stacktrace option to get the stack trace.
> Run with --info or --debug option to get more log output.

* Get more help at https://help.gradle.org

BUILD FAILED in 10s
10 actionable tasks: 4 executed, 4 from cache, 2 up-to-date

Publishing build scan...
https://gradle.com/s/ekbivmvoln7gg

Build step 'Invoke Gradle script' changed build result to FAILURE
Build step 'Invoke Gradle script' marked build as failure

---------------------------------------------------------------------
To unsubscribe, e-mail: builds-unsubscribe@beam.apache.org
For additional commands, e-mail: builds-help@beam.apache.org


Build failed in Jenkins: beam_PerformanceTests_PubsubIOIT_Python_Streaming #843

Posted by Apache Jenkins Server <je...@builds.apache.org>.
See <https://ci-beam.apache.org/job/beam_PerformanceTests_PubsubIOIT_Python_Streaming/843/display/redirect?page=changes>

Changes:

[Robert Bradshaw] Python cross language docs.

[srohde] Add documentation link to the interactive environment

[noreply] Bump google.golang.org/api from 0.97.0 to 0.98.0 in /sdks (#23394)

[noreply] Increase Go Dataflow Postcommit timeout to 5h (#23423)

[noreply] [Playground] [Backend] Updating endpoints for playground examples

[noreply] Send JavaScript messages to Playground iframes when switching the

[noreply] [Playground] [Backend] Adding SDK to the example response (#22871)

[noreply] [Playground] [Backend] Removing the code related to the Cloud Storage

[noreply] [BEAM-10785] Change RowAsDictJsonCoder to not ensure ASCII while

[noreply] Update Python katas to latest version of EduTools and Beam 2.41 (#23180)

[noreply] RunInference Benchmarks UI (#23426)


------------------------------------------
Started by timer
Running as SYSTEM
[EnvInject] - Loading node environment variables.
Building remotely on apache-beam-jenkins-11 (beam) in workspace <https://ci-beam.apache.org/job/beam_PerformanceTests_PubsubIOIT_Python_Streaming/ws/>
The recommended git tool is: NONE
No credentials specified
Wiping out workspace first.
Cloning the remote Git repository
Cloning repository https://github.com/apache/beam.git
 > git init <https://ci-beam.apache.org/job/beam_PerformanceTests_PubsubIOIT_Python_Streaming/ws/src> # timeout=10
Fetching upstream changes from https://github.com/apache/beam.git
 > git --version # timeout=10
 > git --version # 'git version 2.25.1'
 > git fetch --tags --force --progress -- https://github.com/apache/beam.git +refs/heads/*:refs/remotes/origin/* # timeout=10
 > git config remote.origin.url https://github.com/apache/beam.git # timeout=10
 > git config --add remote.origin.fetch +refs/heads/*:refs/remotes/origin/* # timeout=10
 > git config remote.origin.url https://github.com/apache/beam.git # timeout=10
Fetching upstream changes from https://github.com/apache/beam.git
 > git fetch --tags --force --progress -- https://github.com/apache/beam.git +refs/heads/*:refs/remotes/origin/* +refs/pull/${ghprbPullId}/*:refs/remotes/origin/pr/${ghprbPullId}/* # timeout=10
 > git rev-parse origin/master^{commit} # timeout=10
Checking out Revision f2d426d2d2c088a573ab5a96e6e6bfc1bbf45b21 (origin/master)
 > git config core.sparsecheckout # timeout=10
 > git checkout -f f2d426d2d2c088a573ab5a96e6e6bfc1bbf45b21 # timeout=10
Commit message: "RunInference Benchmarks UI (#23426)"
 > git rev-list --no-walk 7b8aa28e34a70a178bd569b28c3e0fcf9d87dd6b # timeout=10
No emails were triggered.
[EnvInject] - Executing scripts and injecting environment variables after the SCM step.
[EnvInject] - Injecting as environment variables the properties content 
SETUPTOOLS_USE_DISTUTILS=stdlib
SPARK_LOCAL_IP=127.0.0.1

[EnvInject] - Variables injected successfully.
[beam_PerformanceTests_PubsubIOIT_Python_Streaming] $ /bin/bash -xe /tmp/jenkins1927767857381318113.sh
+ echo '*** PubsubIO Write Performance Test Python 2GB ***'
*** PubsubIO Write Performance Test Python 2GB ***
[Gradle] - Launching build.
[src] $ <https://ci-beam.apache.org/job/beam_PerformanceTests_PubsubIOIT_Python_Streaming/ws/src/gradlew> -PloadTest.mainClass=apache_beam.io.gcp.pubsub_io_perf_test -Prunner=TestDataflowRunner '-PloadTest.args=--job_name=performance-tests-psio-python-2gb0930150424 --project=apache-beam-testing --region=us-central1 --temp_location=gs://temp-storage-for-perf-tests/loadtests --publish_to_big_query=true --metrics_dataset=beam_performance --metrics_table=psio_io_2GB_results --influx_measurement=python_psio_2GB_results --influx_db_name=beam_test_metrics --influx_hostname=http://10.128.0.96:8086 --input_options='{"num_records": 2097152,"key_size": 1,"value_size": 1024}' --num_****s=5 --autoscaling_algorithm=NONE --pubsub_namespace_prefix=pubsub_io_performance_ --wait_until_finish_duration=600000 --runner=TestDataflowRunner' -PwithDataflowWorkerJar=true -PpythonVersion=3.7 --continue --max-****s=8 -Dorg.gradle.jvmargs=-Xms2g -Dorg.gradle.jvmargs=-Xmx6g -Dorg.gradle.vfs.watch=false -Pdocker-pull-licenses :sdks:python:apache_beam:testing:load_tests:run
Configuration on demand is an incubating feature.
> Task :buildSrc:compileJava NO-SOURCE
> Task :buildSrc:compileGroovy FROM-CACHE
> Task :buildSrc:pluginDescriptors
> Task :buildSrc:processResources
> Task :buildSrc:classes
> Task :buildSrc:jar
> Task :buildSrc:assemble
> Task :buildSrc:spotlessGroovy FROM-CACHE
> Task :buildSrc:spotlessGroovyCheck UP-TO-DATE
> Task :buildSrc:spotlessGroovyGradle FROM-CACHE
> Task :buildSrc:spotlessGroovyGradleCheck UP-TO-DATE
> Task :buildSrc:spotlessCheck UP-TO-DATE
> Task :buildSrc:pluginUnderTestMetadata
> Task :buildSrc:compileTestJava NO-SOURCE
> Task :buildSrc:compileTestGroovy NO-SOURCE
> Task :buildSrc:processTestResources NO-SOURCE
> Task :buildSrc:testClasses UP-TO-DATE
> Task :buildSrc:test NO-SOURCE
> Task :buildSrc:validatePlugins FROM-CACHE
> Task :buildSrc:check UP-TO-DATE
> Task :buildSrc:build

FAILURE: Build failed with an exception.

* Where:
Build file '<https://ci-beam.apache.org/job/beam_PerformanceTests_PubsubIOIT_Python_Streaming/ws/src/sdks/python/apache_beam/testing/load_tests/build.gradle'> line: 51

* What went wrong:
A problem occurred evaluating project ':sdks:python:apache_beam:testing:load_tests'.
> Could not get unknown property 'shadowJar' for project ':runners:google-cloud-dataflow-java:****' of type org.gradle.api.Project.

* Try:
> Run with --stacktrace option to get the stack trace.
> Run with --info or --debug option to get more log output.

* Get more help at https://help.gradle.org

BUILD FAILED in 1s
10 actionable tasks: 4 executed, 4 from cache, 2 up-to-date

Publishing build scan...
https://gradle.com/s/fuwstthwgzad2

Build step 'Invoke Gradle script' changed build result to FAILURE
Build step 'Invoke Gradle script' marked build as failure

---------------------------------------------------------------------
To unsubscribe, e-mail: builds-unsubscribe@beam.apache.org
For additional commands, e-mail: builds-help@beam.apache.org


Build failed in Jenkins: beam_PerformanceTests_PubsubIOIT_Python_Streaming #842

Posted by Apache Jenkins Server <je...@builds.apache.org>.
See <https://ci-beam.apache.org/job/beam_PerformanceTests_PubsubIOIT_Python_Streaming/842/display/redirect?page=changes>

Changes:

[noreply] [Tour Of Beam] API adjustments (#23349)

[noreply] Adds support in Samza Runner to run DoFn.processElement in parallel

[noreply] Regenerate Go Protos (#23408)

[noreply] Support google-cloud-spanner v3 and fixes broken unit tests (#23365)

[noreply] Add relevant docs to Cloud Profiler exceptions. (#23404)

[noreply] Update state cache to not fail when measuring object sizes. (#23391)

[noreply] Fix Small pytorch notebook bug fix (#23407)

[noreply] PubsubIO - Improve limit validations to consider attributes (#23023)

[noreply] Example of Online Clustering  (#23289)


------------------------------------------
Started by timer
Running as SYSTEM
[EnvInject] - Loading node environment variables.
Building remotely on apache-beam-jenkins-11 (beam) in workspace <https://ci-beam.apache.org/job/beam_PerformanceTests_PubsubIOIT_Python_Streaming/ws/>
The recommended git tool is: NONE
No credentials specified
Wiping out workspace first.
Cloning the remote Git repository
Cloning repository https://github.com/apache/beam.git
 > git init <https://ci-beam.apache.org/job/beam_PerformanceTests_PubsubIOIT_Python_Streaming/ws/src> # timeout=10
Fetching upstream changes from https://github.com/apache/beam.git
 > git --version # timeout=10
 > git --version # 'git version 2.25.1'
 > git fetch --tags --force --progress -- https://github.com/apache/beam.git +refs/heads/*:refs/remotes/origin/* # timeout=10
 > git config remote.origin.url https://github.com/apache/beam.git # timeout=10
 > git config --add remote.origin.fetch +refs/heads/*:refs/remotes/origin/* # timeout=10
 > git config remote.origin.url https://github.com/apache/beam.git # timeout=10
Fetching upstream changes from https://github.com/apache/beam.git
 > git fetch --tags --force --progress -- https://github.com/apache/beam.git +refs/heads/*:refs/remotes/origin/* +refs/pull/${ghprbPullId}/*:refs/remotes/origin/pr/${ghprbPullId}/* # timeout=10
 > git rev-parse origin/master^{commit} # timeout=10
Checking out Revision 7b8aa28e34a70a178bd569b28c3e0fcf9d87dd6b (origin/master)
 > git config core.sparsecheckout # timeout=10
 > git checkout -f 7b8aa28e34a70a178bd569b28c3e0fcf9d87dd6b # timeout=10
Commit message: "Example of Online Clustering  (#23289)"
 > git rev-list --no-walk 91d79d973a327b6d22314c8e28bf1b93bc608c2b # timeout=10
No emails were triggered.
[EnvInject] - Executing scripts and injecting environment variables after the SCM step.
[EnvInject] - Injecting as environment variables the properties content 
SETUPTOOLS_USE_DISTUTILS=stdlib
SPARK_LOCAL_IP=127.0.0.1

[EnvInject] - Variables injected successfully.
[beam_PerformanceTests_PubsubIOIT_Python_Streaming] $ /bin/bash -xe /tmp/jenkins4306324860924646446.sh
+ echo '*** PubsubIO Write Performance Test Python 2GB ***'
*** PubsubIO Write Performance Test Python 2GB ***
[Gradle] - Launching build.
[src] $ <https://ci-beam.apache.org/job/beam_PerformanceTests_PubsubIOIT_Python_Streaming/ws/src/gradlew> -PloadTest.mainClass=apache_beam.io.gcp.pubsub_io_perf_test -Prunner=TestDataflowRunner '-PloadTest.args=--job_name=performance-tests-psio-python-2gb0929150410 --project=apache-beam-testing --region=us-central1 --temp_location=gs://temp-storage-for-perf-tests/loadtests --publish_to_big_query=true --metrics_dataset=beam_performance --metrics_table=psio_io_2GB_results --influx_measurement=python_psio_2GB_results --influx_db_name=beam_test_metrics --influx_hostname=http://10.128.0.96:8086 --input_options='{"num_records": 2097152,"key_size": 1,"value_size": 1024}' --num_****s=5 --autoscaling_algorithm=NONE --pubsub_namespace_prefix=pubsub_io_performance_ --wait_until_finish_duration=600000 --runner=TestDataflowRunner' -PwithDataflowWorkerJar=true -PpythonVersion=3.7 --continue --max-****s=8 -Dorg.gradle.jvmargs=-Xms2g -Dorg.gradle.jvmargs=-Xmx6g -Dorg.gradle.vfs.watch=false -Pdocker-pull-licenses :sdks:python:apache_beam:testing:load_tests:run
Starting a Gradle Daemon, 2 busy Daemons could not be reused, use --status for details
Configuration on demand is an incubating feature.
> Task :buildSrc:compileJava NO-SOURCE
> Task :buildSrc:compileGroovy FROM-CACHE
> Task :buildSrc:pluginDescriptors
> Task :buildSrc:processResources
> Task :buildSrc:classes
> Task :buildSrc:jar
> Task :buildSrc:assemble
> Task :buildSrc:spotlessGroovy FROM-CACHE
> Task :buildSrc:spotlessGroovyCheck UP-TO-DATE
> Task :buildSrc:spotlessGroovyGradle FROM-CACHE
> Task :buildSrc:spotlessGroovyGradleCheck UP-TO-DATE
> Task :buildSrc:spotlessCheck UP-TO-DATE
> Task :buildSrc:pluginUnderTestMetadata
> Task :buildSrc:compileTestJava NO-SOURCE
> Task :buildSrc:compileTestGroovy NO-SOURCE
> Task :buildSrc:processTestResources NO-SOURCE
> Task :buildSrc:testClasses UP-TO-DATE
> Task :buildSrc:test NO-SOURCE
> Task :buildSrc:validatePlugins FROM-CACHE
> Task :buildSrc:check UP-TO-DATE
> Task :buildSrc:build

FAILURE: Build failed with an exception.

* Where:
Build file '<https://ci-beam.apache.org/job/beam_PerformanceTests_PubsubIOIT_Python_Streaming/ws/src/sdks/python/apache_beam/testing/load_tests/build.gradle'> line: 51

* What went wrong:
A problem occurred evaluating project ':sdks:python:apache_beam:testing:load_tests'.
> Could not get unknown property 'shadowJar' for project ':runners:google-cloud-dataflow-java:****' of type org.gradle.api.Project.

* Try:
> Run with --stacktrace option to get the stack trace.
> Run with --info or --debug option to get more log output.

* Get more help at https://help.gradle.org

BUILD FAILED in 15s
10 actionable tasks: 4 executed, 4 from cache, 2 up-to-date

Publishing build scan...
https://gradle.com/s/c3nnjncjqoium

Build step 'Invoke Gradle script' changed build result to FAILURE
Build step 'Invoke Gradle script' marked build as failure

---------------------------------------------------------------------
To unsubscribe, e-mail: builds-unsubscribe@beam.apache.org
For additional commands, e-mail: builds-help@beam.apache.org


Build failed in Jenkins: beam_PerformanceTests_PubsubIOIT_Python_Streaming #841

Posted by Apache Jenkins Server <je...@builds.apache.org>.
See <https://ci-beam.apache.org/job/beam_PerformanceTests_PubsubIOIT_Python_Streaming/841/display/redirect?page=changes>

Changes:

[shaojwu] make identifier of Date&DateTime to be a public static field

[shaojwu] make identifier of Time to be a public static field

[noreply] set upper bound on google-cloud-profiler (#23354)

[noreply] Add ISSUE#23071 to CHANGES.md (#23297)

[noreply] Pin objsize version to avoid regression in 0.6.0 (#23396)


------------------------------------------
Started by timer
Running as SYSTEM
[EnvInject] - Loading node environment variables.
Building remotely on apache-beam-jenkins-11 (beam) in workspace <https://ci-beam.apache.org/job/beam_PerformanceTests_PubsubIOIT_Python_Streaming/ws/>
The recommended git tool is: NONE
No credentials specified
Wiping out workspace first.
Cloning the remote Git repository
Cloning repository https://github.com/apache/beam.git
 > git init <https://ci-beam.apache.org/job/beam_PerformanceTests_PubsubIOIT_Python_Streaming/ws/src> # timeout=10
Fetching upstream changes from https://github.com/apache/beam.git
 > git --version # timeout=10
 > git --version # 'git version 2.25.1'
 > git fetch --tags --force --progress -- https://github.com/apache/beam.git +refs/heads/*:refs/remotes/origin/* # timeout=10
 > git config remote.origin.url https://github.com/apache/beam.git # timeout=10
 > git config --add remote.origin.fetch +refs/heads/*:refs/remotes/origin/* # timeout=10
 > git config remote.origin.url https://github.com/apache/beam.git # timeout=10
Fetching upstream changes from https://github.com/apache/beam.git
 > git fetch --tags --force --progress -- https://github.com/apache/beam.git +refs/heads/*:refs/remotes/origin/* +refs/pull/${ghprbPullId}/*:refs/remotes/origin/pr/${ghprbPullId}/* # timeout=10
 > git rev-parse origin/master^{commit} # timeout=10
Checking out Revision 91d79d973a327b6d22314c8e28bf1b93bc608c2b (origin/master)
 > git config core.sparsecheckout # timeout=10
 > git checkout -f 91d79d973a327b6d22314c8e28bf1b93bc608c2b # timeout=10
Commit message: "Pin objsize version to avoid regression in 0.6.0 (#23396)"
 > git rev-list --no-walk 5550be5196461647f2b3b2fd05e137474e1a60d4 # timeout=10
No emails were triggered.
[EnvInject] - Executing scripts and injecting environment variables after the SCM step.
[EnvInject] - Injecting as environment variables the properties content 
SETUPTOOLS_USE_DISTUTILS=stdlib
SPARK_LOCAL_IP=127.0.0.1

[EnvInject] - Variables injected successfully.
[beam_PerformanceTests_PubsubIOIT_Python_Streaming] $ /bin/bash -xe /tmp/jenkins940320321618206725.sh
+ echo '*** PubsubIO Write Performance Test Python 2GB ***'
*** PubsubIO Write Performance Test Python 2GB ***
[Gradle] - Launching build.
[src] $ <https://ci-beam.apache.org/job/beam_PerformanceTests_PubsubIOIT_Python_Streaming/ws/src/gradlew> -PloadTest.mainClass=apache_beam.io.gcp.pubsub_io_perf_test -Prunner=TestDataflowRunner '-PloadTest.args=--job_name=performance-tests-psio-python-2gb0928150426 --project=apache-beam-testing --region=us-central1 --temp_location=gs://temp-storage-for-perf-tests/loadtests --publish_to_big_query=true --metrics_dataset=beam_performance --metrics_table=psio_io_2GB_results --influx_measurement=python_psio_2GB_results --influx_db_name=beam_test_metrics --influx_hostname=http://10.128.0.96:8086 --input_options='{"num_records": 2097152,"key_size": 1,"value_size": 1024}' --num_****s=5 --autoscaling_algorithm=NONE --pubsub_namespace_prefix=pubsub_io_performance_ --wait_until_finish_duration=600000 --runner=TestDataflowRunner' -PwithDataflowWorkerJar=true -PpythonVersion=3.7 --continue --max-****s=8 -Dorg.gradle.jvmargs=-Xms2g -Dorg.gradle.jvmargs=-Xmx6g -Dorg.gradle.vfs.watch=false -Pdocker-pull-licenses :sdks:python:apache_beam:testing:load_tests:run
Starting a Gradle Daemon, 2 busy and 1 incompatible Daemons could not be reused, use --status for details
Configuration on demand is an incubating feature.
> Task :buildSrc:compileJava NO-SOURCE
> Task :buildSrc:compileGroovy FROM-CACHE
> Task :buildSrc:pluginDescriptors
> Task :buildSrc:processResources
> Task :buildSrc:classes
> Task :buildSrc:jar
> Task :buildSrc:assemble
> Task :buildSrc:spotlessGroovy FROM-CACHE
> Task :buildSrc:spotlessGroovyCheck UP-TO-DATE
> Task :buildSrc:spotlessGroovyGradle FROM-CACHE
> Task :buildSrc:spotlessGroovyGradleCheck UP-TO-DATE
> Task :buildSrc:spotlessCheck UP-TO-DATE
> Task :buildSrc:pluginUnderTestMetadata
> Task :buildSrc:compileTestJava NO-SOURCE
> Task :buildSrc:compileTestGroovy NO-SOURCE
> Task :buildSrc:processTestResources NO-SOURCE
> Task :buildSrc:testClasses UP-TO-DATE
> Task :buildSrc:test NO-SOURCE
> Task :buildSrc:validatePlugins FROM-CACHE
> Task :buildSrc:check UP-TO-DATE
> Task :buildSrc:build

FAILURE: Build failed with an exception.

* Where:
Build file '<https://ci-beam.apache.org/job/beam_PerformanceTests_PubsubIOIT_Python_Streaming/ws/src/sdks/python/apache_beam/testing/load_tests/build.gradle'> line: 51

* What went wrong:
A problem occurred evaluating project ':sdks:python:apache_beam:testing:load_tests'.
> Could not get unknown property 'shadowJar' for project ':runners:google-cloud-dataflow-java:****' of type org.gradle.api.Project.

* Try:
> Run with --stacktrace option to get the stack trace.
> Run with --info or --debug option to get more log output.

* Get more help at https://help.gradle.org

BUILD FAILED in 12s
10 actionable tasks: 4 executed, 4 from cache, 2 up-to-date

Publishing build scan...
Publishing build scan failed due to network error 'java.net.SocketException: Unexpected end of file from server' (2 retries remaining)...
Publishing build scan failed due to network error 'java.net.SocketException: Unexpected end of file from server' (1 retry remaining)...

A network error occurred.

If you require assistance with this problem, please report it via https://gradle.com/help/plugin and include the following information via copy/paste.

----------
Gradle version: 7.5.1
Plugin version: 3.4.1
Request URL: https://status.gradle.com
Request ID: 29015505-9ab1-4a19-be15-9cb907d89f18
Exception: java.net.SocketException: Unexpected end of file from server
----------

Build step 'Invoke Gradle script' changed build result to FAILURE
Build step 'Invoke Gradle script' marked build as failure

---------------------------------------------------------------------
To unsubscribe, e-mail: builds-unsubscribe@beam.apache.org
For additional commands, e-mail: builds-help@beam.apache.org


Build failed in Jenkins: beam_PerformanceTests_PubsubIOIT_Python_Streaming #840

Posted by Apache Jenkins Server <je...@builds.apache.org>.
See <https://ci-beam.apache.org/job/beam_PerformanceTests_PubsubIOIT_Python_Streaming/840/display/redirect?page=changes>

Changes:

[ningkang0957] Upgraded Flink on Dataproc support from Interacitve Beam

[noreply] GA Migration PreCommit and PostCommit Tables in CI.md (#23372)

[noreply] Stack Trace Decoration for Beam Samza Runner (#23221)

[noreply] [#22478]: Add read_time support to Google Firestore connector (#22966)

[noreply] Changes CoGroupByKey typehint from List to Iterable (#22984)

[noreply] Fix TextSource incorrect handling in channels that return short reads.

[noreply] Add a tensorflow example to the run_inference_basic notebook (#23173)

[noreply] RunInference Benchmarks UI (#23371)


------------------------------------------
Started by timer
Running as SYSTEM
[EnvInject] - Loading node environment variables.
Building remotely on apache-beam-jenkins-6 (beam) in workspace <https://ci-beam.apache.org/job/beam_PerformanceTests_PubsubIOIT_Python_Streaming/ws/>
The recommended git tool is: NONE
No credentials specified
Wiping out workspace first.
Cloning the remote Git repository
Cloning repository https://github.com/apache/beam.git
 > git init <https://ci-beam.apache.org/job/beam_PerformanceTests_PubsubIOIT_Python_Streaming/ws/src> # timeout=10
Fetching upstream changes from https://github.com/apache/beam.git
 > git --version # timeout=10
 > git --version # 'git version 2.25.1'
 > git fetch --tags --force --progress -- https://github.com/apache/beam.git +refs/heads/*:refs/remotes/origin/* # timeout=10
 > git config remote.origin.url https://github.com/apache/beam.git # timeout=10
 > git config --add remote.origin.fetch +refs/heads/*:refs/remotes/origin/* # timeout=10
 > git config remote.origin.url https://github.com/apache/beam.git # timeout=10
Fetching upstream changes from https://github.com/apache/beam.git
 > git fetch --tags --force --progress -- https://github.com/apache/beam.git +refs/heads/*:refs/remotes/origin/* +refs/pull/${ghprbPullId}/*:refs/remotes/origin/pr/${ghprbPullId}/* # timeout=10
 > git rev-parse origin/master^{commit} # timeout=10
Checking out Revision 5550be5196461647f2b3b2fd05e137474e1a60d4 (origin/master)
 > git config core.sparsecheckout # timeout=10
 > git checkout -f 5550be5196461647f2b3b2fd05e137474e1a60d4 # timeout=10
Commit message: "RunInference Benchmarks UI (#23371)"
 > git rev-list --no-walk 3a4d57eb8976c5f503b32d478a80b1800490f66f # timeout=10
No emails were triggered.
[EnvInject] - Executing scripts and injecting environment variables after the SCM step.
[EnvInject] - Injecting as environment variables the properties content 
SETUPTOOLS_USE_DISTUTILS=stdlib
SPARK_LOCAL_IP=127.0.0.1

[EnvInject] - Variables injected successfully.
[beam_PerformanceTests_PubsubIOIT_Python_Streaming] $ /bin/bash -xe /tmp/jenkins2036315104692917744.sh
+ echo '*** PubsubIO Write Performance Test Python 2GB ***'
*** PubsubIO Write Performance Test Python 2GB ***
[Gradle] - Launching build.
[src] $ <https://ci-beam.apache.org/job/beam_PerformanceTests_PubsubIOIT_Python_Streaming/ws/src/gradlew> -PloadTest.mainClass=apache_beam.io.gcp.pubsub_io_perf_test -Prunner=TestDataflowRunner '-PloadTest.args=--job_name=performance-tests-psio-python-2gb0927150436 --project=apache-beam-testing --region=us-central1 --temp_location=gs://temp-storage-for-perf-tests/loadtests --publish_to_big_query=true --metrics_dataset=beam_performance --metrics_table=psio_io_2GB_results --influx_measurement=python_psio_2GB_results --influx_db_name=beam_test_metrics --influx_hostname=http://10.128.0.96:8086 --input_options='{"num_records": 2097152,"key_size": 1,"value_size": 1024}' --num_****s=5 --autoscaling_algorithm=NONE --pubsub_namespace_prefix=pubsub_io_performance_ --wait_until_finish_duration=600000 --runner=TestDataflowRunner' -PwithDataflowWorkerJar=true -PpythonVersion=3.7 --continue --max-****s=8 -Dorg.gradle.jvmargs=-Xms2g -Dorg.gradle.jvmargs=-Xmx6g -Dorg.gradle.vfs.watch=false -Pdocker-pull-licenses :sdks:python:apache_beam:testing:load_tests:run
Starting a Gradle Daemon, 2 busy Daemons could not be reused, use --status for details
Configuration on demand is an incubating feature.
> Task :buildSrc:compileJava NO-SOURCE
> Task :buildSrc:compileGroovy FROM-CACHE
> Task :buildSrc:pluginDescriptors
> Task :buildSrc:processResources
> Task :buildSrc:classes
> Task :buildSrc:jar
> Task :buildSrc:assemble
> Task :buildSrc:spotlessGroovy FROM-CACHE
> Task :buildSrc:spotlessGroovyCheck UP-TO-DATE
> Task :buildSrc:spotlessGroovyGradle FROM-CACHE
> Task :buildSrc:spotlessGroovyGradleCheck UP-TO-DATE
> Task :buildSrc:spotlessCheck UP-TO-DATE
> Task :buildSrc:pluginUnderTestMetadata
> Task :buildSrc:compileTestJava NO-SOURCE
> Task :buildSrc:compileTestGroovy NO-SOURCE
> Task :buildSrc:processTestResources NO-SOURCE
> Task :buildSrc:testClasses UP-TO-DATE
> Task :buildSrc:test NO-SOURCE
> Task :buildSrc:validatePlugins FROM-CACHE
> Task :buildSrc:check UP-TO-DATE
> Task :buildSrc:build

FAILURE: Build failed with an exception.

* Where:
Build file '<https://ci-beam.apache.org/job/beam_PerformanceTests_PubsubIOIT_Python_Streaming/ws/src/sdks/python/apache_beam/testing/load_tests/build.gradle'> line: 51

* What went wrong:
A problem occurred evaluating project ':sdks:python:apache_beam:testing:load_tests'.
> Could not get unknown property 'shadowJar' for project ':runners:google-cloud-dataflow-java:****' of type org.gradle.api.Project.

* Try:
> Run with --stacktrace option to get the stack trace.
> Run with --info or --debug option to get more log output.

* Get more help at https://help.gradle.org

BUILD FAILED in 12s
10 actionable tasks: 4 executed, 4 from cache, 2 up-to-date

Publishing build scan...
https://gradle.com/s/mmckksknbooug

Build step 'Invoke Gradle script' changed build result to FAILURE
Build step 'Invoke Gradle script' marked build as failure

---------------------------------------------------------------------
To unsubscribe, e-mail: builds-unsubscribe@beam.apache.org
For additional commands, e-mail: builds-help@beam.apache.org


Build failed in Jenkins: beam_PerformanceTests_PubsubIOIT_Python_Streaming #839

Posted by Apache Jenkins Server <je...@builds.apache.org>.
See <https://ci-beam.apache.org/job/beam_PerformanceTests_PubsubIOIT_Python_Streaming/839/display/redirect?page=changes>

Changes:

[noreply] Bump Java FnApi Container version to beam-master-20220923 (#23352)

[noreply] Bump org.nosphere.apache.rat from 0.7.0 to 0.8.0 (#23330)


------------------------------------------
Started by timer
Running as SYSTEM
[EnvInject] - Loading node environment variables.
Building remotely on apache-beam-jenkins-9 (beam) in workspace <https://ci-beam.apache.org/job/beam_PerformanceTests_PubsubIOIT_Python_Streaming/ws/>
The recommended git tool is: NONE
No credentials specified
Wiping out workspace first.
Cloning the remote Git repository
Cloning repository https://github.com/apache/beam.git
 > git init <https://ci-beam.apache.org/job/beam_PerformanceTests_PubsubIOIT_Python_Streaming/ws/src> # timeout=10
Fetching upstream changes from https://github.com/apache/beam.git
 > git --version # timeout=10
 > git --version # 'git version 2.25.1'
 > git fetch --tags --force --progress -- https://github.com/apache/beam.git +refs/heads/*:refs/remotes/origin/* # timeout=10
 > git config remote.origin.url https://github.com/apache/beam.git # timeout=10
 > git config --add remote.origin.fetch +refs/heads/*:refs/remotes/origin/* # timeout=10
 > git config remote.origin.url https://github.com/apache/beam.git # timeout=10
Fetching upstream changes from https://github.com/apache/beam.git
 > git fetch --tags --force --progress -- https://github.com/apache/beam.git +refs/heads/*:refs/remotes/origin/* +refs/pull/${ghprbPullId}/*:refs/remotes/origin/pr/${ghprbPullId}/* # timeout=10
 > git rev-parse origin/master^{commit} # timeout=10
Checking out Revision 3a4d57eb8976c5f503b32d478a80b1800490f66f (origin/master)
 > git config core.sparsecheckout # timeout=10
 > git checkout -f 3a4d57eb8976c5f503b32d478a80b1800490f66f # timeout=10
Commit message: "Bump org.nosphere.apache.rat from 0.7.0 to 0.8.0 (#23330)"
 > git rev-list --no-walk c4fe823b4f9e8fc4711478749efb35cd143bfce2 # timeout=10
No emails were triggered.
[EnvInject] - Executing scripts and injecting environment variables after the SCM step.
[EnvInject] - Injecting as environment variables the properties content 
SETUPTOOLS_USE_DISTUTILS=stdlib
SPARK_LOCAL_IP=127.0.0.1

[EnvInject] - Variables injected successfully.
[beam_PerformanceTests_PubsubIOIT_Python_Streaming] $ /bin/bash -xe /tmp/jenkins3524795689817390467.sh
+ echo '*** PubsubIO Write Performance Test Python 2GB ***'
*** PubsubIO Write Performance Test Python 2GB ***
[Gradle] - Launching build.
[src] $ <https://ci-beam.apache.org/job/beam_PerformanceTests_PubsubIOIT_Python_Streaming/ws/src/gradlew> -PloadTest.mainClass=apache_beam.io.gcp.pubsub_io_perf_test -Prunner=TestDataflowRunner '-PloadTest.args=--job_name=performance-tests-psio-python-2gb0926150438 --project=apache-beam-testing --region=us-central1 --temp_location=gs://temp-storage-for-perf-tests/loadtests --publish_to_big_query=true --metrics_dataset=beam_performance --metrics_table=psio_io_2GB_results --influx_measurement=python_psio_2GB_results --influx_db_name=beam_test_metrics --influx_hostname=http://10.128.0.96:8086 --input_options='{"num_records": 2097152,"key_size": 1,"value_size": 1024}' --num_****s=5 --autoscaling_algorithm=NONE --pubsub_namespace_prefix=pubsub_io_performance_ --wait_until_finish_duration=600000 --runner=TestDataflowRunner' -PwithDataflowWorkerJar=true -PpythonVersion=3.7 --continue --max-****s=8 -Dorg.gradle.jvmargs=-Xms2g -Dorg.gradle.jvmargs=-Xmx6g -Dorg.gradle.vfs.watch=false -Pdocker-pull-licenses :sdks:python:apache_beam:testing:load_tests:run
Starting a Gradle Daemon, 1 busy Daemon could not be reused, use --status for details
Configuration on demand is an incubating feature.
> Task :buildSrc:compileJava NO-SOURCE
> Task :buildSrc:compileGroovy FROM-CACHE
> Task :buildSrc:pluginDescriptors
> Task :buildSrc:processResources
> Task :buildSrc:classes
> Task :buildSrc:jar
> Task :buildSrc:assemble
> Task :buildSrc:spotlessGroovy FROM-CACHE
> Task :buildSrc:spotlessGroovyCheck UP-TO-DATE
> Task :buildSrc:spotlessGroovyGradle FROM-CACHE
> Task :buildSrc:spotlessGroovyGradleCheck UP-TO-DATE
> Task :buildSrc:spotlessCheck UP-TO-DATE
> Task :buildSrc:pluginUnderTestMetadata
> Task :buildSrc:compileTestJava NO-SOURCE
> Task :buildSrc:compileTestGroovy NO-SOURCE
> Task :buildSrc:processTestResources NO-SOURCE
> Task :buildSrc:testClasses UP-TO-DATE
> Task :buildSrc:test NO-SOURCE
> Task :buildSrc:validatePlugins FROM-CACHE
> Task :buildSrc:check UP-TO-DATE
> Task :buildSrc:build

FAILURE: Build failed with an exception.

* Where:
Build file '<https://ci-beam.apache.org/job/beam_PerformanceTests_PubsubIOIT_Python_Streaming/ws/src/sdks/python/apache_beam/testing/load_tests/build.gradle'> line: 51

* What went wrong:
A problem occurred evaluating project ':sdks:python:apache_beam:testing:load_tests'.
> Could not get unknown property 'shadowJar' for project ':runners:google-cloud-dataflow-java:****' of type org.gradle.api.Project.

* Try:
> Run with --stacktrace option to get the stack trace.
> Run with --info or --debug option to get more log output.

* Get more help at https://help.gradle.org

BUILD FAILED in 10s
10 actionable tasks: 4 executed, 4 from cache, 2 up-to-date

Publishing build scan...
https://gradle.com/s/ya7xmwaqr4lj2

Build step 'Invoke Gradle script' changed build result to FAILURE
Build step 'Invoke Gradle script' marked build as failure

---------------------------------------------------------------------
To unsubscribe, e-mail: builds-unsubscribe@beam.apache.org
For additional commands, e-mail: builds-help@beam.apache.org


Build failed in Jenkins: beam_PerformanceTests_PubsubIOIT_Python_Streaming #838

Posted by Apache Jenkins Server <je...@builds.apache.org>.
See <https://ci-beam.apache.org/job/beam_PerformanceTests_PubsubIOIT_Python_Streaming/838/display/redirect?page=changes>

Changes:

[noreply] Extract playground components (#23253)


------------------------------------------
Started by timer
Running as SYSTEM
[EnvInject] - Loading node environment variables.
Building remotely on apache-beam-jenkins-9 (beam) in workspace <https://ci-beam.apache.org/job/beam_PerformanceTests_PubsubIOIT_Python_Streaming/ws/>
The recommended git tool is: NONE
No credentials specified
Wiping out workspace first.
Cloning the remote Git repository
Cloning repository https://github.com/apache/beam.git
 > git init <https://ci-beam.apache.org/job/beam_PerformanceTests_PubsubIOIT_Python_Streaming/ws/src> # timeout=10
Fetching upstream changes from https://github.com/apache/beam.git
 > git --version # timeout=10
 > git --version # 'git version 2.25.1'
 > git fetch --tags --force --progress -- https://github.com/apache/beam.git +refs/heads/*:refs/remotes/origin/* # timeout=10
 > git config remote.origin.url https://github.com/apache/beam.git # timeout=10
 > git config --add remote.origin.fetch +refs/heads/*:refs/remotes/origin/* # timeout=10
 > git config remote.origin.url https://github.com/apache/beam.git # timeout=10
Fetching upstream changes from https://github.com/apache/beam.git
 > git fetch --tags --force --progress -- https://github.com/apache/beam.git +refs/heads/*:refs/remotes/origin/* +refs/pull/${ghprbPullId}/*:refs/remotes/origin/pr/${ghprbPullId}/* # timeout=10
 > git rev-parse origin/master^{commit} # timeout=10
Checking out Revision c4fe823b4f9e8fc4711478749efb35cd143bfce2 (origin/master)
 > git config core.sparsecheckout # timeout=10
 > git checkout -f c4fe823b4f9e8fc4711478749efb35cd143bfce2 # timeout=10
Commit message: "Extract playground components (#23253)"
 > git rev-list --no-walk 2f1f1a76419a032ea2d70671e3c6c9fe86b0626f # timeout=10
No emails were triggered.
[EnvInject] - Executing scripts and injecting environment variables after the SCM step.
[EnvInject] - Injecting as environment variables the properties content 
SETUPTOOLS_USE_DISTUTILS=stdlib
SPARK_LOCAL_IP=127.0.0.1

[EnvInject] - Variables injected successfully.
[beam_PerformanceTests_PubsubIOIT_Python_Streaming] $ /bin/bash -xe /tmp/jenkins5676159119146266718.sh
+ echo '*** PubsubIO Write Performance Test Python 2GB ***'
*** PubsubIO Write Performance Test Python 2GB ***
[Gradle] - Launching build.
[src] $ <https://ci-beam.apache.org/job/beam_PerformanceTests_PubsubIOIT_Python_Streaming/ws/src/gradlew> -PloadTest.mainClass=apache_beam.io.gcp.pubsub_io_perf_test -Prunner=TestDataflowRunner '-PloadTest.args=--job_name=performance-tests-psio-python-2gb0925150422 --project=apache-beam-testing --region=us-central1 --temp_location=gs://temp-storage-for-perf-tests/loadtests --publish_to_big_query=true --metrics_dataset=beam_performance --metrics_table=psio_io_2GB_results --influx_measurement=python_psio_2GB_results --influx_db_name=beam_test_metrics --influx_hostname=http://10.128.0.96:8086 --input_options='{"num_records": 2097152,"key_size": 1,"value_size": 1024}' --num_****s=5 --autoscaling_algorithm=NONE --pubsub_namespace_prefix=pubsub_io_performance_ --wait_until_finish_duration=600000 --runner=TestDataflowRunner' -PwithDataflowWorkerJar=true -PpythonVersion=3.7 --continue --max-****s=8 -Dorg.gradle.jvmargs=-Xms2g -Dorg.gradle.jvmargs=-Xmx6g -Dorg.gradle.vfs.watch=false -Pdocker-pull-licenses :sdks:python:apache_beam:testing:load_tests:run
Starting a Gradle Daemon, 1 busy Daemon could not be reused, use --status for details
Configuration on demand is an incubating feature.
> Task :buildSrc:compileJava NO-SOURCE
> Task :buildSrc:compileGroovy FROM-CACHE
> Task :buildSrc:pluginDescriptors
> Task :buildSrc:processResources
> Task :buildSrc:classes
> Task :buildSrc:jar
> Task :buildSrc:assemble
> Task :buildSrc:spotlessGroovy FROM-CACHE
> Task :buildSrc:spotlessGroovyCheck UP-TO-DATE
> Task :buildSrc:spotlessGroovyGradle FROM-CACHE
> Task :buildSrc:spotlessGroovyGradleCheck UP-TO-DATE
> Task :buildSrc:spotlessCheck UP-TO-DATE
> Task :buildSrc:pluginUnderTestMetadata
> Task :buildSrc:compileTestJava NO-SOURCE
> Task :buildSrc:compileTestGroovy NO-SOURCE
> Task :buildSrc:processTestResources NO-SOURCE
> Task :buildSrc:testClasses UP-TO-DATE
> Task :buildSrc:test NO-SOURCE
> Task :buildSrc:validatePlugins FROM-CACHE
> Task :buildSrc:check UP-TO-DATE
> Task :buildSrc:build

FAILURE: Build failed with an exception.

* Where:
Build file '<https://ci-beam.apache.org/job/beam_PerformanceTests_PubsubIOIT_Python_Streaming/ws/src/sdks/python/apache_beam/testing/load_tests/build.gradle'> line: 51

* What went wrong:
A problem occurred evaluating project ':sdks:python:apache_beam:testing:load_tests'.
> Could not get unknown property 'shadowJar' for project ':runners:google-cloud-dataflow-java:****' of type org.gradle.api.Project.

* Try:
> Run with --stacktrace option to get the stack trace.
> Run with --info or --debug option to get more log output.

* Get more help at https://help.gradle.org

BUILD FAILED in 9s
10 actionable tasks: 4 executed, 4 from cache, 2 up-to-date

Publishing build scan...
https://gradle.com/s/3hiifjf2nhawy

Build step 'Invoke Gradle script' changed build result to FAILURE
Build step 'Invoke Gradle script' marked build as failure

---------------------------------------------------------------------
To unsubscribe, e-mail: builds-unsubscribe@beam.apache.org
For additional commands, e-mail: builds-help@beam.apache.org


Build failed in Jenkins: beam_PerformanceTests_PubsubIOIT_Python_Streaming #837

Posted by Apache Jenkins Server <je...@builds.apache.org>.
See <https://ci-beam.apache.org/job/beam_PerformanceTests_PubsubIOIT_Python_Streaming/837/display/redirect?page=changes>

Changes:

[noreply] lint fixes to go (#23351)

[noreply] Bump cloud.google.com/go/bigquery from 1.41.0 to 1.42.0 in /sdks


------------------------------------------
Started by timer
Running as SYSTEM
[EnvInject] - Loading node environment variables.
Building remotely on apache-beam-jenkins-9 (beam) in workspace <https://ci-beam.apache.org/job/beam_PerformanceTests_PubsubIOIT_Python_Streaming/ws/>
The recommended git tool is: NONE
No credentials specified
Wiping out workspace first.
Cloning the remote Git repository
Cloning repository https://github.com/apache/beam.git
 > git init <https://ci-beam.apache.org/job/beam_PerformanceTests_PubsubIOIT_Python_Streaming/ws/src> # timeout=10
Fetching upstream changes from https://github.com/apache/beam.git
 > git --version # timeout=10
 > git --version # 'git version 2.25.1'
 > git fetch --tags --force --progress -- https://github.com/apache/beam.git +refs/heads/*:refs/remotes/origin/* # timeout=10
 > git config remote.origin.url https://github.com/apache/beam.git # timeout=10
 > git config --add remote.origin.fetch +refs/heads/*:refs/remotes/origin/* # timeout=10
 > git config remote.origin.url https://github.com/apache/beam.git # timeout=10
Fetching upstream changes from https://github.com/apache/beam.git
 > git fetch --tags --force --progress -- https://github.com/apache/beam.git +refs/heads/*:refs/remotes/origin/* +refs/pull/${ghprbPullId}/*:refs/remotes/origin/pr/${ghprbPullId}/* # timeout=10
 > git rev-parse origin/master^{commit} # timeout=10
Checking out Revision 2f1f1a76419a032ea2d70671e3c6c9fe86b0626f (origin/master)
 > git config core.sparsecheckout # timeout=10
 > git checkout -f 2f1f1a76419a032ea2d70671e3c6c9fe86b0626f # timeout=10
Commit message: "Bump cloud.google.com/go/bigquery from 1.41.0 to 1.42.0 in /sdks (#23329)"
 > git rev-list --no-walk 90739533a8c84a9354197cac435c85b4ba002344 # timeout=10
No emails were triggered.
[EnvInject] - Executing scripts and injecting environment variables after the SCM step.
[EnvInject] - Injecting as environment variables the properties content 
SETUPTOOLS_USE_DISTUTILS=stdlib
SPARK_LOCAL_IP=127.0.0.1

[EnvInject] - Variables injected successfully.
[beam_PerformanceTests_PubsubIOIT_Python_Streaming] $ /bin/bash -xe /tmp/jenkins8932832964821614262.sh
+ echo '*** PubsubIO Write Performance Test Python 2GB ***'
*** PubsubIO Write Performance Test Python 2GB ***
[Gradle] - Launching build.
[src] $ <https://ci-beam.apache.org/job/beam_PerformanceTests_PubsubIOIT_Python_Streaming/ws/src/gradlew> -PloadTest.mainClass=apache_beam.io.gcp.pubsub_io_perf_test -Prunner=TestDataflowRunner '-PloadTest.args=--job_name=performance-tests-psio-python-2gb0924150420 --project=apache-beam-testing --region=us-central1 --temp_location=gs://temp-storage-for-perf-tests/loadtests --publish_to_big_query=true --metrics_dataset=beam_performance --metrics_table=psio_io_2GB_results --influx_measurement=python_psio_2GB_results --influx_db_name=beam_test_metrics --influx_hostname=http://10.128.0.96:8086 --input_options='{"num_records": 2097152,"key_size": 1,"value_size": 1024}' --num_****s=5 --autoscaling_algorithm=NONE --pubsub_namespace_prefix=pubsub_io_performance_ --wait_until_finish_duration=600000 --runner=TestDataflowRunner' -PwithDataflowWorkerJar=true -PpythonVersion=3.7 --continue --max-****s=8 -Dorg.gradle.jvmargs=-Xms2g -Dorg.gradle.jvmargs=-Xmx6g -Dorg.gradle.vfs.watch=false -Pdocker-pull-licenses :sdks:python:apache_beam:testing:load_tests:run
Starting a Gradle Daemon (subsequent builds will be faster)
Configuration on demand is an incubating feature.
> Task :buildSrc:compileJava NO-SOURCE
> Task :buildSrc:compileGroovy FROM-CACHE
> Task :buildSrc:pluginDescriptors
> Task :buildSrc:processResources
> Task :buildSrc:classes
> Task :buildSrc:jar
> Task :buildSrc:assemble
> Task :buildSrc:spotlessGroovy FROM-CACHE
> Task :buildSrc:spotlessGroovyCheck UP-TO-DATE
> Task :buildSrc:spotlessGroovyGradle FROM-CACHE
> Task :buildSrc:spotlessGroovyGradleCheck UP-TO-DATE
> Task :buildSrc:spotlessCheck UP-TO-DATE
> Task :buildSrc:pluginUnderTestMetadata
> Task :buildSrc:compileTestJava NO-SOURCE
> Task :buildSrc:compileTestGroovy NO-SOURCE
> Task :buildSrc:processTestResources NO-SOURCE
> Task :buildSrc:testClasses UP-TO-DATE
> Task :buildSrc:test NO-SOURCE
> Task :buildSrc:validatePlugins FROM-CACHE
> Task :buildSrc:check UP-TO-DATE
> Task :buildSrc:build

FAILURE: Build failed with an exception.

* Where:
Build file '<https://ci-beam.apache.org/job/beam_PerformanceTests_PubsubIOIT_Python_Streaming/ws/src/sdks/python/apache_beam/testing/load_tests/build.gradle'> line: 51

* What went wrong:
A problem occurred evaluating project ':sdks:python:apache_beam:testing:load_tests'.
> Could not get unknown property 'shadowJar' for project ':runners:google-cloud-dataflow-java:****' of type org.gradle.api.Project.

* Try:
> Run with --stacktrace option to get the stack trace.
> Run with --info or --debug option to get more log output.

* Get more help at https://help.gradle.org

BUILD FAILED in 9s
10 actionable tasks: 4 executed, 4 from cache, 2 up-to-date

Publishing build scan...
https://gradle.com/s/irzuvmwmzwlmi

Build step 'Invoke Gradle script' changed build result to FAILURE
Build step 'Invoke Gradle script' marked build as failure

---------------------------------------------------------------------
To unsubscribe, e-mail: builds-unsubscribe@beam.apache.org
For additional commands, e-mail: builds-help@beam.apache.org


Build failed in Jenkins: beam_PerformanceTests_PubsubIOIT_Python_Streaming #836

Posted by Apache Jenkins Server <je...@builds.apache.org>.
See <https://ci-beam.apache.org/job/beam_PerformanceTests_PubsubIOIT_Python_Streaming/836/display/redirect?page=changes>

Changes:

[Steve Niemitz] use avro DataFileReader to read avro container files

[noreply] Change google_cloud_bigdataoss_version to 2.2.8. (#23300)

[Moritz Mack] Fix Nexmark default log level

[noreply] Bump cloud.google.com/go/storage from 1.26.0 to 1.27.0 in /sdks (#23336)


------------------------------------------
Started by timer
Running as SYSTEM
[EnvInject] - Loading node environment variables.
Building remotely on apache-beam-jenkins-9 (beam) in workspace <https://ci-beam.apache.org/job/beam_PerformanceTests_PubsubIOIT_Python_Streaming/ws/>
The recommended git tool is: NONE
No credentials specified
Wiping out workspace first.
Cloning the remote Git repository
Cloning repository https://github.com/apache/beam.git
 > git init <https://ci-beam.apache.org/job/beam_PerformanceTests_PubsubIOIT_Python_Streaming/ws/src> # timeout=10
Fetching upstream changes from https://github.com/apache/beam.git
 > git --version # timeout=10
 > git --version # 'git version 2.25.1'
 > git fetch --tags --force --progress -- https://github.com/apache/beam.git +refs/heads/*:refs/remotes/origin/* # timeout=10
 > git config remote.origin.url https://github.com/apache/beam.git # timeout=10
 > git config --add remote.origin.fetch +refs/heads/*:refs/remotes/origin/* # timeout=10
 > git config remote.origin.url https://github.com/apache/beam.git # timeout=10
Fetching upstream changes from https://github.com/apache/beam.git
 > git fetch --tags --force --progress -- https://github.com/apache/beam.git +refs/heads/*:refs/remotes/origin/* +refs/pull/${ghprbPullId}/*:refs/remotes/origin/pr/${ghprbPullId}/* # timeout=10
 > git rev-parse origin/master^{commit} # timeout=10
Checking out Revision 90739533a8c84a9354197cac435c85b4ba002344 (origin/master)
 > git config core.sparsecheckout # timeout=10
 > git checkout -f 90739533a8c84a9354197cac435c85b4ba002344 # timeout=10
Commit message: "Bump cloud.google.com/go/storage from 1.26.0 to 1.27.0 in /sdks (#23336)"
 > git rev-list --no-walk 762edd7f3a64f076dbee156fa48b8a7e5e6a512f # timeout=10
No emails were triggered.
[EnvInject] - Executing scripts and injecting environment variables after the SCM step.
[EnvInject] - Injecting as environment variables the properties content 
SETUPTOOLS_USE_DISTUTILS=stdlib
SPARK_LOCAL_IP=127.0.0.1

[EnvInject] - Variables injected successfully.
[beam_PerformanceTests_PubsubIOIT_Python_Streaming] $ /bin/bash -xe /tmp/jenkins5669222698800813259.sh
+ echo '*** PubsubIO Write Performance Test Python 2GB ***'
*** PubsubIO Write Performance Test Python 2GB ***
[Gradle] - Launching build.
[src] $ <https://ci-beam.apache.org/job/beam_PerformanceTests_PubsubIOIT_Python_Streaming/ws/src/gradlew> -PloadTest.mainClass=apache_beam.io.gcp.pubsub_io_perf_test -Prunner=TestDataflowRunner '-PloadTest.args=--job_name=performance-tests-psio-python-2gb0923150424 --project=apache-beam-testing --region=us-central1 --temp_location=gs://temp-storage-for-perf-tests/loadtests --publish_to_big_query=true --metrics_dataset=beam_performance --metrics_table=psio_io_2GB_results --influx_measurement=python_psio_2GB_results --influx_db_name=beam_test_metrics --influx_hostname=http://10.128.0.96:8086 --input_options='{"num_records": 2097152,"key_size": 1,"value_size": 1024}' --num_****s=5 --autoscaling_algorithm=NONE --pubsub_namespace_prefix=pubsub_io_performance_ --wait_until_finish_duration=600000 --runner=TestDataflowRunner' -PwithDataflowWorkerJar=true -PpythonVersion=3.7 --continue --max-****s=8 -Dorg.gradle.jvmargs=-Xms2g -Dorg.gradle.jvmargs=-Xmx6g -Dorg.gradle.vfs.watch=false -Pdocker-pull-licenses :sdks:python:apache_beam:testing:load_tests:run
Configuration on demand is an incubating feature.
> Task :buildSrc:compileJava NO-SOURCE
> Task :buildSrc:compileGroovy FROM-CACHE
> Task :buildSrc:pluginDescriptors
> Task :buildSrc:processResources
> Task :buildSrc:classes
> Task :buildSrc:jar
> Task :buildSrc:assemble
> Task :buildSrc:spotlessGroovy FROM-CACHE
> Task :buildSrc:spotlessGroovyCheck UP-TO-DATE
> Task :buildSrc:spotlessGroovyGradle FROM-CACHE
> Task :buildSrc:spotlessGroovyGradleCheck UP-TO-DATE
> Task :buildSrc:spotlessCheck UP-TO-DATE
> Task :buildSrc:pluginUnderTestMetadata
> Task :buildSrc:compileTestJava NO-SOURCE
> Task :buildSrc:compileTestGroovy NO-SOURCE
> Task :buildSrc:processTestResources NO-SOURCE
> Task :buildSrc:testClasses UP-TO-DATE
> Task :buildSrc:test NO-SOURCE
> Task :buildSrc:validatePlugins FROM-CACHE
> Task :buildSrc:check UP-TO-DATE
> Task :buildSrc:build

FAILURE: Build failed with an exception.

* Where:
Build file '<https://ci-beam.apache.org/job/beam_PerformanceTests_PubsubIOIT_Python_Streaming/ws/src/sdks/python/apache_beam/testing/load_tests/build.gradle'> line: 51

* What went wrong:
A problem occurred evaluating project ':sdks:python:apache_beam:testing:load_tests'.
> Could not get unknown property 'shadowJar' for project ':runners:google-cloud-dataflow-java:****' of type org.gradle.api.Project.

* Try:
> Run with --stacktrace option to get the stack trace.
> Run with --info or --debug option to get more log output.

* Get more help at https://help.gradle.org

BUILD FAILED in 1s
10 actionable tasks: 4 executed, 4 from cache, 2 up-to-date

Publishing build scan...
https://gradle.com/s/k3e62fz4konsu

Build step 'Invoke Gradle script' changed build result to FAILURE
Build step 'Invoke Gradle script' marked build as failure

---------------------------------------------------------------------
To unsubscribe, e-mail: builds-unsubscribe@beam.apache.org
For additional commands, e-mail: builds-help@beam.apache.org


Build failed in Jenkins: beam_PerformanceTests_PubsubIOIT_Python_Streaming #835

Posted by Apache Jenkins Server <je...@builds.apache.org>.
See <https://ci-beam.apache.org/job/beam_PerformanceTests_PubsubIOIT_Python_Streaming/835/display/redirect?page=changes>

Changes:

[bvolpato] Do not use .get() on ValueProvider during pipeline creation

[noreply] [Java SDK core] emit watermark from PeriodicSequence (#23301) (#23302)

[noreply] Extend protocol in windmill.proto used by google-cloud-dataflow-java

[noreply] Allow longer Class-Path entries (#23269)

[noreply] Improved pipeline translation in SparkStructuredStreamingRunner (#22446)


------------------------------------------
Started by timer
Running as SYSTEM
[EnvInject] - Loading node environment variables.
Building remotely on apache-beam-jenkins-9 (beam) in workspace <https://ci-beam.apache.org/job/beam_PerformanceTests_PubsubIOIT_Python_Streaming/ws/>
The recommended git tool is: NONE
No credentials specified
Wiping out workspace first.
Cloning the remote Git repository
Cloning repository https://github.com/apache/beam.git
 > git init <https://ci-beam.apache.org/job/beam_PerformanceTests_PubsubIOIT_Python_Streaming/ws/src> # timeout=10
Fetching upstream changes from https://github.com/apache/beam.git
 > git --version # timeout=10
 > git --version # 'git version 2.25.1'
 > git fetch --tags --force --progress -- https://github.com/apache/beam.git +refs/heads/*:refs/remotes/origin/* # timeout=10
 > git config remote.origin.url https://github.com/apache/beam.git # timeout=10
 > git config --add remote.origin.fetch +refs/heads/*:refs/remotes/origin/* # timeout=10
 > git config remote.origin.url https://github.com/apache/beam.git # timeout=10
Fetching upstream changes from https://github.com/apache/beam.git
 > git fetch --tags --force --progress -- https://github.com/apache/beam.git +refs/heads/*:refs/remotes/origin/* +refs/pull/${ghprbPullId}/*:refs/remotes/origin/pr/${ghprbPullId}/* # timeout=10
 > git rev-parse origin/master^{commit} # timeout=10
Checking out Revision 762edd7f3a64f076dbee156fa48b8a7e5e6a512f (origin/master)
 > git config core.sparsecheckout # timeout=10
 > git checkout -f 762edd7f3a64f076dbee156fa48b8a7e5e6a512f # timeout=10
Commit message: "Improved pipeline translation in SparkStructuredStreamingRunner (#22446)"
 > git rev-list --no-walk d578e3df7c963e57f251fb27739fbc1d3811e722 # timeout=10
No emails were triggered.
[EnvInject] - Executing scripts and injecting environment variables after the SCM step.
[EnvInject] - Injecting as environment variables the properties content 
SETUPTOOLS_USE_DISTUTILS=stdlib
SPARK_LOCAL_IP=127.0.0.1

[EnvInject] - Variables injected successfully.
[beam_PerformanceTests_PubsubIOIT_Python_Streaming] $ /bin/bash -xe /tmp/jenkins8719143650097081785.sh
+ echo '*** PubsubIO Write Performance Test Python 2GB ***'
*** PubsubIO Write Performance Test Python 2GB ***
[Gradle] - Launching build.
[src] $ <https://ci-beam.apache.org/job/beam_PerformanceTests_PubsubIOIT_Python_Streaming/ws/src/gradlew> -PloadTest.mainClass=apache_beam.io.gcp.pubsub_io_perf_test -Prunner=TestDataflowRunner '-PloadTest.args=--job_name=performance-tests-psio-python-2gb0922150414 --project=apache-beam-testing --region=us-central1 --temp_location=gs://temp-storage-for-perf-tests/loadtests --publish_to_big_query=true --metrics_dataset=beam_performance --metrics_table=psio_io_2GB_results --influx_measurement=python_psio_2GB_results --influx_db_name=beam_test_metrics --influx_hostname=http://10.128.0.96:8086 --input_options='{"num_records": 2097152,"key_size": 1,"value_size": 1024}' --num_****s=5 --autoscaling_algorithm=NONE --pubsub_namespace_prefix=pubsub_io_performance_ --wait_until_finish_duration=600000 --runner=TestDataflowRunner' -PwithDataflowWorkerJar=true -PpythonVersion=3.7 --continue --max-****s=8 -Dorg.gradle.jvmargs=-Xms2g -Dorg.gradle.jvmargs=-Xmx6g -Dorg.gradle.vfs.watch=false -Pdocker-pull-licenses :sdks:python:apache_beam:testing:load_tests:run
Starting a Gradle Daemon (subsequent builds will be faster)
Configuration on demand is an incubating feature.
> Task :buildSrc:compileJava NO-SOURCE
> Task :buildSrc:compileGroovy FROM-CACHE
> Task :buildSrc:pluginDescriptors
> Task :buildSrc:processResources
> Task :buildSrc:classes
> Task :buildSrc:jar
> Task :buildSrc:assemble
> Task :buildSrc:spotlessGroovy FROM-CACHE
> Task :buildSrc:spotlessGroovyCheck UP-TO-DATE
> Task :buildSrc:spotlessGroovyGradle FROM-CACHE
> Task :buildSrc:spotlessGroovyGradleCheck UP-TO-DATE
> Task :buildSrc:spotlessCheck UP-TO-DATE
> Task :buildSrc:pluginUnderTestMetadata
> Task :buildSrc:compileTestJava NO-SOURCE
> Task :buildSrc:compileTestGroovy NO-SOURCE
> Task :buildSrc:processTestResources NO-SOURCE
> Task :buildSrc:testClasses UP-TO-DATE
> Task :buildSrc:test NO-SOURCE
> Task :buildSrc:validatePlugins FROM-CACHE
> Task :buildSrc:check UP-TO-DATE
> Task :buildSrc:build

FAILURE: Build failed with an exception.

* Where:
Build file '<https://ci-beam.apache.org/job/beam_PerformanceTests_PubsubIOIT_Python_Streaming/ws/src/sdks/python/apache_beam/testing/load_tests/build.gradle'> line: 51

* What went wrong:
A problem occurred evaluating project ':sdks:python:apache_beam:testing:load_tests'.
> Could not get unknown property 'shadowJar' for project ':runners:google-cloud-dataflow-java:****' of type org.gradle.api.Project.

* Try:
> Run with --stacktrace option to get the stack trace.
> Run with --info or --debug option to get more log output.

* Get more help at https://help.gradle.org

BUILD FAILED in 10s
10 actionable tasks: 4 executed, 4 from cache, 2 up-to-date

Publishing build scan...
https://gradle.com/s/fo5ixy5indbk6

Build step 'Invoke Gradle script' changed build result to FAILURE
Build step 'Invoke Gradle script' marked build as failure

---------------------------------------------------------------------
To unsubscribe, e-mail: builds-unsubscribe@beam.apache.org
For additional commands, e-mail: builds-help@beam.apache.org


Build failed in Jenkins: beam_PerformanceTests_PubsubIOIT_Python_Streaming #834

Posted by Apache Jenkins Server <je...@builds.apache.org>.
See <https://ci-beam.apache.org/job/beam_PerformanceTests_PubsubIOIT_Python_Streaming/834/display/redirect>

Changes:


------------------------------------------
Started by timer
Running as SYSTEM
[EnvInject] - Loading node environment variables.
Building remotely on apache-beam-jenkins-9 (beam) in workspace <https://ci-beam.apache.org/job/beam_PerformanceTests_PubsubIOIT_Python_Streaming/ws/>
The recommended git tool is: NONE
No credentials specified
Wiping out workspace first.
Cloning the remote Git repository
Cloning repository https://github.com/apache/beam.git
 > git init <https://ci-beam.apache.org/job/beam_PerformanceTests_PubsubIOIT_Python_Streaming/ws/src> # timeout=10
Fetching upstream changes from https://github.com/apache/beam.git
 > git --version # timeout=10
 > git --version # 'git version 2.25.1'
 > git fetch --tags --force --progress -- https://github.com/apache/beam.git +refs/heads/*:refs/remotes/origin/* # timeout=10
 > git config remote.origin.url https://github.com/apache/beam.git # timeout=10
 > git config --add remote.origin.fetch +refs/heads/*:refs/remotes/origin/* # timeout=10
 > git config remote.origin.url https://github.com/apache/beam.git # timeout=10
Fetching upstream changes from https://github.com/apache/beam.git
 > git fetch --tags --force --progress -- https://github.com/apache/beam.git +refs/heads/*:refs/remotes/origin/* +refs/pull/${ghprbPullId}/*:refs/remotes/origin/pr/${ghprbPullId}/* # timeout=10
 > git rev-parse origin/master^{commit} # timeout=10
Checking out Revision d578e3df7c963e57f251fb27739fbc1d3811e722 (origin/master)
 > git config core.sparsecheckout # timeout=10
 > git checkout -f d578e3df7c963e57f251fb27739fbc1d3811e722 # timeout=10
Commit message: "[BEAM-14378] [CdapIO] SparkReceiverIO Read via SDF (#17828)"
 > git rev-list --no-walk d578e3df7c963e57f251fb27739fbc1d3811e722 # timeout=10
No emails were triggered.
[EnvInject] - Executing scripts and injecting environment variables after the SCM step.
[EnvInject] - Injecting as environment variables the properties content 
SETUPTOOLS_USE_DISTUTILS=stdlib
SPARK_LOCAL_IP=127.0.0.1

[EnvInject] - Variables injected successfully.
[beam_PerformanceTests_PubsubIOIT_Python_Streaming] $ /bin/bash -xe /tmp/jenkins1854098947061856879.sh
+ echo '*** PubsubIO Write Performance Test Python 2GB ***'
*** PubsubIO Write Performance Test Python 2GB ***
[Gradle] - Launching build.
[src] $ <https://ci-beam.apache.org/job/beam_PerformanceTests_PubsubIOIT_Python_Streaming/ws/src/gradlew> -PloadTest.mainClass=apache_beam.io.gcp.pubsub_io_perf_test -Prunner=TestDataflowRunner '-PloadTest.args=--job_name=performance-tests-psio-python-2gb0921150420 --project=apache-beam-testing --region=us-central1 --temp_location=gs://temp-storage-for-perf-tests/loadtests --publish_to_big_query=true --metrics_dataset=beam_performance --metrics_table=psio_io_2GB_results --influx_measurement=python_psio_2GB_results --influx_db_name=beam_test_metrics --influx_hostname=http://10.128.0.96:8086 --input_options='{"num_records": 2097152,"key_size": 1,"value_size": 1024}' --num_****s=5 --autoscaling_algorithm=NONE --pubsub_namespace_prefix=pubsub_io_performance_ --wait_until_finish_duration=600000 --runner=TestDataflowRunner' -PwithDataflowWorkerJar=true -PpythonVersion=3.7 --continue --max-****s=8 -Dorg.gradle.jvmargs=-Xms2g -Dorg.gradle.jvmargs=-Xmx6g -Dorg.gradle.vfs.watch=false -Pdocker-pull-licenses :sdks:python:apache_beam:testing:load_tests:run
Starting a Gradle Daemon, 1 busy Daemon could not be reused, use --status for details
Configuration on demand is an incubating feature.
> Task :buildSrc:compileJava NO-SOURCE
> Task :buildSrc:compileGroovy FROM-CACHE
> Task :buildSrc:pluginDescriptors
> Task :buildSrc:processResources
> Task :buildSrc:classes
> Task :buildSrc:jar
> Task :buildSrc:assemble
> Task :buildSrc:spotlessGroovy FROM-CACHE
> Task :buildSrc:spotlessGroovyCheck UP-TO-DATE
> Task :buildSrc:spotlessGroovyGradle FROM-CACHE
> Task :buildSrc:spotlessGroovyGradleCheck UP-TO-DATE
> Task :buildSrc:spotlessCheck UP-TO-DATE
> Task :buildSrc:pluginUnderTestMetadata
> Task :buildSrc:compileTestJava NO-SOURCE
> Task :buildSrc:compileTestGroovy NO-SOURCE
> Task :buildSrc:processTestResources NO-SOURCE
> Task :buildSrc:testClasses UP-TO-DATE
> Task :buildSrc:test NO-SOURCE
> Task :buildSrc:validatePlugins FROM-CACHE
> Task :buildSrc:check UP-TO-DATE
> Task :buildSrc:build

FAILURE: Build failed with an exception.

* Where:
Build file '<https://ci-beam.apache.org/job/beam_PerformanceTests_PubsubIOIT_Python_Streaming/ws/src/sdks/python/apache_beam/testing/load_tests/build.gradle'> line: 51

* What went wrong:
A problem occurred evaluating project ':sdks:python:apache_beam:testing:load_tests'.
> Could not get unknown property 'shadowJar' for project ':runners:google-cloud-dataflow-java:****' of type org.gradle.api.Project.

* Try:
> Run with --stacktrace option to get the stack trace.
> Run with --info or --debug option to get more log output.

* Get more help at https://help.gradle.org

BUILD FAILED in 11s
10 actionable tasks: 4 executed, 4 from cache, 2 up-to-date

Publishing build scan...
https://gradle.com/s/5embazaj62ufw

Build step 'Invoke Gradle script' changed build result to FAILURE
Build step 'Invoke Gradle script' marked build as failure

---------------------------------------------------------------------
To unsubscribe, e-mail: builds-unsubscribe@beam.apache.org
For additional commands, e-mail: builds-help@beam.apache.org


Build failed in Jenkins: beam_PerformanceTests_PubsubIOIT_Python_Streaming #833

Posted by Apache Jenkins Server <je...@builds.apache.org>.
See <https://ci-beam.apache.org/job/beam_PerformanceTests_PubsubIOIT_Python_Streaming/833/display/redirect?page=changes>

Changes:

[Pablo Estrada] Revert "Trying out property-based tests for Beam python coders (#22233)"

[noreply] Bump google.golang.org/api from 0.95.0 to 0.96.0 in /sdks (#23246)

[noreply] [Go SDK] Add timer coder support (#23222)

[noreply] Fix wrong comment (#23272)

[noreply] [Playground] [Backend] Cache component for playground examples (#22869)

[noreply] [BEAM-13416] Introduce Schema provider for AWS models and deprecate low

[noreply] [BEAM-14378] [CdapIO] SparkReceiverIO Read via SDF (#17828)


------------------------------------------
Started by timer
Running as SYSTEM
[EnvInject] - Loading node environment variables.
Building remotely on apache-beam-jenkins-12 (beam) in workspace <https://ci-beam.apache.org/job/beam_PerformanceTests_PubsubIOIT_Python_Streaming/ws/>
The recommended git tool is: NONE
No credentials specified
Wiping out workspace first.
Cloning the remote Git repository
Cloning repository https://github.com/apache/beam.git
 > git init <https://ci-beam.apache.org/job/beam_PerformanceTests_PubsubIOIT_Python_Streaming/ws/src> # timeout=10
Fetching upstream changes from https://github.com/apache/beam.git
 > git --version # timeout=10
 > git --version # 'git version 2.25.1'
 > git fetch --tags --force --progress -- https://github.com/apache/beam.git +refs/heads/*:refs/remotes/origin/* # timeout=10
 > git config remote.origin.url https://github.com/apache/beam.git # timeout=10
 > git config --add remote.origin.fetch +refs/heads/*:refs/remotes/origin/* # timeout=10
 > git config remote.origin.url https://github.com/apache/beam.git # timeout=10
Fetching upstream changes from https://github.com/apache/beam.git
 > git fetch --tags --force --progress -- https://github.com/apache/beam.git +refs/heads/*:refs/remotes/origin/* +refs/pull/${ghprbPullId}/*:refs/remotes/origin/pr/${ghprbPullId}/* # timeout=10
 > git rev-parse origin/master^{commit} # timeout=10
Checking out Revision d578e3df7c963e57f251fb27739fbc1d3811e722 (origin/master)
 > git config core.sparsecheckout # timeout=10
 > git checkout -f d578e3df7c963e57f251fb27739fbc1d3811e722 # timeout=10
Commit message: "[BEAM-14378] [CdapIO] SparkReceiverIO Read via SDF (#17828)"
 > git rev-list --no-walk 5520fe064fc3b7196998d4597746119691eb6681 # timeout=10
No emails were triggered.
[EnvInject] - Executing scripts and injecting environment variables after the SCM step.
[EnvInject] - Injecting as environment variables the properties content 
SETUPTOOLS_USE_DISTUTILS=stdlib
SPARK_LOCAL_IP=127.0.0.1

[EnvInject] - Variables injected successfully.
[beam_PerformanceTests_PubsubIOIT_Python_Streaming] $ /bin/bash -xe /tmp/jenkins6531923545032597377.sh
+ echo '*** PubsubIO Write Performance Test Python 2GB ***'
*** PubsubIO Write Performance Test Python 2GB ***
[Gradle] - Launching build.
[src] $ <https://ci-beam.apache.org/job/beam_PerformanceTests_PubsubIOIT_Python_Streaming/ws/src/gradlew> -PloadTest.mainClass=apache_beam.io.gcp.pubsub_io_perf_test -Prunner=TestDataflowRunner '-PloadTest.args=--job_name=performance-tests-psio-python-2gb0920150434 --project=apache-beam-testing --region=us-central1 --temp_location=gs://temp-storage-for-perf-tests/loadtests --publish_to_big_query=true --metrics_dataset=beam_performance --metrics_table=psio_io_2GB_results --influx_measurement=python_psio_2GB_results --influx_db_name=beam_test_metrics --influx_hostname=http://10.128.0.96:8086 --input_options='{"num_records": 2097152,"key_size": 1,"value_size": 1024}' --num_****s=5 --autoscaling_algorithm=NONE --pubsub_namespace_prefix=pubsub_io_performance_ --wait_until_finish_duration=600000 --runner=TestDataflowRunner' -PwithDataflowWorkerJar=true -PpythonVersion=3.7 --continue --max-****s=8 -Dorg.gradle.jvmargs=-Xms2g -Dorg.gradle.jvmargs=-Xmx6g -Dorg.gradle.vfs.watch=false -Pdocker-pull-licenses :sdks:python:apache_beam:testing:load_tests:run
Configuration on demand is an incubating feature.
> Task :buildSrc:compileJava NO-SOURCE
> Task :buildSrc:compileGroovy FROM-CACHE
> Task :buildSrc:pluginDescriptors
> Task :buildSrc:processResources
> Task :buildSrc:classes
> Task :buildSrc:jar
> Task :buildSrc:assemble
> Task :buildSrc:spotlessGroovy FROM-CACHE
> Task :buildSrc:spotlessGroovyCheck UP-TO-DATE
> Task :buildSrc:spotlessGroovyGradle FROM-CACHE
> Task :buildSrc:spotlessGroovyGradleCheck UP-TO-DATE
> Task :buildSrc:spotlessCheck UP-TO-DATE
> Task :buildSrc:pluginUnderTestMetadata
> Task :buildSrc:compileTestJava NO-SOURCE
> Task :buildSrc:compileTestGroovy NO-SOURCE
> Task :buildSrc:processTestResources NO-SOURCE
> Task :buildSrc:testClasses UP-TO-DATE
> Task :buildSrc:test NO-SOURCE
> Task :buildSrc:validatePlugins FROM-CACHE
> Task :buildSrc:check UP-TO-DATE
> Task :buildSrc:build

FAILURE: Build failed with an exception.

* Where:
Build file '<https://ci-beam.apache.org/job/beam_PerformanceTests_PubsubIOIT_Python_Streaming/ws/src/sdks/python/apache_beam/testing/load_tests/build.gradle'> line: 51

* What went wrong:
A problem occurred evaluating project ':sdks:python:apache_beam:testing:load_tests'.
> Could not get unknown property 'shadowJar' for project ':runners:google-cloud-dataflow-java:****' of type org.gradle.api.Project.

* Try:
> Run with --stacktrace option to get the stack trace.
> Run with --info or --debug option to get more log output.

* Get more help at https://help.gradle.org

BUILD FAILED in 1s
10 actionable tasks: 4 executed, 4 from cache, 2 up-to-date

Publishing build scan...
https://gradle.com/s/q3aadpbdhth4c

Build step 'Invoke Gradle script' changed build result to FAILURE
Build step 'Invoke Gradle script' marked build as failure

---------------------------------------------------------------------
To unsubscribe, e-mail: builds-unsubscribe@beam.apache.org
For additional commands, e-mail: builds-help@beam.apache.org


Build failed in Jenkins: beam_PerformanceTests_PubsubIOIT_Python_Streaming #832

Posted by Apache Jenkins Server <je...@builds.apache.org>.
See <https://ci-beam.apache.org/job/beam_PerformanceTests_PubsubIOIT_Python_Streaming/832/display/redirect?page=changes>

Changes:

[noreply] Enable verbose output for RAT Precommit (#23279)


------------------------------------------
Started by timer
Running as SYSTEM
[EnvInject] - Loading node environment variables.
Building remotely on apache-beam-jenkins-9 (beam) in workspace <https://ci-beam.apache.org/job/beam_PerformanceTests_PubsubIOIT_Python_Streaming/ws/>
The recommended git tool is: NONE
No credentials specified
Wiping out workspace first.
Cloning the remote Git repository
Cloning repository https://github.com/apache/beam.git
 > git init <https://ci-beam.apache.org/job/beam_PerformanceTests_PubsubIOIT_Python_Streaming/ws/src> # timeout=10
Fetching upstream changes from https://github.com/apache/beam.git
 > git --version # timeout=10
 > git --version # 'git version 2.25.1'
 > git fetch --tags --force --progress -- https://github.com/apache/beam.git +refs/heads/*:refs/remotes/origin/* # timeout=10
 > git config remote.origin.url https://github.com/apache/beam.git # timeout=10
 > git config --add remote.origin.fetch +refs/heads/*:refs/remotes/origin/* # timeout=10
 > git config remote.origin.url https://github.com/apache/beam.git # timeout=10
Fetching upstream changes from https://github.com/apache/beam.git
 > git fetch --tags --force --progress -- https://github.com/apache/beam.git +refs/heads/*:refs/remotes/origin/* +refs/pull/${ghprbPullId}/*:refs/remotes/origin/pr/${ghprbPullId}/* # timeout=10
 > git rev-parse origin/master^{commit} # timeout=10
Checking out Revision 5520fe064fc3b7196998d4597746119691eb6681 (origin/master)
 > git config core.sparsecheckout # timeout=10
 > git checkout -f 5520fe064fc3b7196998d4597746119691eb6681 # timeout=10
Commit message: "Enable verbose output for RAT Precommit (#23279)"
 > git rev-list --no-walk f477b85f230ebb5dbd6b62540da078a33e3318ce # timeout=10
No emails were triggered.
[EnvInject] - Executing scripts and injecting environment variables after the SCM step.
[EnvInject] - Injecting as environment variables the properties content 
SETUPTOOLS_USE_DISTUTILS=stdlib
SPARK_LOCAL_IP=127.0.0.1

[EnvInject] - Variables injected successfully.
[beam_PerformanceTests_PubsubIOIT_Python_Streaming] $ /bin/bash -xe /tmp/jenkins3850974803811121245.sh
+ echo '*** PubsubIO Write Performance Test Python 2GB ***'
*** PubsubIO Write Performance Test Python 2GB ***
[Gradle] - Launching build.
[src] $ <https://ci-beam.apache.org/job/beam_PerformanceTests_PubsubIOIT_Python_Streaming/ws/src/gradlew> -PloadTest.mainClass=apache_beam.io.gcp.pubsub_io_perf_test -Prunner=TestDataflowRunner '-PloadTest.args=--job_name=performance-tests-psio-python-2gb0919150410 --project=apache-beam-testing --region=us-central1 --temp_location=gs://temp-storage-for-perf-tests/loadtests --publish_to_big_query=true --metrics_dataset=beam_performance --metrics_table=psio_io_2GB_results --influx_measurement=python_psio_2GB_results --influx_db_name=beam_test_metrics --influx_hostname=http://10.128.0.96:8086 --input_options='{"num_records": 2097152,"key_size": 1,"value_size": 1024}' --num_****s=5 --autoscaling_algorithm=NONE --pubsub_namespace_prefix=pubsub_io_performance_ --wait_until_finish_duration=600000 --runner=TestDataflowRunner' -PwithDataflowWorkerJar=true -PpythonVersion=3.7 --continue --max-****s=8 -Dorg.gradle.jvmargs=-Xms2g -Dorg.gradle.jvmargs=-Xmx6g -Dorg.gradle.vfs.watch=false -Pdocker-pull-licenses :sdks:python:apache_beam:testing:load_tests:run
Starting a Gradle Daemon (subsequent builds will be faster)
Configuration on demand is an incubating feature.
> Task :buildSrc:compileJava NO-SOURCE
> Task :buildSrc:compileGroovy FROM-CACHE
> Task :buildSrc:pluginDescriptors
> Task :buildSrc:processResources
> Task :buildSrc:classes
> Task :buildSrc:jar
> Task :buildSrc:assemble
> Task :buildSrc:spotlessGroovy FROM-CACHE
> Task :buildSrc:spotlessGroovyCheck UP-TO-DATE
> Task :buildSrc:spotlessGroovyGradle FROM-CACHE
> Task :buildSrc:spotlessGroovyGradleCheck UP-TO-DATE
> Task :buildSrc:spotlessCheck UP-TO-DATE
> Task :buildSrc:pluginUnderTestMetadata
> Task :buildSrc:compileTestJava NO-SOURCE
> Task :buildSrc:compileTestGroovy NO-SOURCE
> Task :buildSrc:processTestResources NO-SOURCE
> Task :buildSrc:testClasses UP-TO-DATE
> Task :buildSrc:test NO-SOURCE
> Task :buildSrc:validatePlugins FROM-CACHE
> Task :buildSrc:check UP-TO-DATE
> Task :buildSrc:build

FAILURE: Build failed with an exception.

* Where:
Build file '<https://ci-beam.apache.org/job/beam_PerformanceTests_PubsubIOIT_Python_Streaming/ws/src/sdks/python/apache_beam/testing/load_tests/build.gradle'> line: 51

* What went wrong:
A problem occurred evaluating project ':sdks:python:apache_beam:testing:load_tests'.
> Could not get unknown property 'shadowJar' for project ':runners:google-cloud-dataflow-java:****' of type org.gradle.api.Project.

* Try:
> Run with --stacktrace option to get the stack trace.
> Run with --info or --debug option to get more log output.

* Get more help at https://help.gradle.org

BUILD FAILED in 9s
10 actionable tasks: 4 executed, 4 from cache, 2 up-to-date

Publishing build scan...
https://gradle.com/s/lu7prop5mzhc2

Build step 'Invoke Gradle script' changed build result to FAILURE
Build step 'Invoke Gradle script' marked build as failure

---------------------------------------------------------------------
To unsubscribe, e-mail: builds-unsubscribe@beam.apache.org
For additional commands, e-mail: builds-help@beam.apache.org


Build failed in Jenkins: beam_PerformanceTests_PubsubIOIT_Python_Streaming #831

Posted by Apache Jenkins Server <je...@builds.apache.org>.
See <https://ci-beam.apache.org/job/beam_PerformanceTests_PubsubIOIT_Python_Streaming/831/display/redirect?page=changes>

Changes:

[noreply] Add drop_example flag to the RunInference and Model Handler (#23266)


------------------------------------------
Started by timer
Running as SYSTEM
[EnvInject] - Loading node environment variables.
Building remotely on apache-beam-jenkins-9 (beam) in workspace <https://ci-beam.apache.org/job/beam_PerformanceTests_PubsubIOIT_Python_Streaming/ws/>
The recommended git tool is: NONE
No credentials specified
Wiping out workspace first.
Cloning the remote Git repository
Cloning repository https://github.com/apache/beam.git
 > git init <https://ci-beam.apache.org/job/beam_PerformanceTests_PubsubIOIT_Python_Streaming/ws/src> # timeout=10
Fetching upstream changes from https://github.com/apache/beam.git
 > git --version # timeout=10
 > git --version # 'git version 2.25.1'
 > git fetch --tags --force --progress -- https://github.com/apache/beam.git +refs/heads/*:refs/remotes/origin/* # timeout=10
 > git config remote.origin.url https://github.com/apache/beam.git # timeout=10
 > git config --add remote.origin.fetch +refs/heads/*:refs/remotes/origin/* # timeout=10
 > git config remote.origin.url https://github.com/apache/beam.git # timeout=10
Fetching upstream changes from https://github.com/apache/beam.git
 > git fetch --tags --force --progress -- https://github.com/apache/beam.git +refs/heads/*:refs/remotes/origin/* +refs/pull/${ghprbPullId}/*:refs/remotes/origin/pr/${ghprbPullId}/* # timeout=10
 > git rev-parse origin/master^{commit} # timeout=10
Checking out Revision f477b85f230ebb5dbd6b62540da078a33e3318ce (origin/master)
 > git config core.sparsecheckout # timeout=10
 > git checkout -f f477b85f230ebb5dbd6b62540da078a33e3318ce # timeout=10
Commit message: "Add drop_example flag to the RunInference and Model Handler (#23266)"
 > git rev-list --no-walk 8754cc0904872d37edbb8b4d3b8d9f92aad94acc # timeout=10
No emails were triggered.
[EnvInject] - Executing scripts and injecting environment variables after the SCM step.
[EnvInject] - Injecting as environment variables the properties content 
SETUPTOOLS_USE_DISTUTILS=stdlib
SPARK_LOCAL_IP=127.0.0.1

[EnvInject] - Variables injected successfully.
[beam_PerformanceTests_PubsubIOIT_Python_Streaming] $ /bin/bash -xe /tmp/jenkins7367883017291103710.sh
+ echo '*** PubsubIO Write Performance Test Python 2GB ***'
*** PubsubIO Write Performance Test Python 2GB ***
[Gradle] - Launching build.
[src] $ <https://ci-beam.apache.org/job/beam_PerformanceTests_PubsubIOIT_Python_Streaming/ws/src/gradlew> -PloadTest.mainClass=apache_beam.io.gcp.pubsub_io_perf_test -Prunner=TestDataflowRunner '-PloadTest.args=--job_name=performance-tests-psio-python-2gb0918150402 --project=apache-beam-testing --region=us-central1 --temp_location=gs://temp-storage-for-perf-tests/loadtests --publish_to_big_query=true --metrics_dataset=beam_performance --metrics_table=psio_io_2GB_results --influx_measurement=python_psio_2GB_results --influx_db_name=beam_test_metrics --influx_hostname=http://10.128.0.96:8086 --input_options='{"num_records": 2097152,"key_size": 1,"value_size": 1024}' --num_****s=5 --autoscaling_algorithm=NONE --pubsub_namespace_prefix=pubsub_io_performance_ --wait_until_finish_duration=600000 --runner=TestDataflowRunner' -PwithDataflowWorkerJar=true -PpythonVersion=3.7 --continue --max-****s=8 -Dorg.gradle.jvmargs=-Xms2g -Dorg.gradle.jvmargs=-Xmx6g -Dorg.gradle.vfs.watch=false -Pdocker-pull-licenses :sdks:python:apache_beam:testing:load_tests:run
Starting a Gradle Daemon (subsequent builds will be faster)
Configuration on demand is an incubating feature.
> Task :buildSrc:compileJava NO-SOURCE
> Task :buildSrc:compileGroovy FROM-CACHE
> Task :buildSrc:pluginDescriptors
> Task :buildSrc:processResources
> Task :buildSrc:classes
> Task :buildSrc:jar
> Task :buildSrc:assemble
> Task :buildSrc:spotlessGroovy FROM-CACHE
> Task :buildSrc:spotlessGroovyCheck UP-TO-DATE
> Task :buildSrc:spotlessGroovyGradle FROM-CACHE
> Task :buildSrc:spotlessGroovyGradleCheck UP-TO-DATE
> Task :buildSrc:spotlessCheck UP-TO-DATE
> Task :buildSrc:pluginUnderTestMetadata
> Task :buildSrc:compileTestJava NO-SOURCE
> Task :buildSrc:compileTestGroovy NO-SOURCE
> Task :buildSrc:processTestResources NO-SOURCE
> Task :buildSrc:testClasses UP-TO-DATE
> Task :buildSrc:test NO-SOURCE
> Task :buildSrc:validatePlugins FROM-CACHE
> Task :buildSrc:check UP-TO-DATE
> Task :buildSrc:build

FAILURE: Build failed with an exception.

* Where:
Build file '<https://ci-beam.apache.org/job/beam_PerformanceTests_PubsubIOIT_Python_Streaming/ws/src/sdks/python/apache_beam/testing/load_tests/build.gradle'> line: 51

* What went wrong:
A problem occurred evaluating project ':sdks:python:apache_beam:testing:load_tests'.
> Could not get unknown property 'shadowJar' for project ':runners:google-cloud-dataflow-java:****' of type org.gradle.api.Project.

* Try:
> Run with --stacktrace option to get the stack trace.
> Run with --info or --debug option to get more log output.

* Get more help at https://help.gradle.org

BUILD FAILED in 10s
10 actionable tasks: 4 executed, 4 from cache, 2 up-to-date

Publishing build scan...
https://gradle.com/s/captrhyz3ok7e

Build step 'Invoke Gradle script' changed build result to FAILURE
Build step 'Invoke Gradle script' marked build as failure

---------------------------------------------------------------------
To unsubscribe, e-mail: builds-unsubscribe@beam.apache.org
For additional commands, e-mail: builds-help@beam.apache.org