You are viewing a plain text version of this content. The canonical link for it is here.
Posted to builds@beam.apache.org by Apache Jenkins Server <je...@builds.apache.org> on 2018/10/26 20:23:04 UTC
Build failed in Jenkins: beam_PostCommit_Java_Nexmark_Direct #944
See <https://builds.apache.org/job/beam_PostCommit_Java_Nexmark_Direct/944/display/redirect?page=changes>
Changes:
[scott] Replace precommit dashboard image with an actual image
[amaliujia] apply spotless
------------------------------------------
[...truncated 191.47 KB...]
INFO: shard-00003-of-00025 with timestamp 2015-07-15T00:00:09.999Z has 0 actually late and 4015 on-time elements in pane PaneInfo{isFirst=true, isLast=true, timing=ON_TIME, index=0, onTimeIndex=0} for window 2015-07-15T00:00:09.999Z
Oct 26, 2018 8:22:56 PM org.apache.beam.sdk.nexmark.queries.Query10$2 processElement
INFO: shard-00022-of-00025 with timestamp 2015-07-15T00:00:09.999Z has 0 actually late and 4066 on-time elements in pane PaneInfo{isFirst=true, isLast=true, timing=ON_TIME, index=0, onTimeIndex=0} for window 2015-07-15T00:00:09.999Z
Oct 26, 2018 8:22:56 PM org.apache.beam.sdk.nexmark.queries.Query10$2 processElement
INFO: shard-00016-of-00025 with timestamp 2015-07-15T00:00:09.999Z has 0 actually late and 4018 on-time elements in pane PaneInfo{isFirst=true, isLast=true, timing=ON_TIME, index=0, onTimeIndex=0} for window 2015-07-15T00:00:09.999Z
Oct 26, 2018 8:22:56 PM org.apache.beam.sdk.nexmark.queries.Query10$2 processElement
INFO: shard-00014-of-00025 with timestamp 2015-07-15T00:00:09.999Z has 0 actually late and 4134 on-time elements in pane PaneInfo{isFirst=true, isLast=true, timing=ON_TIME, index=0, onTimeIndex=0} for window 2015-07-15T00:00:09.999Z
Oct 26, 2018 8:22:56 PM org.apache.beam.sdk.nexmark.queries.Query10$2 processElement
INFO: shard-00006-of-00025 with timestamp 2015-07-15T00:00:09.999Z has 0 actually late and 3992 on-time elements in pane PaneInfo{isFirst=true, isLast=true, timing=ON_TIME, index=0, onTimeIndex=0} for window 2015-07-15T00:00:09.999Z
Oct 26, 2018 8:22:56 PM org.apache.beam.sdk.nexmark.queries.Query10$2 processElement
INFO: shard-00011-of-00025 with timestamp 2015-07-15T00:00:09.999Z has 0 actually late and 4020 on-time elements in pane PaneInfo{isFirst=true, isLast=true, timing=ON_TIME, index=0, onTimeIndex=0} for window 2015-07-15T00:00:09.999Z
Oct 26, 2018 8:22:56 PM org.apache.beam.sdk.nexmark.queries.Query10$2 processElement
INFO: shard-00013-of-00025 with timestamp 2015-07-15T00:00:09.999Z has 0 actually late and 3940 on-time elements in pane PaneInfo{isFirst=true, isLast=true, timing=ON_TIME, index=0, onTimeIndex=0} for window 2015-07-15T00:00:09.999Z
Oct 26, 2018 8:22:56 PM org.apache.beam.sdk.nexmark.queries.Query10$2 processElement
INFO: shard-00018-of-00025 with timestamp 2015-07-15T00:00:09.999Z has 0 actually late and 3987 on-time elements in pane PaneInfo{isFirst=true, isLast=true, timing=ON_TIME, index=0, onTimeIndex=0} for window 2015-07-15T00:00:09.999Z
Oct 26, 2018 8:22:56 PM org.apache.beam.sdk.nexmark.queries.Query10$2 processElement
INFO: shard-00021-of-00025 with timestamp 2015-07-15T00:00:09.999Z has 0 actually late and 3969 on-time elements in pane PaneInfo{isFirst=true, isLast=true, timing=ON_TIME, index=0, onTimeIndex=0} for window 2015-07-15T00:00:09.999Z
Oct 26, 2018 8:22:56 PM org.apache.beam.sdk.nexmark.queries.Query10$2 processElement
INFO: shard-00005-of-00025 with timestamp 2015-07-15T00:00:09.999Z has 0 actually late and 4060 on-time elements in pane PaneInfo{isFirst=true, isLast=true, timing=ON_TIME, index=0, onTimeIndex=0} for window 2015-07-15T00:00:09.999Z
Oct 26, 2018 8:22:56 PM org.apache.beam.sdk.nexmark.queries.Query10$2 processElement
INFO: shard-00020-of-00025 with timestamp 2015-07-15T00:00:09.999Z has 0 actually late and 4021 on-time elements in pane PaneInfo{isFirst=true, isLast=true, timing=ON_TIME, index=0, onTimeIndex=0} for window 2015-07-15T00:00:09.999Z
Oct 26, 2018 8:22:56 PM org.apache.beam.sdk.nexmark.queries.Query10$2 processElement
INFO: shard-00002-of-00025 with timestamp 2015-07-15T00:00:09.999Z has 0 actually late and 4002 on-time elements in pane PaneInfo{isFirst=true, isLast=true, timing=ON_TIME, index=0, onTimeIndex=0} for window 2015-07-15T00:00:09.999Z
Oct 26, 2018 8:22:56 PM org.apache.beam.sdk.nexmark.queries.Query10$2 processElement
INFO: shard-00009-of-00025 with timestamp 2015-07-15T00:00:09.999Z has 0 actually late and 4056 on-time elements in pane PaneInfo{isFirst=true, isLast=true, timing=ON_TIME, index=0, onTimeIndex=0} for window 2015-07-15T00:00:09.999Z
Oct 26, 2018 8:22:56 PM org.apache.beam.sdk.nexmark.queries.Query10$2 processElement
INFO: shard-00024-of-00025 with timestamp 2015-07-15T00:00:09.999Z has 0 actually late and 4127 on-time elements in pane PaneInfo{isFirst=true, isLast=true, timing=ON_TIME, index=0, onTimeIndex=0} for window 2015-07-15T00:00:09.999Z
Oct 26, 2018 8:22:56 PM org.apache.beam.sdk.nexmark.queries.Query10$2 processElement
INFO: shard-00015-of-00025 with timestamp 2015-07-15T00:00:09.999Z has 0 actually late and 4041 on-time elements in pane PaneInfo{isFirst=true, isLast=true, timing=ON_TIME, index=0, onTimeIndex=0} for window 2015-07-15T00:00:09.999Z
Oct 26, 2018 8:22:56 PM org.apache.beam.sdk.nexmark.queries.Query10$3 processElement
INFO: Writing shard-00019-of-00025 with record timestamp 2015-07-15T00:00:09.999Z, window timestamp 2015-07-15T00:00:09.999Z, pane PaneInfo{isFirst=true, isLast=true, timing=ON_TIME, index=0, onTimeIndex=0}
Oct 26, 2018 8:22:56 PM org.apache.beam.sdk.nexmark.queries.Query10$3 processElement
INFO: Writing shard-00010-of-00025 with record timestamp 2015-07-15T00:00:09.999Z, window timestamp 2015-07-15T00:00:09.999Z, pane PaneInfo{isFirst=true, isLast=true, timing=ON_TIME, index=0, onTimeIndex=0}
Oct 26, 2018 8:22:56 PM org.apache.beam.sdk.nexmark.queries.Query10$2 processElement
INFO: shard-00001-of-00025 with timestamp 2015-07-15T00:00:09.999Z has 0 actually late and 3953 on-time elements in pane PaneInfo{isFirst=true, isLast=true, timing=ON_TIME, index=0, onTimeIndex=0} for window 2015-07-15T00:00:09.999Z
Oct 26, 2018 8:22:56 PM org.apache.beam.sdk.nexmark.queries.Query10$3 processElement
INFO: Writing shard-00000-of-00025 with record timestamp 2015-07-15T00:00:09.999Z, window timestamp 2015-07-15T00:00:09.999Z, pane PaneInfo{isFirst=true, isLast=true, timing=ON_TIME, index=0, onTimeIndex=0}
Oct 26, 2018 8:22:56 PM org.apache.beam.sdk.nexmark.queries.Query10$3 processElement
INFO: Writing shard-00012-of-00025 with record timestamp 2015-07-15T00:00:09.999Z, window timestamp 2015-07-15T00:00:09.999Z, pane PaneInfo{isFirst=true, isLast=true, timing=ON_TIME, index=0, onTimeIndex=0}
Oct 26, 2018 8:22:56 PM org.apache.beam.sdk.nexmark.queries.Query10$3 processElement
INFO: Writing shard-00017-of-00025 with record timestamp 2015-07-15T00:00:09.999Z, window timestamp 2015-07-15T00:00:09.999Z, pane PaneInfo{isFirst=true, isLast=true, timing=ON_TIME, index=0, onTimeIndex=0}
Oct 26, 2018 8:22:56 PM org.apache.beam.sdk.nexmark.queries.Query10$3 processElement
INFO: Writing shard-00023-of-00025 with record timestamp 2015-07-15T00:00:09.999Z, window timestamp 2015-07-15T00:00:09.999Z, pane PaneInfo{isFirst=true, isLast=true, timing=ON_TIME, index=0, onTimeIndex=0}
Oct 26, 2018 8:22:56 PM org.apache.beam.sdk.nexmark.queries.Query10$3 processElement
INFO: Writing shard-00003-of-00025 with record timestamp 2015-07-15T00:00:09.999Z, window timestamp 2015-07-15T00:00:09.999Z, pane PaneInfo{isFirst=true, isLast=true, timing=ON_TIME, index=0, onTimeIndex=0}
Oct 26, 2018 8:22:56 PM org.apache.beam.sdk.util.MutationDetectors$CodedValueMutationDetector verifyUnmodifiedThrowingCheckedExceptions
WARNING: Coder of type class org.apache.beam.sdk.coders.KvCoder has a #structuralValue method which does not return true when the encoding of the elements is equal. Element KV{null, 2015-07-15T00:00:09.999Z shard-00000-of-00025 0 ON_TIME null
}
Oct 26, 2018 8:22:56 PM org.apache.beam.sdk.util.MutationDetectors$CodedValueMutationDetector verifyUnmodifiedThrowingCheckedExceptions
WARNING: Coder of type class org.apache.beam.sdk.coders.KvCoder has a #structuralValue method which does not return true when the encoding of the elements is equal. Element KV{null, 2015-07-15T00:00:09.999Z shard-00010-of-00025 0 ON_TIME null
}
Oct 26, 2018 8:22:56 PM org.apache.beam.sdk.util.MutationDetectors$CodedValueMutationDetector verifyUnmodifiedThrowingCheckedExceptions
WARNING: Coder of type class org.apache.beam.sdk.coders.KvCoder has a #structuralValue method which does not return true when the encoding of the elements is equal. Element KV{null, 2015-07-15T00:00:09.999Z shard-00017-of-00025 0 ON_TIME null
}
Oct 26, 2018 8:22:56 PM org.apache.beam.sdk.util.MutationDetectors$CodedValueMutationDetector verifyUnmodifiedThrowingCheckedExceptions
WARNING: Coder of type class org.apache.beam.sdk.coders.KvCoder has a #structuralValue method which does not return true when the encoding of the elements is equal. Element KV{null, 2015-07-15T00:00:09.999Z shard-00023-of-00025 0 ON_TIME null
}
Oct 26, 2018 8:22:56 PM org.apache.beam.sdk.util.MutationDetectors$CodedValueMutationDetector verifyUnmodifiedThrowingCheckedExceptions
WARNING: Coder of type class org.apache.beam.sdk.coders.KvCoder has a #structuralValue method which does not return true when the encoding of the elements is equal. Element KV{null, 2015-07-15T00:00:09.999Z shard-00003-of-00025 0 ON_TIME null
}
Oct 26, 2018 8:22:56 PM org.apache.beam.sdk.util.MutationDetectors$CodedValueMutationDetector verifyUnmodifiedThrowingCheckedExceptions
WARNING: Coder of type class org.apache.beam.sdk.coders.KvCoder has a #structuralValue method which does not return true when the encoding of the elements is equal. Element KV{null, 2015-07-15T00:00:09.999Z shard-00012-of-00025 0 ON_TIME null
}
Oct 26, 2018 8:22:56 PM org.apache.beam.sdk.util.MutationDetectors$CodedValueMutationDetector verifyUnmodifiedThrowingCheckedExceptions
WARNING: Coder of type class org.apache.beam.sdk.coders.KvCoder has a #structuralValue method which does not return true when the encoding of the elements is equal. Element KV{null, 2015-07-15T00:00:09.999Z shard-00019-of-00025 0 ON_TIME null
}
Oct 26, 2018 8:22:56 PM org.apache.beam.sdk.nexmark.queries.Query10$3 processElement
INFO: Writing shard-00016-of-00025 with record timestamp 2015-07-15T00:00:09.999Z, window timestamp 2015-07-15T00:00:09.999Z, pane PaneInfo{isFirst=true, isLast=true, timing=ON_TIME, index=0, onTimeIndex=0}
Oct 26, 2018 8:22:56 PM org.apache.beam.sdk.nexmark.queries.Query10$3 processElement
INFO: Writing shard-00006-of-00025 with record timestamp 2015-07-15T00:00:09.999Z, window timestamp 2015-07-15T00:00:09.999Z, pane PaneInfo{isFirst=true, isLast=true, timing=ON_TIME, index=0, onTimeIndex=0}
Oct 26, 2018 8:22:56 PM org.apache.beam.sdk.nexmark.queries.Query10$3 processElement
INFO: Writing shard-00014-of-00025 with record timestamp 2015-07-15T00:00:09.999Z, window timestamp 2015-07-15T00:00:09.999Z, pane PaneInfo{isFirst=true, isLast=true, timing=ON_TIME, index=0, onTimeIndex=0}
Oct 26, 2018 8:22:56 PM org.apache.beam.sdk.nexmark.queries.Query10$3 processElement
INFO: Writing shard-00008-of-00025 with record timestamp 2015-07-15T00:00:09.999Z, window timestamp 2015-07-15T00:00:09.999Z, pane PaneInfo{isFirst=true, isLast=true, timing=ON_TIME, index=0, onTimeIndex=0}
Oct 26, 2018 8:22:56 PM org.apache.beam.sdk.util.MutationDetectors$CodedValueMutationDetector verifyUnmodifiedThrowingCheckedExceptions
WARNING: Coder of type class org.apache.beam.sdk.coders.KvCoder has a #structuralValue method which does not return true when the encoding of the elements is equal. Element KV{null, 2015-07-15T00:00:09.999Z shard-00016-of-00025 0 ON_TIME null
}
Oct 26, 2018 8:22:56 PM org.apache.beam.sdk.nexmark.queries.Query10$3 processElement
INFO: Writing shard-00011-of-00025 with record timestamp 2015-07-15T00:00:09.999Z, window timestamp 2015-07-15T00:00:09.999Z, pane PaneInfo{isFirst=true, isLast=true, timing=ON_TIME, index=0, onTimeIndex=0}
Oct 26, 2018 8:22:56 PM org.apache.beam.sdk.util.MutationDetectors$CodedValueMutationDetector verifyUnmodifiedThrowingCheckedExceptions
WARNING: Coder of type class org.apache.beam.sdk.coders.KvCoder has a #structuralValue method which does not return true when the encoding of the elements is equal. Element KV{null, 2015-07-15T00:00:09.999Z shard-00006-of-00025 0 ON_TIME null
}
Oct 26, 2018 8:22:56 PM org.apache.beam.sdk.nexmark.queries.Query10$3 processElement
INFO: Writing shard-00013-of-00025 with record timestamp 2015-07-15T00:00:09.999Z, window timestamp 2015-07-15T00:00:09.999Z, pane PaneInfo{isFirst=true, isLast=true, timing=ON_TIME, index=0, onTimeIndex=0}
Oct 26, 2018 8:22:56 PM org.apache.beam.sdk.nexmark.queries.Query10$3 processElement
INFO: Writing shard-00022-of-00025 with record timestamp 2015-07-15T00:00:09.999Z, window timestamp 2015-07-15T00:00:09.999Z, pane PaneInfo{isFirst=true, isLast=true, timing=ON_TIME, index=0, onTimeIndex=0}
Oct 26, 2018 8:22:56 PM org.apache.beam.sdk.nexmark.queries.Query10$3 processElement
INFO: Writing shard-00007-of-00025 with record timestamp 2015-07-15T00:00:09.999Z, window timestamp 2015-07-15T00:00:09.999Z, pane PaneInfo{isFirst=true, isLast=true, timing=ON_TIME, index=0, onTimeIndex=0}
Oct 26, 2018 8:22:56 PM org.apache.beam.sdk.util.MutationDetectors$CodedValueMutationDetector verifyUnmodifiedThrowingCheckedExceptions
WARNING: Coder of type class org.apache.beam.sdk.coders.KvCoder has a #structuralValue method which does not return true when the encoding of the elements is equal. Element KV{null, 2015-07-15T00:00:09.999Z shard-00008-of-00025 0 ON_TIME null
}
Oct 26, 2018 8:22:56 PM org.apache.beam.sdk.nexmark.queries.Query10$3 processElement
INFO: Writing shard-00004-of-00025 with record timestamp 2015-07-15T00:00:09.999Z, window timestamp 2015-07-15T00:00:09.999Z, pane PaneInfo{isFirst=true, isLast=true, timing=ON_TIME, index=0, onTimeIndex=0}
Oct 26, 2018 8:22:56 PM org.apache.beam.sdk.util.MutationDetectors$CodedValueMutationDetector verifyUnmodifiedThrowingCheckedExceptions
WARNING: Coder of type class org.apache.beam.sdk.coders.KvCoder has a #structuralValue method which does not return true when the encoding of the elements is equal. Element KV{null, 2015-07-15T00:00:09.999Z shard-00014-of-00025 0 ON_TIME null
}
Oct 26, 2018 8:22:56 PM org.apache.beam.sdk.util.MutationDetectors$CodedValueMutationDetector verifyUnmodifiedThrowingCheckedExceptions
WARNING: Coder of type class org.apache.beam.sdk.coders.KvCoder has a #structuralValue method which does not return true when the encoding of the elements is equal. Element KV{null, 2015-07-15T00:00:09.999Z shard-00011-of-00025 0 ON_TIME null
}
Oct 26, 2018 8:22:56 PM org.apache.beam.sdk.util.MutationDetectors$CodedValueMutationDetector verifyUnmodifiedThrowingCheckedExceptions
WARNING: Coder of type class org.apache.beam.sdk.coders.KvCoder has a #structuralValue method which does not return true when the encoding of the elements is equal. Element KV{null, 2015-07-15T00:00:09.999Z shard-00022-of-00025 0 ON_TIME null
}
Oct 26, 2018 8:22:56 PM org.apache.beam.sdk.nexmark.queries.Query10$3 processElement
INFO: Writing shard-00018-of-00025 with record timestamp 2015-07-15T00:00:09.999Z, window timestamp 2015-07-15T00:00:09.999Z, pane PaneInfo{isFirst=true, isLast=true, timing=ON_TIME, index=0, onTimeIndex=0}
Oct 26, 2018 8:22:56 PM org.apache.beam.sdk.util.MutationDetectors$CodedValueMutationDetector verifyUnmodifiedThrowingCheckedExceptions
WARNING: Coder of type class org.apache.beam.sdk.coders.KvCoder has a #structuralValue method which does not return true when the encoding of the elements is equal. Element KV{null, 2015-07-15T00:00:09.999Z shard-00004-of-00025 0 ON_TIME null
}
Oct 26, 2018 8:22:56 PM org.apache.beam.sdk.nexmark.queries.Query10$3 processElement
INFO: Writing shard-00021-of-00025 with record timestamp 2015-07-15T00:00:09.999Z, window timestamp 2015-07-15T00:00:09.999Z, pane PaneInfo{isFirst=true, isLast=true, timing=ON_TIME, index=0, onTimeIndex=0}
Oct 26, 2018 8:22:56 PM org.apache.beam.sdk.util.MutationDetectors$CodedValueMutationDetector verifyUnmodifiedThrowingCheckedExceptions
WARNING: Coder of type class org.apache.beam.sdk.coders.KvCoder has a #structuralValue method which does not return true when the encoding of the elements is equal. Element KV{null, 2015-07-15T00:00:09.999Z shard-00007-of-00025 0 ON_TIME null
}
Oct 26, 2018 8:22:56 PM org.apache.beam.sdk.util.MutationDetectors$CodedValueMutationDetector verifyUnmodifiedThrowingCheckedExceptions
WARNING: Coder of type class org.apache.beam.sdk.coders.KvCoder has a #structuralValue method which does not return true when the encoding of the elements is equal. Element KV{null, 2015-07-15T00:00:09.999Z shard-00013-of-00025 0 ON_TIME null
}
Oct 26, 2018 8:22:56 PM org.apache.beam.sdk.nexmark.queries.Query10$3 processElement
INFO: Writing shard-00005-of-00025 with record timestamp 2015-07-15T00:00:09.999Z, window timestamp 2015-07-15T00:00:09.999Z, pane PaneInfo{isFirst=true, isLast=true, timing=ON_TIME, index=0, onTimeIndex=0}
Oct 26, 2018 8:22:56 PM org.apache.beam.sdk.nexmark.queries.Query10$3 processElement
INFO: Writing shard-00002-of-00025 with record timestamp 2015-07-15T00:00:09.999Z, window timestamp 2015-07-15T00:00:09.999Z, pane PaneInfo{isFirst=true, isLast=true, timing=ON_TIME, index=0, onTimeIndex=0}
Oct 26, 2018 8:22:56 PM org.apache.beam.sdk.nexmark.queries.Query10$3 processElement
INFO: Writing shard-00009-of-00025 with record timestamp 2015-07-15T00:00:09.999Z, window timestamp 2015-07-15T00:00:09.999Z, pane PaneInfo{isFirst=true, isLast=true, timing=ON_TIME, index=0, onTimeIndex=0}
Oct 26, 2018 8:22:56 PM org.apache.beam.sdk.nexmark.queries.Query10$3 processElement
INFO: Writing shard-00001-of-00025 with record timestamp 2015-07-15T00:00:09.999Z, window timestamp 2015-07-15T00:00:09.999Z, pane PaneInfo{isFirst=true, isLast=true, timing=ON_TIME, index=0, onTimeIndex=0}
Oct 26, 2018 8:22:56 PM org.apache.beam.sdk.util.MutationDetectors$CodedValueMutationDetector verifyUnmodifiedThrowingCheckedExceptions
WARNING: Coder of type class org.apache.beam.sdk.coders.KvCoder has a #structuralValue method which does not return true when the encoding of the elements is equal. Element KV{null, 2015-07-15T00:00:09.999Z shard-00021-of-00025 0 ON_TIME null
}
Oct 26, 2018 8:22:56 PM org.apache.beam.sdk.util.MutationDetectors$CodedValueMutationDetector verifyUnmodifiedThrowingCheckedExceptions
WARNING: Coder of type class org.apache.beam.sdk.coders.KvCoder has a #structuralValue method which does not return true when the encoding of the elements is equal. Element KV{null, 2015-07-15T00:00:09.999Z shard-00018-of-00025 0 ON_TIME null
}
Oct 26, 2018 8:22:56 PM org.apache.beam.sdk.nexmark.queries.Query10$3 processElement
INFO: Writing shard-00020-of-00025 with record timestamp 2015-07-15T00:00:09.999Z, window timestamp 2015-07-15T00:00:09.999Z, pane PaneInfo{isFirst=true, isLast=true, timing=ON_TIME, index=0, onTimeIndex=0}
Oct 26, 2018 8:22:56 PM org.apache.beam.sdk.nexmark.queries.Query10$3 processElement
INFO: Writing shard-00015-of-00025 with record timestamp 2015-07-15T00:00:09.999Z, window timestamp 2015-07-15T00:00:09.999Z, pane PaneInfo{isFirst=true, isLast=true, timing=ON_TIME, index=0, onTimeIndex=0}
Oct 26, 2018 8:22:56 PM org.apache.beam.sdk.nexmark.queries.Query10$3 processElement
INFO: Writing shard-00024-of-00025 with record timestamp 2015-07-15T00:00:09.999Z, window timestamp 2015-07-15T00:00:09.999Z, pane PaneInfo{isFirst=true, isLast=true, timing=ON_TIME, index=0, onTimeIndex=0}
Oct 26, 2018 8:22:56 PM org.apache.beam.sdk.util.MutationDetectors$CodedValueMutationDetector verifyUnmodifiedThrowingCheckedExceptions
WARNING: Coder of type class org.apache.beam.sdk.coders.KvCoder has a #structuralValue method which does not return true when the encoding of the elements is equal. Element KV{null, 2015-07-15T00:00:09.999Z shard-00005-of-00025 0 ON_TIME null
}
Oct 26, 2018 8:22:56 PM org.apache.beam.sdk.util.MutationDetectors$CodedValueMutationDetector verifyUnmodifiedThrowingCheckedExceptions
WARNING: Coder of type class org.apache.beam.sdk.coders.KvCoder has a #structuralValue method which does not return true when the encoding of the elements is equal. Element KV{null, 2015-07-15T00:00:09.999Z shard-00002-of-00025 0 ON_TIME null
}
Oct 26, 2018 8:22:56 PM org.apache.beam.sdk.util.MutationDetectors$CodedValueMutationDetector verifyUnmodifiedThrowingCheckedExceptions
WARNING: Coder of type class org.apache.beam.sdk.coders.KvCoder has a #structuralValue method which does not return true when the encoding of the elements is equal. Element KV{null, 2015-07-15T00:00:09.999Z shard-00001-of-00025 0 ON_TIME null
}
Oct 26, 2018 8:22:56 PM org.apache.beam.sdk.util.MutationDetectors$CodedValueMutationDetector verifyUnmodifiedThrowingCheckedExceptions
WARNING: Coder of type class org.apache.beam.sdk.coders.KvCoder has a #structuralValue method which does not return true when the encoding of the elements is equal. Element KV{null, 2015-07-15T00:00:09.999Z shard-00009-of-00025 0 ON_TIME null
}
Oct 26, 2018 8:22:56 PM org.apache.beam.sdk.util.MutationDetectors$CodedValueMutationDetector verifyUnmodifiedThrowingCheckedExceptions
WARNING: Coder of type class org.apache.beam.sdk.coders.KvCoder has a #structuralValue method which does not return true when the encoding of the elements is equal. Element KV{null, 2015-07-15T00:00:09.999Z shard-00020-of-00025 0 ON_TIME null
}
Oct 26, 2018 8:22:56 PM org.apache.beam.sdk.util.MutationDetectors$CodedValueMutationDetector verifyUnmodifiedThrowingCheckedExceptions
WARNING: Coder of type class org.apache.beam.sdk.coders.KvCoder has a #structuralValue method which does not return true when the encoding of the elements is equal. Element KV{null, 2015-07-15T00:00:09.999Z shard-00015-of-00025 0 ON_TIME null
}
Oct 26, 2018 8:22:56 PM org.apache.beam.sdk.util.MutationDetectors$CodedValueMutationDetector verifyUnmodifiedThrowingCheckedExceptions
WARNING: Coder of type class org.apache.beam.sdk.coders.KvCoder has a #structuralValue method which does not return true when the encoding of the elements is equal. Element KV{null, 2015-07-15T00:00:09.999Z shard-00024-of-00025 0 ON_TIME null
}
Oct 26, 2018 8:22:56 PM org.apache.beam.sdk.nexmark.queries.Query10$4 processElement
INFO: Index with record timestamp %s, window timestamp %s, pane %s
Oct 26, 2018 8:22:56 PM org.apache.beam.sdk.util.MutationDetectors$CodedValueMutationDetector verifyUnmodifiedThrowingCheckedExceptions
WARNING: Coder of type class org.apache.beam.sdk.coders.KvCoder has a #structuralValue method which does not return true when the encoding of the elements is equal. Element KV{null, [2015-07-15T00:00:09.999Z shard-00000-of-00025 0 ON_TIME null
, 2015-07-15T00:00:09.999Z shard-00010-of-00025 0 ON_TIME null
, 2015-07-15T00:00:09.999Z shard-00017-of-00025 0 ON_TIME null
, 2015-07-15T00:00:09.999Z shard-00023-of-00025 0 ON_TIME null
, 2015-07-15T00:00:09.999Z shard-00003-of-00025 0 ON_TIME null
, 2015-07-15T00:00:09.999Z shard-00012-of-00025 0 ON_TIME null
, 2015-07-15T00:00:09.999Z shard-00019-of-00025 0 ON_TIME null
, 2015-07-15T00:00:09.999Z shard-00016-of-00025 0 ON_TIME null
, 2015-07-15T00:00:09.999Z shard-00006-of-00025 0 ON_TIME null
, 2015-07-15T00:00:09.999Z shard-00008-of-00025 0 ON_TIME null
, 2015-07-15T00:00:09.999Z shard-00014-of-00025 0 ON_TIME null
, 2015-07-15T00:00:09.999Z shard-00011-of-00025 0 ON_TIME null
, 2015-07-15T00:00:09.999Z shard-00022-of-00025 0 ON_TIME null
, 2015-07-15T00:00:09.999Z shard-00004-of-00025 0 ON_TIME null
, 2015-07-15T00:00:09.999Z shard-00007-of-00025 0 ON_TIME null
, 2015-07-15T00:00:09.999Z shard-00013-of-00025 0 ON_TIME null
, 2015-07-15T00:00:09.999Z shard-00021-of-00025 0 ON_TIME null
, 2015-07-15T00:00:09.999Z shard-00018-of-00025 0 ON_TIME null
, 2015-07-15T00:00:09.999Z shard-00005-of-00025 0 ON_TIME null
, 2015-07-15T00:00:09.999Z shard-00002-of-00025 0 ON_TIME null
, 2015-07-15T00:00:09.999Z shard-00001-of-00025 0 ON_TIME null
, 2015-07-15T00:00:09.999Z shard-00009-of-00025 0 ON_TIME null
, 2015-07-15T00:00:09.999Z shard-00020-of-00025 0 ON_TIME null
, 2015-07-15T00:00:09.999Z shard-00015-of-00025 0 ON_TIME null
, 2015-07-15T00:00:09.999Z shard-00024-of-00025 0 ON_TIME null
]}
Oct 26, 2018 8:22:56 PM org.apache.beam.sdk.util.MutationDetectors$CodedValueMutationDetector verifyUnmodifiedThrowingCheckedExceptions
WARNING: Coder of type class org.apache.beam.sdk.coders.KvCoder has a #structuralValue method which does not return true when the encoding of the elements is equal. Element KV{null, [2015-07-15T00:00:09.999Z shard-00000-of-00025 0 ON_TIME null
, 2015-07-15T00:00:09.999Z shard-00010-of-00025 0 ON_TIME null
, 2015-07-15T00:00:09.999Z shard-00017-of-00025 0 ON_TIME null
, 2015-07-15T00:00:09.999Z shard-00023-of-00025 0 ON_TIME null
, 2015-07-15T00:00:09.999Z shard-00003-of-00025 0 ON_TIME null
, 2015-07-15T00:00:09.999Z shard-00012-of-00025 0 ON_TIME null
, 2015-07-15T00:00:09.999Z shard-00019-of-00025 0 ON_TIME null
, 2015-07-15T00:00:09.999Z shard-00016-of-00025 0 ON_TIME null
, 2015-07-15T00:00:09.999Z shard-00006-of-00025 0 ON_TIME null
, 2015-07-15T00:00:09.999Z shard-00008-of-00025 0 ON_TIME null
, 2015-07-15T00:00:09.999Z shard-00014-of-00025 0 ON_TIME null
, 2015-07-15T00:00:09.999Z shard-00011-of-00025 0 ON_TIME null
, 2015-07-15T00:00:09.999Z shard-00022-of-00025 0 ON_TIME null
, 2015-07-15T00:00:09.999Z shard-00004-of-00025 0 ON_TIME null
, 2015-07-15T00:00:09.999Z shard-00007-of-00025 0 ON_TIME null
, 2015-07-15T00:00:09.999Z shard-00013-of-00025 0 ON_TIME null
, 2015-07-15T00:00:09.999Z shard-00021-of-00025 0 ON_TIME null
, 2015-07-15T00:00:09.999Z shard-00018-of-00025 0 ON_TIME null
, 2015-07-15T00:00:09.999Z shard-00005-of-00025 0 ON_TIME null
, 2015-07-15T00:00:09.999Z shard-00002-of-00025 0 ON_TIME null
, 2015-07-15T00:00:09.999Z shard-00001-of-00025 0 ON_TIME null
, 2015-07-15T00:00:09.999Z shard-00009-of-00025 0 ON_TIME null
, 2015-07-15T00:00:09.999Z shard-00020-of-00025 0 ON_TIME null
, 2015-07-15T00:00:09.999Z shard-00015-of-00025 0 ON_TIME null
, 2015-07-15T00:00:09.999Z shard-00024-of-00025 0 ON_TIME null
]}
2018-10-26T20:22:56.839Z Waiting for main pipeline to 'finish'
2018-10-26T20:22:56.839Z DONE Query10
2018-10-26T20:22:56.840Z Running query:11; exportSummaryToBigQuery:true
2018-10-26T20:22:56.843Z Generating 100000 events in batch mode
2018-10-26T20:22:59.686Z Waiting for main pipeline to 'finish'
2018-10-26T20:22:59.686Z DONE Query11
2018-10-26T20:22:59.686Z Running query:12; exportSummaryToBigQuery:true
2018-10-26T20:22:59.688Z Generating 100000 events in batch mode
2018-10-26T20:23:01.598Z Waiting for main pipeline to 'finish'
2018-10-26T20:23:01.598Z DONE Query12
> Task :beam-sdks-java-nexmark:run FAILED
:beam-sdks-java-nexmark:run (Thread[Task worker for ':' Thread 4,5,main]) completed. Took 1 mins 6.053 secs.
FAILURE: Build failed with an exception.
* What went wrong:
Execution failed for task ':beam-sdks-java-nexmark:run'.
> Process 'command '/usr/local/asfpackages/java/jdk1.8.0_172/bin/java'' finished with non-zero exit value 1
* Try:
Run with --stacktrace option to get the stack trace. Run with --debug option to get more log output. Run with --scan to get full insights.
* Get more help at https://help.gradle.org
Deprecated Gradle features were used in this build, making it incompatible with Gradle 5.0.
Use '--warning-mode all' to show the individual deprecation warnings.
See https://docs.gradle.org/4.10.2/userguide/command_line_interface.html#sec:command_line_warnings
BUILD FAILED in 3m 59s
65 actionable tasks: 61 executed, 4 from cache
Publishing build scan...
https://gradle.com/s/2vfp436dhpsve
Build step 'Invoke Gradle script' changed build result to FAILURE
Build step 'Invoke Gradle script' marked build as failure
---------------------------------------------------------------------
To unsubscribe, e-mail: builds-unsubscribe@beam.apache.org
For additional commands, e-mail: builds-help@beam.apache.org
Jenkins build is back to normal :
beam_PostCommit_Java_Nexmark_Direct #952
Posted by Apache Jenkins Server <je...@builds.apache.org>.
See <https://builds.apache.org/job/beam_PostCommit_Java_Nexmark_Direct/952/display/redirect>
---------------------------------------------------------------------
To unsubscribe, e-mail: builds-unsubscribe@beam.apache.org
For additional commands, e-mail: builds-help@beam.apache.org
Build failed in Jenkins: beam_PostCommit_Java_Nexmark_Direct #951
Posted by Apache Jenkins Server <je...@builds.apache.org>.
See <https://builds.apache.org/job/beam_PostCommit_Java_Nexmark_Direct/951/display/redirect>
------------------------------------------
Started by user kenn
[EnvInject] - Loading node environment variables.
Building remotely on beam16 (beam-perf) in workspace <https://builds.apache.org/job/beam_PostCommit_Java_Nexmark_Direct/ws/>
> git rev-parse --is-inside-work-tree # timeout=10
Fetching changes from the remote Git repository
> git config remote.origin.url https://github.com/apache/beam.git # timeout=10
Fetching upstream changes from https://github.com/apache/beam.git
> git --version # timeout=10
> git fetch --tags --progress https://github.com/apache/beam.git +refs/heads/*:refs/remotes/origin/* +refs/pr/*/head:refs/remotes/origin/pr/*/head
> git rev-parse refs/remotes/origin/pr/6858/head^{commit} # timeout=10
> git rev-parse refs/remotes/origin/origin/pr/6858/head^{commit} # timeout=10
> git rev-parse origin/pr/6858/head^{commit} # timeout=10
ERROR: Couldn't find any revision to build. Verify the repository and branch configuration for this job.
Retrying after 10 seconds
> git rev-parse --is-inside-work-tree # timeout=10
Fetching changes from the remote Git repository
> git config remote.origin.url https://github.com/apache/beam.git # timeout=10
Fetching upstream changes from https://github.com/apache/beam.git
> git --version # timeout=10
> git fetch --tags --progress https://github.com/apache/beam.git +refs/heads/*:refs/remotes/origin/* +refs/pr/*/head:refs/remotes/origin/pr/*/head
> git rev-parse refs/remotes/origin/pr/6858/head^{commit} # timeout=10
> git rev-parse refs/remotes/origin/origin/pr/6858/head^{commit} # timeout=10
> git rev-parse origin/pr/6858/head^{commit} # timeout=10
ERROR: Couldn't find any revision to build. Verify the repository and branch configuration for this job.
Retrying after 10 seconds
> git rev-parse --is-inside-work-tree # timeout=10
Fetching changes from the remote Git repository
> git config remote.origin.url https://github.com/apache/beam.git # timeout=10
Fetching upstream changes from https://github.com/apache/beam.git
> git --version # timeout=10
> git fetch --tags --progress https://github.com/apache/beam.git +refs/heads/*:refs/remotes/origin/* +refs/pr/*/head:refs/remotes/origin/pr/*/head
> git rev-parse refs/remotes/origin/pr/6858/head^{commit} # timeout=10
> git rev-parse refs/remotes/origin/origin/pr/6858/head^{commit} # timeout=10
> git rev-parse origin/pr/6858/head^{commit} # timeout=10
ERROR: Couldn't find any revision to build. Verify the repository and branch configuration for this job.
---------------------------------------------------------------------
To unsubscribe, e-mail: builds-unsubscribe@beam.apache.org
For additional commands, e-mail: builds-help@beam.apache.org
Build failed in Jenkins: beam_PostCommit_Java_Nexmark_Direct #950
Posted by Apache Jenkins Server <je...@builds.apache.org>.
See <https://builds.apache.org/job/beam_PostCommit_Java_Nexmark_Direct/950/display/redirect>
------------------------------------------
Started by user kenn
[EnvInject] - Loading node environment variables.
Building remotely on beam16 (beam-perf) in workspace <https://builds.apache.org/job/beam_PostCommit_Java_Nexmark_Direct/ws/>
> git rev-parse --is-inside-work-tree # timeout=10
Fetching changes from the remote Git repository
> git config remote.origin.url https://github.com/apache/beam.git # timeout=10
Fetching upstream changes from https://github.com/apache/beam.git
> git --version # timeout=10
> git fetch --tags --progress https://github.com/apache/beam.git +refs/heads/*:refs/remotes/origin/* +refs/pull/${ghprbPullId}/*:refs/remotes/origin/pr/${ghprbPullId}/*
> git rev-parse refs/remotes/origin/pr/6858/head^{commit} # timeout=10
> git rev-parse refs/remotes/origin/origin/pr/6858/head^{commit} # timeout=10
> git rev-parse origin/pr/6858/head^{commit} # timeout=10
ERROR: Couldn't find any revision to build. Verify the repository and branch configuration for this job.
Retrying after 10 seconds
> git rev-parse --is-inside-work-tree # timeout=10
Fetching changes from the remote Git repository
> git config remote.origin.url https://github.com/apache/beam.git # timeout=10
Fetching upstream changes from https://github.com/apache/beam.git
> git --version # timeout=10
> git fetch --tags --progress https://github.com/apache/beam.git +refs/heads/*:refs/remotes/origin/* +refs/pull/${ghprbPullId}/*:refs/remotes/origin/pr/${ghprbPullId}/*
> git rev-parse refs/remotes/origin/pr/6858/head^{commit} # timeout=10
> git rev-parse refs/remotes/origin/origin/pr/6858/head^{commit} # timeout=10
> git rev-parse origin/pr/6858/head^{commit} # timeout=10
ERROR: Couldn't find any revision to build. Verify the repository and branch configuration for this job.
Retrying after 10 seconds
> git rev-parse --is-inside-work-tree # timeout=10
Fetching changes from the remote Git repository
> git config remote.origin.url https://github.com/apache/beam.git # timeout=10
Fetching upstream changes from https://github.com/apache/beam.git
> git --version # timeout=10
> git fetch --tags --progress https://github.com/apache/beam.git +refs/heads/*:refs/remotes/origin/* +refs/pull/${ghprbPullId}/*:refs/remotes/origin/pr/${ghprbPullId}/*
> git rev-parse refs/remotes/origin/pr/6858/head^{commit} # timeout=10
> git rev-parse refs/remotes/origin/origin/pr/6858/head^{commit} # timeout=10
> git rev-parse origin/pr/6858/head^{commit} # timeout=10
ERROR: Couldn't find any revision to build. Verify the repository and branch configuration for this job.
---------------------------------------------------------------------
To unsubscribe, e-mail: builds-unsubscribe@beam.apache.org
For additional commands, e-mail: builds-help@beam.apache.org
Build failed in Jenkins: beam_PostCommit_Java_Nexmark_Direct #949
Posted by Apache Jenkins Server <je...@builds.apache.org>.
See <https://builds.apache.org/job/beam_PostCommit_Java_Nexmark_Direct/949/display/redirect?page=changes>
Changes:
[amaliujia] Test NULL in Pubsub JSON format for SQL read.
------------------------------------------
[...truncated 191.41 KB...]
INFO: shard-00014-of-00025 with timestamp 2015-07-15T00:00:09.999Z has 0 actually late and 4134 on-time elements in pane PaneInfo{isFirst=true, isLast=true, timing=ON_TIME, index=0, onTimeIndex=0} for window 2015-07-15T00:00:09.999Z
Oct 27, 2018 3:20:25 AM org.apache.beam.sdk.nexmark.queries.Query10$2 processElement
INFO: shard-00022-of-00025 with timestamp 2015-07-15T00:00:09.999Z has 0 actually late and 4066 on-time elements in pane PaneInfo{isFirst=true, isLast=true, timing=ON_TIME, index=0, onTimeIndex=0} for window 2015-07-15T00:00:09.999Z
Oct 27, 2018 3:20:25 AM org.apache.beam.sdk.nexmark.queries.Query10$2 processElement
INFO: shard-00016-of-00025 with timestamp 2015-07-15T00:00:09.999Z has 0 actually late and 4018 on-time elements in pane PaneInfo{isFirst=true, isLast=true, timing=ON_TIME, index=0, onTimeIndex=0} for window 2015-07-15T00:00:09.999Z
Oct 27, 2018 3:20:25 AM org.apache.beam.sdk.nexmark.queries.Query10$2 processElement
INFO: shard-00023-of-00025 with timestamp 2015-07-15T00:00:09.999Z has 0 actually late and 3900 on-time elements in pane PaneInfo{isFirst=true, isLast=true, timing=ON_TIME, index=0, onTimeIndex=0} for window 2015-07-15T00:00:09.999Z
Oct 27, 2018 3:20:25 AM org.apache.beam.sdk.nexmark.queries.Query10$2 processElement
INFO: shard-00004-of-00025 with timestamp 2015-07-15T00:00:09.999Z has 0 actually late and 3985 on-time elements in pane PaneInfo{isFirst=true, isLast=true, timing=ON_TIME, index=0, onTimeIndex=0} for window 2015-07-15T00:00:09.999Z
Oct 27, 2018 3:20:25 AM org.apache.beam.sdk.nexmark.queries.Query10$2 processElement
INFO: shard-00017-of-00025 with timestamp 2015-07-15T00:00:09.999Z has 0 actually late and 3958 on-time elements in pane PaneInfo{isFirst=true, isLast=true, timing=ON_TIME, index=0, onTimeIndex=0} for window 2015-07-15T00:00:09.999Z
Oct 27, 2018 3:20:25 AM org.apache.beam.sdk.nexmark.queries.Query10$2 processElement
INFO: shard-00013-of-00025 with timestamp 2015-07-15T00:00:09.999Z has 0 actually late and 3940 on-time elements in pane PaneInfo{isFirst=true, isLast=true, timing=ON_TIME, index=0, onTimeIndex=0} for window 2015-07-15T00:00:09.999Z
Oct 27, 2018 3:20:25 AM org.apache.beam.sdk.nexmark.queries.Query10$2 processElement
INFO: shard-00020-of-00025 with timestamp 2015-07-15T00:00:09.999Z has 0 actually late and 4021 on-time elements in pane PaneInfo{isFirst=true, isLast=true, timing=ON_TIME, index=0, onTimeIndex=0} for window 2015-07-15T00:00:09.999Z
Oct 27, 2018 3:20:25 AM org.apache.beam.sdk.nexmark.queries.Query10$2 processElement
INFO: shard-00021-of-00025 with timestamp 2015-07-15T00:00:09.999Z has 0 actually late and 3969 on-time elements in pane PaneInfo{isFirst=true, isLast=true, timing=ON_TIME, index=0, onTimeIndex=0} for window 2015-07-15T00:00:09.999Z
Oct 27, 2018 3:20:25 AM org.apache.beam.sdk.nexmark.queries.Query10$2 processElement
INFO: shard-00015-of-00025 with timestamp 2015-07-15T00:00:09.999Z has 0 actually late and 4041 on-time elements in pane PaneInfo{isFirst=true, isLast=true, timing=ON_TIME, index=0, onTimeIndex=0} for window 2015-07-15T00:00:09.999Z
Oct 27, 2018 3:20:25 AM org.apache.beam.sdk.nexmark.queries.Query10$2 processElement
INFO: shard-00002-of-00025 with timestamp 2015-07-15T00:00:09.999Z has 0 actually late and 4002 on-time elements in pane PaneInfo{isFirst=true, isLast=true, timing=ON_TIME, index=0, onTimeIndex=0} for window 2015-07-15T00:00:09.999Z
Oct 27, 2018 3:20:25 AM org.apache.beam.sdk.nexmark.queries.Query10$2 processElement
INFO: shard-00018-of-00025 with timestamp 2015-07-15T00:00:09.999Z has 0 actually late and 3987 on-time elements in pane PaneInfo{isFirst=true, isLast=true, timing=ON_TIME, index=0, onTimeIndex=0} for window 2015-07-15T00:00:09.999Z
Oct 27, 2018 3:20:25 AM org.apache.beam.sdk.nexmark.queries.Query10$2 processElement
INFO: shard-00005-of-00025 with timestamp 2015-07-15T00:00:09.999Z has 0 actually late and 4060 on-time elements in pane PaneInfo{isFirst=true, isLast=true, timing=ON_TIME, index=0, onTimeIndex=0} for window 2015-07-15T00:00:09.999Z
Oct 27, 2018 3:20:25 AM org.apache.beam.sdk.nexmark.queries.Query10$2 processElement
INFO: shard-00009-of-00025 with timestamp 2015-07-15T00:00:09.999Z has 0 actually late and 4056 on-time elements in pane PaneInfo{isFirst=true, isLast=true, timing=ON_TIME, index=0, onTimeIndex=0} for window 2015-07-15T00:00:09.999Z
Oct 27, 2018 3:20:25 AM org.apache.beam.sdk.nexmark.queries.Query10$2 processElement
INFO: shard-00001-of-00025 with timestamp 2015-07-15T00:00:09.999Z has 0 actually late and 3953 on-time elements in pane PaneInfo{isFirst=true, isLast=true, timing=ON_TIME, index=0, onTimeIndex=0} for window 2015-07-15T00:00:09.999Z
Oct 27, 2018 3:20:25 AM org.apache.beam.sdk.nexmark.queries.Query10$3 processElement
INFO: Writing shard-00000-of-00025 with record timestamp 2015-07-15T00:00:09.999Z, window timestamp 2015-07-15T00:00:09.999Z, pane PaneInfo{isFirst=true, isLast=true, timing=ON_TIME, index=0, onTimeIndex=0}
Oct 27, 2018 3:20:25 AM org.apache.beam.sdk.nexmark.queries.Query10$3 processElement
INFO: Writing shard-00003-of-00025 with record timestamp 2015-07-15T00:00:09.999Z, window timestamp 2015-07-15T00:00:09.999Z, pane PaneInfo{isFirst=true, isLast=true, timing=ON_TIME, index=0, onTimeIndex=0}
Oct 27, 2018 3:20:25 AM org.apache.beam.sdk.nexmark.queries.Query10$2 processElement
INFO: shard-00024-of-00025 with timestamp 2015-07-15T00:00:09.999Z has 0 actually late and 4127 on-time elements in pane PaneInfo{isFirst=true, isLast=true, timing=ON_TIME, index=0, onTimeIndex=0} for window 2015-07-15T00:00:09.999Z
Oct 27, 2018 3:20:25 AM org.apache.beam.sdk.nexmark.queries.Query10$3 processElement
INFO: Writing shard-00010-of-00025 with record timestamp 2015-07-15T00:00:09.999Z, window timestamp 2015-07-15T00:00:09.999Z, pane PaneInfo{isFirst=true, isLast=true, timing=ON_TIME, index=0, onTimeIndex=0}
Oct 27, 2018 3:20:25 AM org.apache.beam.sdk.nexmark.queries.Query10$3 processElement
INFO: Writing shard-00011-of-00025 with record timestamp 2015-07-15T00:00:09.999Z, window timestamp 2015-07-15T00:00:09.999Z, pane PaneInfo{isFirst=true, isLast=true, timing=ON_TIME, index=0, onTimeIndex=0}
Oct 27, 2018 3:20:25 AM org.apache.beam.sdk.nexmark.queries.Query10$3 processElement
INFO: Writing shard-00023-of-00025 with record timestamp 2015-07-15T00:00:09.999Z, window timestamp 2015-07-15T00:00:09.999Z, pane PaneInfo{isFirst=true, isLast=true, timing=ON_TIME, index=0, onTimeIndex=0}
Oct 27, 2018 3:20:25 AM org.apache.beam.sdk.nexmark.queries.Query10$3 processElement
INFO: Writing shard-00012-of-00025 with record timestamp 2015-07-15T00:00:09.999Z, window timestamp 2015-07-15T00:00:09.999Z, pane PaneInfo{isFirst=true, isLast=true, timing=ON_TIME, index=0, onTimeIndex=0}
Oct 27, 2018 3:20:25 AM org.apache.beam.sdk.util.MutationDetectors$CodedValueMutationDetector verifyUnmodifiedThrowingCheckedExceptions
WARNING: Coder of type class org.apache.beam.sdk.coders.KvCoder has a #structuralValue method which does not return true when the encoding of the elements is equal. Element KV{null, 2015-07-15T00:00:09.999Z shard-00003-of-00025 0 ON_TIME null
}
Oct 27, 2018 3:20:25 AM org.apache.beam.sdk.util.MutationDetectors$CodedValueMutationDetector verifyUnmodifiedThrowingCheckedExceptions
WARNING: Coder of type class org.apache.beam.sdk.coders.KvCoder has a #structuralValue method which does not return true when the encoding of the elements is equal. Element KV{null, 2015-07-15T00:00:09.999Z shard-00010-of-00025 0 ON_TIME null
}
Oct 27, 2018 3:20:25 AM org.apache.beam.sdk.util.MutationDetectors$CodedValueMutationDetector verifyUnmodifiedThrowingCheckedExceptions
WARNING: Coder of type class org.apache.beam.sdk.coders.KvCoder has a #structuralValue method which does not return true when the encoding of the elements is equal. Element KV{null, 2015-07-15T00:00:09.999Z shard-00011-of-00025 0 ON_TIME null
}
Oct 27, 2018 3:20:25 AM org.apache.beam.sdk.util.MutationDetectors$CodedValueMutationDetector verifyUnmodifiedThrowingCheckedExceptions
WARNING: Coder of type class org.apache.beam.sdk.coders.KvCoder has a #structuralValue method which does not return true when the encoding of the elements is equal. Element KV{null, 2015-07-15T00:00:09.999Z shard-00012-of-00025 0 ON_TIME null
}
Oct 27, 2018 3:20:25 AM org.apache.beam.sdk.util.MutationDetectors$CodedValueMutationDetector verifyUnmodifiedThrowingCheckedExceptions
WARNING: Coder of type class org.apache.beam.sdk.coders.KvCoder has a #structuralValue method which does not return true when the encoding of the elements is equal. Element KV{null, 2015-07-15T00:00:09.999Z shard-00023-of-00025 0 ON_TIME null
}
Oct 27, 2018 3:20:25 AM org.apache.beam.sdk.nexmark.queries.Query10$3 processElement
INFO: Writing shard-00016-of-00025 with record timestamp 2015-07-15T00:00:09.999Z, window timestamp 2015-07-15T00:00:09.999Z, pane PaneInfo{isFirst=true, isLast=true, timing=ON_TIME, index=0, onTimeIndex=0}
Oct 27, 2018 3:20:25 AM org.apache.beam.sdk.nexmark.queries.Query10$3 processElement
INFO: Writing shard-00006-of-00025 with record timestamp 2015-07-15T00:00:09.999Z, window timestamp 2015-07-15T00:00:09.999Z, pane PaneInfo{isFirst=true, isLast=true, timing=ON_TIME, index=0, onTimeIndex=0}
Oct 27, 2018 3:20:25 AM org.apache.beam.sdk.nexmark.queries.Query10$3 processElement
INFO: Writing shard-00007-of-00025 with record timestamp 2015-07-15T00:00:09.999Z, window timestamp 2015-07-15T00:00:09.999Z, pane PaneInfo{isFirst=true, isLast=true, timing=ON_TIME, index=0, onTimeIndex=0}
Oct 27, 2018 3:20:25 AM org.apache.beam.sdk.nexmark.queries.Query10$3 processElement
INFO: Writing shard-00014-of-00025 with record timestamp 2015-07-15T00:00:09.999Z, window timestamp 2015-07-15T00:00:09.999Z, pane PaneInfo{isFirst=true, isLast=true, timing=ON_TIME, index=0, onTimeIndex=0}
Oct 27, 2018 3:20:25 AM org.apache.beam.sdk.util.MutationDetectors$CodedValueMutationDetector verifyUnmodifiedThrowingCheckedExceptions
WARNING: Coder of type class org.apache.beam.sdk.coders.KvCoder has a #structuralValue method which does not return true when the encoding of the elements is equal. Element KV{null, 2015-07-15T00:00:09.999Z shard-00006-of-00025 0 ON_TIME null
}
Oct 27, 2018 3:20:25 AM org.apache.beam.sdk.nexmark.queries.Query10$3 processElement
INFO: Writing shard-00004-of-00025 with record timestamp 2015-07-15T00:00:09.999Z, window timestamp 2015-07-15T00:00:09.999Z, pane PaneInfo{isFirst=true, isLast=true, timing=ON_TIME, index=0, onTimeIndex=0}
Oct 27, 2018 3:20:25 AM org.apache.beam.sdk.util.MutationDetectors$CodedValueMutationDetector verifyUnmodifiedThrowingCheckedExceptions
WARNING: Coder of type class org.apache.beam.sdk.coders.KvCoder has a #structuralValue method which does not return true when the encoding of the elements is equal. Element KV{null, 2015-07-15T00:00:09.999Z shard-00014-of-00025 0 ON_TIME null
}
Oct 27, 2018 3:20:25 AM org.apache.beam.sdk.util.MutationDetectors$CodedValueMutationDetector verifyUnmodifiedThrowingCheckedExceptions
WARNING: Coder of type class org.apache.beam.sdk.coders.KvCoder has a #structuralValue method which does not return true when the encoding of the elements is equal. Element KV{null, 2015-07-15T00:00:09.999Z shard-00007-of-00025 0 ON_TIME null
}
Oct 27, 2018 3:20:25 AM org.apache.beam.sdk.nexmark.queries.Query10$3 processElement
INFO: Writing shard-00022-of-00025 with record timestamp 2015-07-15T00:00:09.999Z, window timestamp 2015-07-15T00:00:09.999Z, pane PaneInfo{isFirst=true, isLast=true, timing=ON_TIME, index=0, onTimeIndex=0}
Oct 27, 2018 3:20:25 AM org.apache.beam.sdk.nexmark.queries.Query10$3 processElement
INFO: Writing shard-00017-of-00025 with record timestamp 2015-07-15T00:00:09.999Z, window timestamp 2015-07-15T00:00:09.999Z, pane PaneInfo{isFirst=true, isLast=true, timing=ON_TIME, index=0, onTimeIndex=0}
Oct 27, 2018 3:20:25 AM org.apache.beam.sdk.util.MutationDetectors$CodedValueMutationDetector verifyUnmodifiedThrowingCheckedExceptions
WARNING: Coder of type class org.apache.beam.sdk.coders.KvCoder has a #structuralValue method which does not return true when the encoding of the elements is equal. Element KV{null, 2015-07-15T00:00:09.999Z shard-00016-of-00025 0 ON_TIME null
}
Oct 27, 2018 3:20:25 AM org.apache.beam.sdk.util.MutationDetectors$CodedValueMutationDetector verifyUnmodifiedThrowingCheckedExceptions
WARNING: Coder of type class org.apache.beam.sdk.coders.KvCoder has a #structuralValue method which does not return true when the encoding of the elements is equal. Element KV{null, 2015-07-15T00:00:09.999Z shard-00004-of-00025 0 ON_TIME null
}
Oct 27, 2018 3:20:25 AM org.apache.beam.sdk.nexmark.queries.Query10$3 processElement
INFO: Writing shard-00013-of-00025 with record timestamp 2015-07-15T00:00:09.999Z, window timestamp 2015-07-15T00:00:09.999Z, pane PaneInfo{isFirst=true, isLast=true, timing=ON_TIME, index=0, onTimeIndex=0}
Oct 27, 2018 3:20:25 AM org.apache.beam.sdk.util.MutationDetectors$CodedValueMutationDetector verifyUnmodifiedThrowingCheckedExceptions
WARNING: Coder of type class org.apache.beam.sdk.coders.KvCoder has a #structuralValue method which does not return true when the encoding of the elements is equal. Element KV{null, 2015-07-15T00:00:09.999Z shard-00017-of-00025 0 ON_TIME null
}
Oct 27, 2018 3:20:25 AM org.apache.beam.sdk.nexmark.queries.Query10$3 processElement
INFO: Writing shard-00019-of-00025 with record timestamp 2015-07-15T00:00:09.999Z, window timestamp 2015-07-15T00:00:09.999Z, pane PaneInfo{isFirst=true, isLast=true, timing=ON_TIME, index=0, onTimeIndex=0}
Oct 27, 2018 3:20:25 AM org.apache.beam.sdk.nexmark.queries.Query10$3 processElement
INFO: Writing shard-00008-of-00025 with record timestamp 2015-07-15T00:00:09.999Z, window timestamp 2015-07-15T00:00:09.999Z, pane PaneInfo{isFirst=true, isLast=true, timing=ON_TIME, index=0, onTimeIndex=0}
Oct 27, 2018 3:20:25 AM org.apache.beam.sdk.util.MutationDetectors$CodedValueMutationDetector verifyUnmodifiedThrowingCheckedExceptions
WARNING: Coder of type class org.apache.beam.sdk.coders.KvCoder has a #structuralValue method which does not return true when the encoding of the elements is equal. Element KV{null, 2015-07-15T00:00:09.999Z shard-00022-of-00025 0 ON_TIME null
}
Oct 27, 2018 3:20:25 AM org.apache.beam.sdk.nexmark.queries.Query10$3 processElement
INFO: Writing shard-00020-of-00025 with record timestamp 2015-07-15T00:00:09.999Z, window timestamp 2015-07-15T00:00:09.999Z, pane PaneInfo{isFirst=true, isLast=true, timing=ON_TIME, index=0, onTimeIndex=0}
Oct 27, 2018 3:20:25 AM org.apache.beam.sdk.nexmark.queries.Query10$3 processElement
INFO: Writing shard-00002-of-00025 with record timestamp 2015-07-15T00:00:09.999Z, window timestamp 2015-07-15T00:00:09.999Z, pane PaneInfo{isFirst=true, isLast=true, timing=ON_TIME, index=0, onTimeIndex=0}
Oct 27, 2018 3:20:25 AM org.apache.beam.sdk.nexmark.queries.Query10$3 processElement
INFO: Writing shard-00018-of-00025 with record timestamp 2015-07-15T00:00:09.999Z, window timestamp 2015-07-15T00:00:09.999Z, pane PaneInfo{isFirst=true, isLast=true, timing=ON_TIME, index=0, onTimeIndex=0}
Oct 27, 2018 3:20:25 AM org.apache.beam.sdk.nexmark.queries.Query10$3 processElement
INFO: Writing shard-00015-of-00025 with record timestamp 2015-07-15T00:00:09.999Z, window timestamp 2015-07-15T00:00:09.999Z, pane PaneInfo{isFirst=true, isLast=true, timing=ON_TIME, index=0, onTimeIndex=0}
Oct 27, 2018 3:20:25 AM org.apache.beam.sdk.util.MutationDetectors$CodedValueMutationDetector verifyUnmodifiedThrowingCheckedExceptions
WARNING: Coder of type class org.apache.beam.sdk.coders.KvCoder has a #structuralValue method which does not return true when the encoding of the elements is equal. Element KV{null, 2015-07-15T00:00:09.999Z shard-00000-of-00025 0 ON_TIME null
}
Oct 27, 2018 3:20:25 AM org.apache.beam.sdk.util.MutationDetectors$CodedValueMutationDetector verifyUnmodifiedThrowingCheckedExceptions
WARNING: Coder of type class org.apache.beam.sdk.coders.KvCoder has a #structuralValue method which does not return true when the encoding of the elements is equal. Element KV{null, 2015-07-15T00:00:09.999Z shard-00013-of-00025 0 ON_TIME null
}
Oct 27, 2018 3:20:25 AM org.apache.beam.sdk.util.MutationDetectors$CodedValueMutationDetector verifyUnmodifiedThrowingCheckedExceptions
WARNING: Coder of type class org.apache.beam.sdk.coders.KvCoder has a #structuralValue method which does not return true when the encoding of the elements is equal. Element KV{null, 2015-07-15T00:00:09.999Z shard-00002-of-00025 0 ON_TIME null
}
Oct 27, 2018 3:20:25 AM org.apache.beam.sdk.util.MutationDetectors$CodedValueMutationDetector verifyUnmodifiedThrowingCheckedExceptions
WARNING: Coder of type class org.apache.beam.sdk.coders.KvCoder has a #structuralValue method which does not return true when the encoding of the elements is equal. Element KV{null, 2015-07-15T00:00:09.999Z shard-00020-of-00025 0 ON_TIME null
}
Oct 27, 2018 3:20:25 AM org.apache.beam.sdk.nexmark.queries.Query10$3 processElement
INFO: Writing shard-00009-of-00025 with record timestamp 2015-07-15T00:00:09.999Z, window timestamp 2015-07-15T00:00:09.999Z, pane PaneInfo{isFirst=true, isLast=true, timing=ON_TIME, index=0, onTimeIndex=0}
Oct 27, 2018 3:20:25 AM org.apache.beam.sdk.util.MutationDetectors$CodedValueMutationDetector verifyUnmodifiedThrowingCheckedExceptions
WARNING: Coder of type class org.apache.beam.sdk.coders.KvCoder has a #structuralValue method which does not return true when the encoding of the elements is equal. Element KV{null, 2015-07-15T00:00:09.999Z shard-00008-of-00025 0 ON_TIME null
}
Oct 27, 2018 3:20:25 AM org.apache.beam.sdk.nexmark.queries.Query10$3 processElement
INFO: Writing shard-00021-of-00025 with record timestamp 2015-07-15T00:00:09.999Z, window timestamp 2015-07-15T00:00:09.999Z, pane PaneInfo{isFirst=true, isLast=true, timing=ON_TIME, index=0, onTimeIndex=0}
Oct 27, 2018 3:20:25 AM org.apache.beam.sdk.util.MutationDetectors$CodedValueMutationDetector verifyUnmodifiedThrowingCheckedExceptions
WARNING: Coder of type class org.apache.beam.sdk.coders.KvCoder has a #structuralValue method which does not return true when the encoding of the elements is equal. Element KV{null, 2015-07-15T00:00:09.999Z shard-00015-of-00025 0 ON_TIME null
}
Oct 27, 2018 3:20:25 AM org.apache.beam.sdk.nexmark.queries.Query10$3 processElement
INFO: Writing shard-00005-of-00025 with record timestamp 2015-07-15T00:00:09.999Z, window timestamp 2015-07-15T00:00:09.999Z, pane PaneInfo{isFirst=true, isLast=true, timing=ON_TIME, index=0, onTimeIndex=0}
Oct 27, 2018 3:20:25 AM org.apache.beam.sdk.util.MutationDetectors$CodedValueMutationDetector verifyUnmodifiedThrowingCheckedExceptions
WARNING: Coder of type class org.apache.beam.sdk.coders.KvCoder has a #structuralValue method which does not return true when the encoding of the elements is equal. Element KV{null, 2015-07-15T00:00:09.999Z shard-00019-of-00025 0 ON_TIME null
}
Oct 27, 2018 3:20:25 AM org.apache.beam.sdk.nexmark.queries.Query10$3 processElement
INFO: Writing shard-00024-of-00025 with record timestamp 2015-07-15T00:00:09.999Z, window timestamp 2015-07-15T00:00:09.999Z, pane PaneInfo{isFirst=true, isLast=true, timing=ON_TIME, index=0, onTimeIndex=0}
Oct 27, 2018 3:20:25 AM org.apache.beam.sdk.util.MutationDetectors$CodedValueMutationDetector verifyUnmodifiedThrowingCheckedExceptions
WARNING: Coder of type class org.apache.beam.sdk.coders.KvCoder has a #structuralValue method which does not return true when the encoding of the elements is equal. Element KV{null, 2015-07-15T00:00:09.999Z shard-00009-of-00025 0 ON_TIME null
}
Oct 27, 2018 3:20:25 AM org.apache.beam.sdk.util.MutationDetectors$CodedValueMutationDetector verifyUnmodifiedThrowingCheckedExceptions
WARNING: Coder of type class org.apache.beam.sdk.coders.KvCoder has a #structuralValue method which does not return true when the encoding of the elements is equal. Element KV{null, 2015-07-15T00:00:09.999Z shard-00018-of-00025 0 ON_TIME null
}
Oct 27, 2018 3:20:25 AM org.apache.beam.sdk.nexmark.queries.Query10$3 processElement
INFO: Writing shard-00001-of-00025 with record timestamp 2015-07-15T00:00:09.999Z, window timestamp 2015-07-15T00:00:09.999Z, pane PaneInfo{isFirst=true, isLast=true, timing=ON_TIME, index=0, onTimeIndex=0}
Oct 27, 2018 3:20:25 AM org.apache.beam.sdk.util.MutationDetectors$CodedValueMutationDetector verifyUnmodifiedThrowingCheckedExceptions
WARNING: Coder of type class org.apache.beam.sdk.coders.KvCoder has a #structuralValue method which does not return true when the encoding of the elements is equal. Element KV{null, 2015-07-15T00:00:09.999Z shard-00021-of-00025 0 ON_TIME null
}
Oct 27, 2018 3:20:25 AM org.apache.beam.sdk.util.MutationDetectors$CodedValueMutationDetector verifyUnmodifiedThrowingCheckedExceptions
WARNING: Coder of type class org.apache.beam.sdk.coders.KvCoder has a #structuralValue method which does not return true when the encoding of the elements is equal. Element KV{null, 2015-07-15T00:00:09.999Z shard-00005-of-00025 0 ON_TIME null
}
Oct 27, 2018 3:20:25 AM org.apache.beam.sdk.util.MutationDetectors$CodedValueMutationDetector verifyUnmodifiedThrowingCheckedExceptions
WARNING: Coder of type class org.apache.beam.sdk.coders.KvCoder has a #structuralValue method which does not return true when the encoding of the elements is equal. Element KV{null, 2015-07-15T00:00:09.999Z shard-00024-of-00025 0 ON_TIME null
}
Oct 27, 2018 3:20:25 AM org.apache.beam.sdk.util.MutationDetectors$CodedValueMutationDetector verifyUnmodifiedThrowingCheckedExceptions
WARNING: Coder of type class org.apache.beam.sdk.coders.KvCoder has a #structuralValue method which does not return true when the encoding of the elements is equal. Element KV{null, 2015-07-15T00:00:09.999Z shard-00001-of-00025 0 ON_TIME null
}
Oct 27, 2018 3:20:25 AM org.apache.beam.sdk.nexmark.queries.Query10$4 processElement
INFO: Index with record timestamp %s, window timestamp %s, pane %s
Oct 27, 2018 3:20:25 AM org.apache.beam.sdk.util.MutationDetectors$CodedValueMutationDetector verifyUnmodifiedThrowingCheckedExceptions
WARNING: Coder of type class org.apache.beam.sdk.coders.KvCoder has a #structuralValue method which does not return true when the encoding of the elements is equal. Element KV{null, [2015-07-15T00:00:09.999Z shard-00003-of-00025 0 ON_TIME null
, 2015-07-15T00:00:09.999Z shard-00010-of-00025 0 ON_TIME null
, 2015-07-15T00:00:09.999Z shard-00011-of-00025 0 ON_TIME null
, 2015-07-15T00:00:09.999Z shard-00012-of-00025 0 ON_TIME null
, 2015-07-15T00:00:09.999Z shard-00023-of-00025 0 ON_TIME null
, 2015-07-15T00:00:09.999Z shard-00006-of-00025 0 ON_TIME null
, 2015-07-15T00:00:09.999Z shard-00014-of-00025 0 ON_TIME null
, 2015-07-15T00:00:09.999Z shard-00016-of-00025 0 ON_TIME null
, 2015-07-15T00:00:09.999Z shard-00007-of-00025 0 ON_TIME null
, 2015-07-15T00:00:09.999Z shard-00004-of-00025 0 ON_TIME null
, 2015-07-15T00:00:09.999Z shard-00017-of-00025 0 ON_TIME null
, 2015-07-15T00:00:09.999Z shard-00022-of-00025 0 ON_TIME null
, 2015-07-15T00:00:09.999Z shard-00000-of-00025 0 ON_TIME null
, 2015-07-15T00:00:09.999Z shard-00013-of-00025 0 ON_TIME null
, 2015-07-15T00:00:09.999Z shard-00002-of-00025 0 ON_TIME null
, 2015-07-15T00:00:09.999Z shard-00020-of-00025 0 ON_TIME null
, 2015-07-15T00:00:09.999Z shard-00008-of-00025 0 ON_TIME null
, 2015-07-15T00:00:09.999Z shard-00015-of-00025 0 ON_TIME null
, 2015-07-15T00:00:09.999Z shard-00019-of-00025 0 ON_TIME null
, 2015-07-15T00:00:09.999Z shard-00009-of-00025 0 ON_TIME null
, 2015-07-15T00:00:09.999Z shard-00018-of-00025 0 ON_TIME null
, 2015-07-15T00:00:09.999Z shard-00021-of-00025 0 ON_TIME null
, 2015-07-15T00:00:09.999Z shard-00005-of-00025 0 ON_TIME null
, 2015-07-15T00:00:09.999Z shard-00024-of-00025 0 ON_TIME null
, 2015-07-15T00:00:09.999Z shard-00001-of-00025 0 ON_TIME null
]}
Oct 27, 2018 3:20:25 AM org.apache.beam.sdk.util.MutationDetectors$CodedValueMutationDetector verifyUnmodifiedThrowingCheckedExceptions
WARNING: Coder of type class org.apache.beam.sdk.coders.KvCoder has a #structuralValue method which does not return true when the encoding of the elements is equal. Element KV{null, [2015-07-15T00:00:09.999Z shard-00003-of-00025 0 ON_TIME null
, 2015-07-15T00:00:09.999Z shard-00010-of-00025 0 ON_TIME null
, 2015-07-15T00:00:09.999Z shard-00011-of-00025 0 ON_TIME null
, 2015-07-15T00:00:09.999Z shard-00012-of-00025 0 ON_TIME null
, 2015-07-15T00:00:09.999Z shard-00023-of-00025 0 ON_TIME null
, 2015-07-15T00:00:09.999Z shard-00006-of-00025 0 ON_TIME null
, 2015-07-15T00:00:09.999Z shard-00014-of-00025 0 ON_TIME null
, 2015-07-15T00:00:09.999Z shard-00016-of-00025 0 ON_TIME null
, 2015-07-15T00:00:09.999Z shard-00007-of-00025 0 ON_TIME null
, 2015-07-15T00:00:09.999Z shard-00004-of-00025 0 ON_TIME null
, 2015-07-15T00:00:09.999Z shard-00017-of-00025 0 ON_TIME null
, 2015-07-15T00:00:09.999Z shard-00022-of-00025 0 ON_TIME null
, 2015-07-15T00:00:09.999Z shard-00000-of-00025 0 ON_TIME null
, 2015-07-15T00:00:09.999Z shard-00013-of-00025 0 ON_TIME null
, 2015-07-15T00:00:09.999Z shard-00002-of-00025 0 ON_TIME null
, 2015-07-15T00:00:09.999Z shard-00020-of-00025 0 ON_TIME null
, 2015-07-15T00:00:09.999Z shard-00008-of-00025 0 ON_TIME null
, 2015-07-15T00:00:09.999Z shard-00015-of-00025 0 ON_TIME null
, 2015-07-15T00:00:09.999Z shard-00019-of-00025 0 ON_TIME null
, 2015-07-15T00:00:09.999Z shard-00009-of-00025 0 ON_TIME null
, 2015-07-15T00:00:09.999Z shard-00018-of-00025 0 ON_TIME null
, 2015-07-15T00:00:09.999Z shard-00021-of-00025 0 ON_TIME null
, 2015-07-15T00:00:09.999Z shard-00005-of-00025 0 ON_TIME null
, 2015-07-15T00:00:09.999Z shard-00024-of-00025 0 ON_TIME null
, 2015-07-15T00:00:09.999Z shard-00001-of-00025 0 ON_TIME null
]}
2018-10-27T03:20:25.830Z Waiting for main pipeline to 'finish'
2018-10-27T03:20:25.830Z DONE Query10
2018-10-27T03:20:25.831Z Running query:11; exportSummaryToBigQuery:true
2018-10-27T03:20:25.834Z Generating 100000 events in batch mode
2018-10-27T03:20:28.521Z Waiting for main pipeline to 'finish'
2018-10-27T03:20:28.522Z DONE Query11
2018-10-27T03:20:28.522Z Running query:12; exportSummaryToBigQuery:true
2018-10-27T03:20:28.524Z Generating 100000 events in batch mode
2018-10-27T03:20:30.421Z Waiting for main pipeline to 'finish'
2018-10-27T03:20:30.422Z DONE Query12
> Task :beam-sdks-java-nexmark:run FAILED
:beam-sdks-java-nexmark:run (Thread[Task worker for ':' Thread 2,5,main]) completed. Took 1 mins 5.764 secs.
FAILURE: Build failed with an exception.
* What went wrong:
Execution failed for task ':beam-sdks-java-nexmark:run'.
> Process 'command '/usr/local/asfpackages/java/jdk1.8.0_172/bin/java'' finished with non-zero exit value 1
* Try:
Run with --stacktrace option to get the stack trace. Run with --debug option to get more log output. Run with --scan to get full insights.
* Get more help at https://help.gradle.org
Deprecated Gradle features were used in this build, making it incompatible with Gradle 5.0.
Use '--warning-mode all' to show the individual deprecation warnings.
See https://docs.gradle.org/4.10.2/userguide/command_line_interface.html#sec:command_line_warnings
BUILD FAILED in 3m 52s
65 actionable tasks: 61 executed, 4 from cache
Publishing build scan...
https://gradle.com/s/edoktmxcxwkuo
Build step 'Invoke Gradle script' changed build result to FAILURE
Build step 'Invoke Gradle script' marked build as failure
---------------------------------------------------------------------
To unsubscribe, e-mail: builds-unsubscribe@beam.apache.org
For additional commands, e-mail: builds-help@beam.apache.org
Build failed in Jenkins: beam_PostCommit_Java_Nexmark_Direct #948
Posted by Apache Jenkins Server <je...@builds.apache.org>.
See <https://builds.apache.org/job/beam_PostCommit_Java_Nexmark_Direct/948/display/redirect?page=changes>
Changes:
[scott] Add an OWNERS file for .test-infra/metrics
------------------------------------------
[...truncated 191.58 KB...]
INFO: shard-00013-of-00025 with timestamp 2015-07-15T00:00:09.999Z has 0 actually late and 3940 on-time elements in pane PaneInfo{isFirst=true, isLast=true, timing=ON_TIME, index=0, onTimeIndex=0} for window 2015-07-15T00:00:09.999Z
Oct 27, 2018 2:24:03 AM org.apache.beam.sdk.nexmark.queries.Query10$2 processElement
INFO: shard-00014-of-00025 with timestamp 2015-07-15T00:00:09.999Z has 0 actually late and 4134 on-time elements in pane PaneInfo{isFirst=true, isLast=true, timing=ON_TIME, index=0, onTimeIndex=0} for window 2015-07-15T00:00:09.999Z
Oct 27, 2018 2:24:03 AM org.apache.beam.sdk.nexmark.queries.Query10$2 processElement
INFO: shard-00019-of-00025 with timestamp 2015-07-15T00:00:09.999Z has 0 actually late and 3909 on-time elements in pane PaneInfo{isFirst=true, isLast=true, timing=ON_TIME, index=0, onTimeIndex=0} for window 2015-07-15T00:00:09.999Z
Oct 27, 2018 2:24:03 AM org.apache.beam.sdk.nexmark.queries.Query10$2 processElement
INFO: shard-00008-of-00025 with timestamp 2015-07-15T00:00:09.999Z has 0 actually late and 3939 on-time elements in pane PaneInfo{isFirst=true, isLast=true, timing=ON_TIME, index=0, onTimeIndex=0} for window 2015-07-15T00:00:09.999Z
Oct 27, 2018 2:24:03 AM org.apache.beam.sdk.nexmark.queries.Query10$2 processElement
INFO: shard-00006-of-00025 with timestamp 2015-07-15T00:00:09.999Z has 0 actually late and 3992 on-time elements in pane PaneInfo{isFirst=true, isLast=true, timing=ON_TIME, index=0, onTimeIndex=0} for window 2015-07-15T00:00:09.999Z
Oct 27, 2018 2:24:03 AM org.apache.beam.sdk.nexmark.queries.Query10$2 processElement
INFO: shard-00016-of-00025 with timestamp 2015-07-15T00:00:09.999Z has 0 actually late and 4018 on-time elements in pane PaneInfo{isFirst=true, isLast=true, timing=ON_TIME, index=0, onTimeIndex=0} for window 2015-07-15T00:00:09.999Z
Oct 27, 2018 2:24:03 AM org.apache.beam.sdk.nexmark.queries.Query10$2 processElement
INFO: shard-00003-of-00025 with timestamp 2015-07-15T00:00:09.999Z has 0 actually late and 4015 on-time elements in pane PaneInfo{isFirst=true, isLast=true, timing=ON_TIME, index=0, onTimeIndex=0} for window 2015-07-15T00:00:09.999Z
Oct 27, 2018 2:24:03 AM org.apache.beam.sdk.nexmark.queries.Query10$2 processElement
INFO: shard-00015-of-00025 with timestamp 2015-07-15T00:00:09.999Z has 0 actually late and 4041 on-time elements in pane PaneInfo{isFirst=true, isLast=true, timing=ON_TIME, index=0, onTimeIndex=0} for window 2015-07-15T00:00:09.999Z
Oct 27, 2018 2:24:03 AM org.apache.beam.sdk.nexmark.queries.Query10$2 processElement
INFO: shard-00002-of-00025 with timestamp 2015-07-15T00:00:09.999Z has 0 actually late and 4002 on-time elements in pane PaneInfo{isFirst=true, isLast=true, timing=ON_TIME, index=0, onTimeIndex=0} for window 2015-07-15T00:00:09.999Z
Oct 27, 2018 2:24:03 AM org.apache.beam.sdk.nexmark.queries.Query10$2 processElement
INFO: shard-00018-of-00025 with timestamp 2015-07-15T00:00:09.999Z has 0 actually late and 3987 on-time elements in pane PaneInfo{isFirst=true, isLast=true, timing=ON_TIME, index=0, onTimeIndex=0} for window 2015-07-15T00:00:09.999Z
Oct 27, 2018 2:24:03 AM org.apache.beam.sdk.nexmark.queries.Query10$2 processElement
INFO: shard-00005-of-00025 with timestamp 2015-07-15T00:00:09.999Z has 0 actually late and 4060 on-time elements in pane PaneInfo{isFirst=true, isLast=true, timing=ON_TIME, index=0, onTimeIndex=0} for window 2015-07-15T00:00:09.999Z
Oct 27, 2018 2:24:03 AM org.apache.beam.sdk.nexmark.queries.Query10$2 processElement
INFO: shard-00020-of-00025 with timestamp 2015-07-15T00:00:09.999Z has 0 actually late and 4021 on-time elements in pane PaneInfo{isFirst=true, isLast=true, timing=ON_TIME, index=0, onTimeIndex=0} for window 2015-07-15T00:00:09.999Z
Oct 27, 2018 2:24:03 AM org.apache.beam.sdk.nexmark.queries.Query10$2 processElement
INFO: shard-00024-of-00025 with timestamp 2015-07-15T00:00:09.999Z has 0 actually late and 4127 on-time elements in pane PaneInfo{isFirst=true, isLast=true, timing=ON_TIME, index=0, onTimeIndex=0} for window 2015-07-15T00:00:09.999Z
Oct 27, 2018 2:24:03 AM org.apache.beam.sdk.nexmark.queries.Query10$2 processElement
INFO: shard-00001-of-00025 with timestamp 2015-07-15T00:00:09.999Z has 0 actually late and 3953 on-time elements in pane PaneInfo{isFirst=true, isLast=true, timing=ON_TIME, index=0, onTimeIndex=0} for window 2015-07-15T00:00:09.999Z
Oct 27, 2018 2:24:03 AM org.apache.beam.sdk.nexmark.queries.Query10$3 processElement
INFO: Writing shard-00023-of-00025 with record timestamp 2015-07-15T00:00:09.999Z, window timestamp 2015-07-15T00:00:09.999Z, pane PaneInfo{isFirst=true, isLast=true, timing=ON_TIME, index=0, onTimeIndex=0}
Oct 27, 2018 2:24:03 AM org.apache.beam.sdk.nexmark.queries.Query10$3 processElement
INFO: Writing shard-00007-of-00025 with record timestamp 2015-07-15T00:00:09.999Z, window timestamp 2015-07-15T00:00:09.999Z, pane PaneInfo{isFirst=true, isLast=true, timing=ON_TIME, index=0, onTimeIndex=0}
Oct 27, 2018 2:24:03 AM org.apache.beam.sdk.nexmark.queries.Query10$2 processElement
INFO: shard-00009-of-00025 with timestamp 2015-07-15T00:00:09.999Z has 0 actually late and 4056 on-time elements in pane PaneInfo{isFirst=true, isLast=true, timing=ON_TIME, index=0, onTimeIndex=0} for window 2015-07-15T00:00:09.999Z
Oct 27, 2018 2:24:03 AM org.apache.beam.sdk.nexmark.queries.Query10$3 processElement
INFO: Writing shard-00012-of-00025 with record timestamp 2015-07-15T00:00:09.999Z, window timestamp 2015-07-15T00:00:09.999Z, pane PaneInfo{isFirst=true, isLast=true, timing=ON_TIME, index=0, onTimeIndex=0}
Oct 27, 2018 2:24:03 AM org.apache.beam.sdk.nexmark.queries.Query10$2 processElement
INFO: shard-00021-of-00025 with timestamp 2015-07-15T00:00:09.999Z has 0 actually late and 3969 on-time elements in pane PaneInfo{isFirst=true, isLast=true, timing=ON_TIME, index=0, onTimeIndex=0} for window 2015-07-15T00:00:09.999Z
Oct 27, 2018 2:24:04 AM org.apache.beam.sdk.nexmark.queries.Query10$3 processElement
INFO: Writing shard-00017-of-00025 with record timestamp 2015-07-15T00:00:09.999Z, window timestamp 2015-07-15T00:00:09.999Z, pane PaneInfo{isFirst=true, isLast=true, timing=ON_TIME, index=0, onTimeIndex=0}
Oct 27, 2018 2:24:03 AM org.apache.beam.sdk.nexmark.queries.Query10$3 processElement
INFO: Writing shard-00010-of-00025 with record timestamp 2015-07-15T00:00:09.999Z, window timestamp 2015-07-15T00:00:09.999Z, pane PaneInfo{isFirst=true, isLast=true, timing=ON_TIME, index=0, onTimeIndex=0}
Oct 27, 2018 2:24:04 AM org.apache.beam.sdk.util.MutationDetectors$CodedValueMutationDetector verifyUnmodifiedThrowingCheckedExceptions
WARNING: Coder of type class org.apache.beam.sdk.coders.KvCoder has a #structuralValue method which does not return true when the encoding of the elements is equal. Element KV{null, 2015-07-15T00:00:09.999Z shard-00007-of-00025 0 ON_TIME null
}
Oct 27, 2018 2:24:04 AM org.apache.beam.sdk.nexmark.queries.Query10$3 processElement
INFO: Writing shard-00011-of-00025 with record timestamp 2015-07-15T00:00:09.999Z, window timestamp 2015-07-15T00:00:09.999Z, pane PaneInfo{isFirst=true, isLast=true, timing=ON_TIME, index=0, onTimeIndex=0}
Oct 27, 2018 2:24:04 AM org.apache.beam.sdk.util.MutationDetectors$CodedValueMutationDetector verifyUnmodifiedThrowingCheckedExceptions
WARNING: Coder of type class org.apache.beam.sdk.coders.KvCoder has a #structuralValue method which does not return true when the encoding of the elements is equal. Element KV{null, 2015-07-15T00:00:09.999Z shard-00017-of-00025 0 ON_TIME null
}
Oct 27, 2018 2:24:04 AM org.apache.beam.sdk.util.MutationDetectors$CodedValueMutationDetector verifyUnmodifiedThrowingCheckedExceptions
WARNING: Coder of type class org.apache.beam.sdk.coders.KvCoder has a #structuralValue method which does not return true when the encoding of the elements is equal. Element KV{null, 2015-07-15T00:00:09.999Z shard-00012-of-00025 0 ON_TIME null
}
Oct 27, 2018 2:24:04 AM org.apache.beam.sdk.util.MutationDetectors$CodedValueMutationDetector verifyUnmodifiedThrowingCheckedExceptions
WARNING: Coder of type class org.apache.beam.sdk.coders.KvCoder has a #structuralValue method which does not return true when the encoding of the elements is equal. Element KV{null, 2015-07-15T00:00:09.999Z shard-00023-of-00025 0 ON_TIME null
}
Oct 27, 2018 2:24:04 AM org.apache.beam.sdk.nexmark.queries.Query10$3 processElement
INFO: Writing shard-00022-of-00025 with record timestamp 2015-07-15T00:00:09.999Z, window timestamp 2015-07-15T00:00:09.999Z, pane PaneInfo{isFirst=true, isLast=true, timing=ON_TIME, index=0, onTimeIndex=0}
Oct 27, 2018 2:24:04 AM org.apache.beam.sdk.util.MutationDetectors$CodedValueMutationDetector verifyUnmodifiedThrowingCheckedExceptions
WARNING: Coder of type class org.apache.beam.sdk.coders.KvCoder has a #structuralValue method which does not return true when the encoding of the elements is equal. Element KV{null, 2015-07-15T00:00:09.999Z shard-00011-of-00025 0 ON_TIME null
}
Oct 27, 2018 2:24:04 AM org.apache.beam.sdk.nexmark.queries.Query10$3 processElement
INFO: Writing shard-00004-of-00025 with record timestamp 2015-07-15T00:00:09.999Z, window timestamp 2015-07-15T00:00:09.999Z, pane PaneInfo{isFirst=true, isLast=true, timing=ON_TIME, index=0, onTimeIndex=0}
Oct 27, 2018 2:24:04 AM org.apache.beam.sdk.util.MutationDetectors$CodedValueMutationDetector verifyUnmodifiedThrowingCheckedExceptions
WARNING: Coder of type class org.apache.beam.sdk.coders.KvCoder has a #structuralValue method which does not return true when the encoding of the elements is equal. Element KV{null, 2015-07-15T00:00:09.999Z shard-00022-of-00025 0 ON_TIME null
}
Oct 27, 2018 2:24:04 AM org.apache.beam.sdk.util.MutationDetectors$CodedValueMutationDetector verifyUnmodifiedThrowingCheckedExceptions
WARNING: Coder of type class org.apache.beam.sdk.coders.KvCoder has a #structuralValue method which does not return true when the encoding of the elements is equal. Element KV{null, 2015-07-15T00:00:09.999Z shard-00004-of-00025 0 ON_TIME null
}
Oct 27, 2018 2:24:04 AM org.apache.beam.sdk.nexmark.queries.Query10$3 processElement
INFO: Writing shard-00019-of-00025 with record timestamp 2015-07-15T00:00:09.999Z, window timestamp 2015-07-15T00:00:09.999Z, pane PaneInfo{isFirst=true, isLast=true, timing=ON_TIME, index=0, onTimeIndex=0}
Oct 27, 2018 2:24:04 AM org.apache.beam.sdk.util.MutationDetectors$CodedValueMutationDetector verifyUnmodifiedThrowingCheckedExceptions
WARNING: Coder of type class org.apache.beam.sdk.coders.KvCoder has a #structuralValue method which does not return true when the encoding of the elements is equal. Element KV{null, 2015-07-15T00:00:09.999Z shard-00010-of-00025 0 ON_TIME null
}
Oct 27, 2018 2:24:04 AM org.apache.beam.sdk.nexmark.queries.Query10$3 processElement
INFO: Writing shard-00013-of-00025 with record timestamp 2015-07-15T00:00:09.999Z, window timestamp 2015-07-15T00:00:09.999Z, pane PaneInfo{isFirst=true, isLast=true, timing=ON_TIME, index=0, onTimeIndex=0}
Oct 27, 2018 2:24:04 AM org.apache.beam.sdk.nexmark.queries.Query10$3 processElement
INFO: Writing shard-00008-of-00025 with record timestamp 2015-07-15T00:00:09.999Z, window timestamp 2015-07-15T00:00:09.999Z, pane PaneInfo{isFirst=true, isLast=true, timing=ON_TIME, index=0, onTimeIndex=0}
Oct 27, 2018 2:24:04 AM org.apache.beam.sdk.util.MutationDetectors$CodedValueMutationDetector verifyUnmodifiedThrowingCheckedExceptions
WARNING: Coder of type class org.apache.beam.sdk.coders.KvCoder has a #structuralValue method which does not return true when the encoding of the elements is equal. Element KV{null, 2015-07-15T00:00:09.999Z shard-00019-of-00025 0 ON_TIME null
}
Oct 27, 2018 2:24:04 AM org.apache.beam.sdk.nexmark.queries.Query10$3 processElement
INFO: Writing shard-00014-of-00025 with record timestamp 2015-07-15T00:00:09.999Z, window timestamp 2015-07-15T00:00:09.999Z, pane PaneInfo{isFirst=true, isLast=true, timing=ON_TIME, index=0, onTimeIndex=0}
Oct 27, 2018 2:24:04 AM org.apache.beam.sdk.nexmark.queries.Query10$3 processElement
INFO: Writing shard-00003-of-00025 with record timestamp 2015-07-15T00:00:09.999Z, window timestamp 2015-07-15T00:00:09.999Z, pane PaneInfo{isFirst=true, isLast=true, timing=ON_TIME, index=0, onTimeIndex=0}
Oct 27, 2018 2:24:04 AM org.apache.beam.sdk.nexmark.queries.Query10$3 processElement
INFO: Writing shard-00000-of-00025 with record timestamp 2015-07-15T00:00:09.999Z, window timestamp 2015-07-15T00:00:09.999Z, pane PaneInfo{isFirst=true, isLast=true, timing=ON_TIME, index=0, onTimeIndex=0}
Oct 27, 2018 2:24:04 AM org.apache.beam.sdk.nexmark.queries.Query10$3 processElement
INFO: Writing shard-00006-of-00025 with record timestamp 2015-07-15T00:00:09.999Z, window timestamp 2015-07-15T00:00:09.999Z, pane PaneInfo{isFirst=true, isLast=true, timing=ON_TIME, index=0, onTimeIndex=0}
Oct 27, 2018 2:24:04 AM org.apache.beam.sdk.nexmark.queries.Query10$3 processElement
INFO: Writing shard-00016-of-00025 with record timestamp 2015-07-15T00:00:09.999Z, window timestamp 2015-07-15T00:00:09.999Z, pane PaneInfo{isFirst=true, isLast=true, timing=ON_TIME, index=0, onTimeIndex=0}
Oct 27, 2018 2:24:04 AM org.apache.beam.sdk.util.MutationDetectors$CodedValueMutationDetector verifyUnmodifiedThrowingCheckedExceptions
WARNING: Coder of type class org.apache.beam.sdk.coders.KvCoder has a #structuralValue method which does not return true when the encoding of the elements is equal. Element KV{null, 2015-07-15T00:00:09.999Z shard-00008-of-00025 0 ON_TIME null
}
Oct 27, 2018 2:24:04 AM org.apache.beam.sdk.util.MutationDetectors$CodedValueMutationDetector verifyUnmodifiedThrowingCheckedExceptions
WARNING: Coder of type class org.apache.beam.sdk.coders.KvCoder has a #structuralValue method which does not return true when the encoding of the elements is equal. Element KV{null, 2015-07-15T00:00:09.999Z shard-00014-of-00025 0 ON_TIME null
}
Oct 27, 2018 2:24:04 AM org.apache.beam.sdk.nexmark.queries.Query10$3 processElement
INFO: Writing shard-00015-of-00025 with record timestamp 2015-07-15T00:00:09.999Z, window timestamp 2015-07-15T00:00:09.999Z, pane PaneInfo{isFirst=true, isLast=true, timing=ON_TIME, index=0, onTimeIndex=0}
Oct 27, 2018 2:24:04 AM org.apache.beam.sdk.nexmark.queries.Query10$3 processElement
INFO: Writing shard-00018-of-00025 with record timestamp 2015-07-15T00:00:09.999Z, window timestamp 2015-07-15T00:00:09.999Z, pane PaneInfo{isFirst=true, isLast=true, timing=ON_TIME, index=0, onTimeIndex=0}
Oct 27, 2018 2:24:04 AM org.apache.beam.sdk.util.MutationDetectors$CodedValueMutationDetector verifyUnmodifiedThrowingCheckedExceptions
WARNING: Coder of type class org.apache.beam.sdk.coders.KvCoder has a #structuralValue method which does not return true when the encoding of the elements is equal. Element KV{null, 2015-07-15T00:00:09.999Z shard-00013-of-00025 0 ON_TIME null
}
Oct 27, 2018 2:24:04 AM org.apache.beam.sdk.util.MutationDetectors$CodedValueMutationDetector verifyUnmodifiedThrowingCheckedExceptions
WARNING: Coder of type class org.apache.beam.sdk.coders.KvCoder has a #structuralValue method which does not return true when the encoding of the elements is equal. Element KV{null, 2015-07-15T00:00:09.999Z shard-00006-of-00025 0 ON_TIME null
}
Oct 27, 2018 2:24:04 AM org.apache.beam.sdk.nexmark.queries.Query10$3 processElement
INFO: Writing shard-00020-of-00025 with record timestamp 2015-07-15T00:00:09.999Z, window timestamp 2015-07-15T00:00:09.999Z, pane PaneInfo{isFirst=true, isLast=true, timing=ON_TIME, index=0, onTimeIndex=0}
Oct 27, 2018 2:24:04 AM org.apache.beam.sdk.util.MutationDetectors$CodedValueMutationDetector verifyUnmodifiedThrowingCheckedExceptions
WARNING: Coder of type class org.apache.beam.sdk.coders.KvCoder has a #structuralValue method which does not return true when the encoding of the elements is equal. Element KV{null, 2015-07-15T00:00:09.999Z shard-00003-of-00025 0 ON_TIME null
}
Oct 27, 2018 2:24:04 AM org.apache.beam.sdk.nexmark.queries.Query10$3 processElement
INFO: Writing shard-00002-of-00025 with record timestamp 2015-07-15T00:00:09.999Z, window timestamp 2015-07-15T00:00:09.999Z, pane PaneInfo{isFirst=true, isLast=true, timing=ON_TIME, index=0, onTimeIndex=0}
Oct 27, 2018 2:24:04 AM org.apache.beam.sdk.nexmark.queries.Query10$3 processElement
INFO: Writing shard-00005-of-00025 with record timestamp 2015-07-15T00:00:09.999Z, window timestamp 2015-07-15T00:00:09.999Z, pane PaneInfo{isFirst=true, isLast=true, timing=ON_TIME, index=0, onTimeIndex=0}
Oct 27, 2018 2:24:04 AM org.apache.beam.sdk.util.MutationDetectors$CodedValueMutationDetector verifyUnmodifiedThrowingCheckedExceptions
WARNING: Coder of type class org.apache.beam.sdk.coders.KvCoder has a #structuralValue method which does not return true when the encoding of the elements is equal. Element KV{null, 2015-07-15T00:00:09.999Z shard-00015-of-00025 0 ON_TIME null
}
Oct 27, 2018 2:24:04 AM org.apache.beam.sdk.util.MutationDetectors$CodedValueMutationDetector verifyUnmodifiedThrowingCheckedExceptions
WARNING: Coder of type class org.apache.beam.sdk.coders.KvCoder has a #structuralValue method which does not return true when the encoding of the elements is equal. Element KV{null, 2015-07-15T00:00:09.999Z shard-00000-of-00025 0 ON_TIME null
}
Oct 27, 2018 2:24:04 AM org.apache.beam.sdk.util.MutationDetectors$CodedValueMutationDetector verifyUnmodifiedThrowingCheckedExceptions
WARNING: Coder of type class org.apache.beam.sdk.coders.KvCoder has a #structuralValue method which does not return true when the encoding of the elements is equal. Element KV{null, 2015-07-15T00:00:09.999Z shard-00016-of-00025 0 ON_TIME null
}
Oct 27, 2018 2:24:04 AM org.apache.beam.sdk.util.MutationDetectors$CodedValueMutationDetector verifyUnmodifiedThrowingCheckedExceptions
WARNING: Coder of type class org.apache.beam.sdk.coders.KvCoder has a #structuralValue method which does not return true when the encoding of the elements is equal. Element KV{null, 2015-07-15T00:00:09.999Z shard-00018-of-00025 0 ON_TIME null
}
Oct 27, 2018 2:24:04 AM org.apache.beam.sdk.nexmark.queries.Query10$3 processElement
INFO: Writing shard-00009-of-00025 with record timestamp 2015-07-15T00:00:09.999Z, window timestamp 2015-07-15T00:00:09.999Z, pane PaneInfo{isFirst=true, isLast=true, timing=ON_TIME, index=0, onTimeIndex=0}
Oct 27, 2018 2:24:04 AM org.apache.beam.sdk.nexmark.queries.Query10$3 processElement
INFO: Writing shard-00001-of-00025 with record timestamp 2015-07-15T00:00:09.999Z, window timestamp 2015-07-15T00:00:09.999Z, pane PaneInfo{isFirst=true, isLast=true, timing=ON_TIME, index=0, onTimeIndex=0}
Oct 27, 2018 2:24:04 AM org.apache.beam.sdk.nexmark.queries.Query10$3 processElement
INFO: Writing shard-00024-of-00025 with record timestamp 2015-07-15T00:00:09.999Z, window timestamp 2015-07-15T00:00:09.999Z, pane PaneInfo{isFirst=true, isLast=true, timing=ON_TIME, index=0, onTimeIndex=0}
Oct 27, 2018 2:24:04 AM org.apache.beam.sdk.util.MutationDetectors$CodedValueMutationDetector verifyUnmodifiedThrowingCheckedExceptions
WARNING: Coder of type class org.apache.beam.sdk.coders.KvCoder has a #structuralValue method which does not return true when the encoding of the elements is equal. Element KV{null, 2015-07-15T00:00:09.999Z shard-00020-of-00025 0 ON_TIME null
}
Oct 27, 2018 2:24:04 AM org.apache.beam.sdk.util.MutationDetectors$CodedValueMutationDetector verifyUnmodifiedThrowingCheckedExceptions
WARNING: Coder of type class org.apache.beam.sdk.coders.KvCoder has a #structuralValue method which does not return true when the encoding of the elements is equal. Element KV{null, 2015-07-15T00:00:09.999Z shard-00005-of-00025 0 ON_TIME null
}
Oct 27, 2018 2:24:04 AM org.apache.beam.sdk.util.MutationDetectors$CodedValueMutationDetector verifyUnmodifiedThrowingCheckedExceptions
WARNING: Coder of type class org.apache.beam.sdk.coders.KvCoder has a #structuralValue method which does not return true when the encoding of the elements is equal. Element KV{null, 2015-07-15T00:00:09.999Z shard-00009-of-00025 0 ON_TIME null
}
Oct 27, 2018 2:24:04 AM org.apache.beam.sdk.util.MutationDetectors$CodedValueMutationDetector verifyUnmodifiedThrowingCheckedExceptions
WARNING: Coder of type class org.apache.beam.sdk.coders.KvCoder has a #structuralValue method which does not return true when the encoding of the elements is equal. Element KV{null, 2015-07-15T00:00:09.999Z shard-00002-of-00025 0 ON_TIME null
}
Oct 27, 2018 2:24:04 AM org.apache.beam.sdk.util.MutationDetectors$CodedValueMutationDetector verifyUnmodifiedThrowingCheckedExceptions
WARNING: Coder of type class org.apache.beam.sdk.coders.KvCoder has a #structuralValue method which does not return true when the encoding of the elements is equal. Element KV{null, 2015-07-15T00:00:09.999Z shard-00001-of-00025 0 ON_TIME null
}
Oct 27, 2018 2:24:04 AM org.apache.beam.sdk.util.MutationDetectors$CodedValueMutationDetector verifyUnmodifiedThrowingCheckedExceptions
WARNING: Coder of type class org.apache.beam.sdk.coders.KvCoder has a #structuralValue method which does not return true when the encoding of the elements is equal. Element KV{null, 2015-07-15T00:00:09.999Z shard-00024-of-00025 0 ON_TIME null
}
Oct 27, 2018 2:24:04 AM org.apache.beam.sdk.nexmark.queries.Query10$3 processElement
INFO: Writing shard-00021-of-00025 with record timestamp 2015-07-15T00:00:09.999Z, window timestamp 2015-07-15T00:00:09.999Z, pane PaneInfo{isFirst=true, isLast=true, timing=ON_TIME, index=0, onTimeIndex=0}
Oct 27, 2018 2:24:04 AM org.apache.beam.sdk.util.MutationDetectors$CodedValueMutationDetector verifyUnmodifiedThrowingCheckedExceptions
WARNING: Coder of type class org.apache.beam.sdk.coders.KvCoder has a #structuralValue method which does not return true when the encoding of the elements is equal. Element KV{null, 2015-07-15T00:00:09.999Z shard-00021-of-00025 0 ON_TIME null
}
Oct 27, 2018 2:24:04 AM org.apache.beam.sdk.nexmark.queries.Query10$4 processElement
INFO: Index with record timestamp %s, window timestamp %s, pane %s
Oct 27, 2018 2:24:04 AM org.apache.beam.sdk.util.MutationDetectors$CodedValueMutationDetector verifyUnmodifiedThrowingCheckedExceptions
WARNING: Coder of type class org.apache.beam.sdk.coders.KvCoder has a #structuralValue method which does not return true when the encoding of the elements is equal. Element KV{null, [2015-07-15T00:00:09.999Z shard-00007-of-00025 0 ON_TIME null
, 2015-07-15T00:00:09.999Z shard-00023-of-00025 0 ON_TIME null
, 2015-07-15T00:00:09.999Z shard-00011-of-00025 0 ON_TIME null
, 2015-07-15T00:00:09.999Z shard-00022-of-00025 0 ON_TIME null
, 2015-07-15T00:00:09.999Z shard-00012-of-00025 0 ON_TIME null
, 2015-07-15T00:00:09.999Z shard-00017-of-00025 0 ON_TIME null
, 2015-07-15T00:00:09.999Z shard-00010-of-00025 0 ON_TIME null
, 2015-07-15T00:00:09.999Z shard-00019-of-00025 0 ON_TIME null
, 2015-07-15T00:00:09.999Z shard-00008-of-00025 0 ON_TIME null
, 2015-07-15T00:00:09.999Z shard-00014-of-00025 0 ON_TIME null
, 2015-07-15T00:00:09.999Z shard-00013-of-00025 0 ON_TIME null
, 2015-07-15T00:00:09.999Z shard-00006-of-00025 0 ON_TIME null
, 2015-07-15T00:00:09.999Z shard-00015-of-00025 0 ON_TIME null
, 2015-07-15T00:00:09.999Z shard-00003-of-00025 0 ON_TIME null
, 2015-07-15T00:00:09.999Z shard-00000-of-00025 0 ON_TIME null
, 2015-07-15T00:00:09.999Z shard-00016-of-00025 0 ON_TIME null
, 2015-07-15T00:00:09.999Z shard-00018-of-00025 0 ON_TIME null
, 2015-07-15T00:00:09.999Z shard-00004-of-00025 0 ON_TIME null
, 2015-07-15T00:00:09.999Z shard-00020-of-00025 0 ON_TIME null
, 2015-07-15T00:00:09.999Z shard-00005-of-00025 0 ON_TIME null
, 2015-07-15T00:00:09.999Z shard-00009-of-00025 0 ON_TIME null
, 2015-07-15T00:00:09.999Z shard-00002-of-00025 0 ON_TIME null
, 2015-07-15T00:00:09.999Z shard-00001-of-00025 0 ON_TIME null
, 2015-07-15T00:00:09.999Z shard-00024-of-00025 0 ON_TIME null
, 2015-07-15T00:00:09.999Z shard-00021-of-00025 0 ON_TIME null
]}
Oct 27, 2018 2:24:04 AM org.apache.beam.sdk.util.MutationDetectors$CodedValueMutationDetector verifyUnmodifiedThrowingCheckedExceptions
WARNING: Coder of type class org.apache.beam.sdk.coders.KvCoder has a #structuralValue method which does not return true when the encoding of the elements is equal. Element KV{null, [2015-07-15T00:00:09.999Z shard-00007-of-00025 0 ON_TIME null
, 2015-07-15T00:00:09.999Z shard-00023-of-00025 0 ON_TIME null
, 2015-07-15T00:00:09.999Z shard-00011-of-00025 0 ON_TIME null
, 2015-07-15T00:00:09.999Z shard-00022-of-00025 0 ON_TIME null
, 2015-07-15T00:00:09.999Z shard-00012-of-00025 0 ON_TIME null
, 2015-07-15T00:00:09.999Z shard-00017-of-00025 0 ON_TIME null
, 2015-07-15T00:00:09.999Z shard-00010-of-00025 0 ON_TIME null
, 2015-07-15T00:00:09.999Z shard-00019-of-00025 0 ON_TIME null
, 2015-07-15T00:00:09.999Z shard-00008-of-00025 0 ON_TIME null
, 2015-07-15T00:00:09.999Z shard-00014-of-00025 0 ON_TIME null
, 2015-07-15T00:00:09.999Z shard-00013-of-00025 0 ON_TIME null
, 2015-07-15T00:00:09.999Z shard-00006-of-00025 0 ON_TIME null
, 2015-07-15T00:00:09.999Z shard-00015-of-00025 0 ON_TIME null
, 2015-07-15T00:00:09.999Z shard-00003-of-00025 0 ON_TIME null
, 2015-07-15T00:00:09.999Z shard-00000-of-00025 0 ON_TIME null
, 2015-07-15T00:00:09.999Z shard-00016-of-00025 0 ON_TIME null
, 2015-07-15T00:00:09.999Z shard-00018-of-00025 0 ON_TIME null
, 2015-07-15T00:00:09.999Z shard-00004-of-00025 0 ON_TIME null
, 2015-07-15T00:00:09.999Z shard-00020-of-00025 0 ON_TIME null
, 2015-07-15T00:00:09.999Z shard-00005-of-00025 0 ON_TIME null
, 2015-07-15T00:00:09.999Z shard-00009-of-00025 0 ON_TIME null
, 2015-07-15T00:00:09.999Z shard-00002-of-00025 0 ON_TIME null
, 2015-07-15T00:00:09.999Z shard-00001-of-00025 0 ON_TIME null
, 2015-07-15T00:00:09.999Z shard-00024-of-00025 0 ON_TIME null
, 2015-07-15T00:00:09.999Z shard-00021-of-00025 0 ON_TIME null
]}
2018-10-27T02:24:04.353Z Waiting for main pipeline to 'finish'
2018-10-27T02:24:04.353Z DONE Query10
2018-10-27T02:24:04.353Z Running query:11; exportSummaryToBigQuery:true
2018-10-27T02:24:04.356Z Generating 100000 events in batch mode
2018-10-27T02:24:07.290Z Waiting for main pipeline to 'finish'
2018-10-27T02:24:07.290Z DONE Query11
2018-10-27T02:24:07.290Z Running query:12; exportSummaryToBigQuery:true
2018-10-27T02:24:07.292Z Generating 100000 events in batch mode
2018-10-27T02:24:09.200Z Waiting for main pipeline to 'finish'
2018-10-27T02:24:09.200Z DONE Query12
> Task :beam-sdks-java-nexmark:run FAILED
:beam-sdks-java-nexmark:run (Thread[Task worker for ':' Thread 11,5,main]) completed. Took 1 mins 6.689 secs.
FAILURE: Build failed with an exception.
* What went wrong:
Execution failed for task ':beam-sdks-java-nexmark:run'.
> Process 'command '/usr/local/asfpackages/java/jdk1.8.0_172/bin/java'' finished with non-zero exit value 1
* Try:
Run with --stacktrace option to get the stack trace. Run with --debug option to get more log output. Run with --scan to get full insights.
* Get more help at https://help.gradle.org
Deprecated Gradle features were used in this build, making it incompatible with Gradle 5.0.
Use '--warning-mode all' to show the individual deprecation warnings.
See https://docs.gradle.org/4.10.2/userguide/command_line_interface.html#sec:command_line_warnings
BUILD FAILED in 3m 56s
65 actionable tasks: 61 executed, 4 from cache
Publishing build scan...
https://gradle.com/s/coissfjkzokiy
Build step 'Invoke Gradle script' changed build result to FAILURE
Build step 'Invoke Gradle script' marked build as failure
---------------------------------------------------------------------
To unsubscribe, e-mail: builds-unsubscribe@beam.apache.org
For additional commands, e-mail: builds-help@beam.apache.org
Build failed in Jenkins: beam_PostCommit_Java_Nexmark_Direct #947
Posted by Apache Jenkins Server <je...@builds.apache.org>.
See <https://builds.apache.org/job/beam_PostCommit_Java_Nexmark_Direct/947/display/redirect?page=changes>
Changes:
[ccy] Revert "Merge pull request #6837 [BEAM-5853] Fix in
[ccy] Revert "Merge pull request #6807: [BEAM-5833] Fix java-harness build by
[ccy] Revert "Merge pull request #6798: [BEAM-5833] Fix checkstyle breakage"
[ccy] Revert "Merge pull request #6752 [BEAM-5791] Dataflow harness data plane
------------------------------------------
[...truncated 191.13 KB...]
INFO: shard-00011-of-00025 with timestamp 2015-07-15T00:00:09.999Z has 0 actually late and 4020 on-time elements in pane PaneInfo{isFirst=true, isLast=true, timing=ON_TIME, index=0, onTimeIndex=0} for window 2015-07-15T00:00:09.999Z
Oct 27, 2018 2:07:43 AM org.apache.beam.sdk.nexmark.queries.Query10$2 processElement
INFO: shard-00000-of-00025 with timestamp 2015-07-15T00:00:09.999Z has 0 actually late and 3947 on-time elements in pane PaneInfo{isFirst=true, isLast=true, timing=ON_TIME, index=0, onTimeIndex=0} for window 2015-07-15T00:00:09.999Z
Oct 27, 2018 2:07:43 AM org.apache.beam.sdk.nexmark.queries.Query10$2 processElement
INFO: shard-00007-of-00025 with timestamp 2015-07-15T00:00:09.999Z has 0 actually late and 3984 on-time elements in pane PaneInfo{isFirst=true, isLast=true, timing=ON_TIME, index=0, onTimeIndex=0} for window 2015-07-15T00:00:09.999Z
Oct 27, 2018 2:07:43 AM org.apache.beam.sdk.nexmark.queries.Query10$2 processElement
INFO: shard-00004-of-00025 with timestamp 2015-07-15T00:00:09.999Z has 0 actually late and 3985 on-time elements in pane PaneInfo{isFirst=true, isLast=true, timing=ON_TIME, index=0, onTimeIndex=0} for window 2015-07-15T00:00:09.999Z
Oct 27, 2018 2:07:43 AM org.apache.beam.sdk.nexmark.queries.Query10$2 processElement
INFO: shard-00013-of-00025 with timestamp 2015-07-15T00:00:09.999Z has 0 actually late and 3940 on-time elements in pane PaneInfo{isFirst=true, isLast=true, timing=ON_TIME, index=0, onTimeIndex=0} for window 2015-07-15T00:00:09.999Z
Oct 27, 2018 2:07:43 AM org.apache.beam.sdk.nexmark.queries.Query10$2 processElement
INFO: shard-00016-of-00025 with timestamp 2015-07-15T00:00:09.999Z has 0 actually late and 4018 on-time elements in pane PaneInfo{isFirst=true, isLast=true, timing=ON_TIME, index=0, onTimeIndex=0} for window 2015-07-15T00:00:09.999Z
Oct 27, 2018 2:07:43 AM org.apache.beam.sdk.nexmark.queries.Query10$2 processElement
INFO: shard-00010-of-00025 with timestamp 2015-07-15T00:00:09.999Z has 0 actually late and 3943 on-time elements in pane PaneInfo{isFirst=true, isLast=true, timing=ON_TIME, index=0, onTimeIndex=0} for window 2015-07-15T00:00:09.999Z
Oct 27, 2018 2:07:43 AM org.apache.beam.sdk.nexmark.queries.Query10$2 processElement
INFO: shard-00020-of-00025 with timestamp 2015-07-15T00:00:09.999Z has 0 actually late and 4021 on-time elements in pane PaneInfo{isFirst=true, isLast=true, timing=ON_TIME, index=0, onTimeIndex=0} for window 2015-07-15T00:00:09.999Z
Oct 27, 2018 2:07:43 AM org.apache.beam.sdk.nexmark.queries.Query10$2 processElement
INFO: shard-00002-of-00025 with timestamp 2015-07-15T00:00:09.999Z has 0 actually late and 4002 on-time elements in pane PaneInfo{isFirst=true, isLast=true, timing=ON_TIME, index=0, onTimeIndex=0} for window 2015-07-15T00:00:09.999Z
Oct 27, 2018 2:07:43 AM org.apache.beam.sdk.nexmark.queries.Query10$2 processElement
INFO: shard-00018-of-00025 with timestamp 2015-07-15T00:00:09.999Z has 0 actually late and 3987 on-time elements in pane PaneInfo{isFirst=true, isLast=true, timing=ON_TIME, index=0, onTimeIndex=0} for window 2015-07-15T00:00:09.999Z
Oct 27, 2018 2:07:43 AM org.apache.beam.sdk.nexmark.queries.Query10$2 processElement
INFO: shard-00001-of-00025 with timestamp 2015-07-15T00:00:09.999Z has 0 actually late and 3953 on-time elements in pane PaneInfo{isFirst=true, isLast=true, timing=ON_TIME, index=0, onTimeIndex=0} for window 2015-07-15T00:00:09.999Z
Oct 27, 2018 2:07:43 AM org.apache.beam.sdk.nexmark.queries.Query10$2 processElement
INFO: shard-00009-of-00025 with timestamp 2015-07-15T00:00:09.999Z has 0 actually late and 4056 on-time elements in pane PaneInfo{isFirst=true, isLast=true, timing=ON_TIME, index=0, onTimeIndex=0} for window 2015-07-15T00:00:09.999Z
Oct 27, 2018 2:07:43 AM org.apache.beam.sdk.nexmark.queries.Query10$2 processElement
INFO: shard-00021-of-00025 with timestamp 2015-07-15T00:00:09.999Z has 0 actually late and 3969 on-time elements in pane PaneInfo{isFirst=true, isLast=true, timing=ON_TIME, index=0, onTimeIndex=0} for window 2015-07-15T00:00:09.999Z
Oct 27, 2018 2:07:43 AM org.apache.beam.sdk.nexmark.queries.Query10$2 processElement
INFO: shard-00015-of-00025 with timestamp 2015-07-15T00:00:09.999Z has 0 actually late and 4041 on-time elements in pane PaneInfo{isFirst=true, isLast=true, timing=ON_TIME, index=0, onTimeIndex=0} for window 2015-07-15T00:00:09.999Z
Oct 27, 2018 2:07:43 AM org.apache.beam.sdk.nexmark.queries.Query10$3 processElement
INFO: Writing shard-00008-of-00025 with record timestamp 2015-07-15T00:00:09.999Z, window timestamp 2015-07-15T00:00:09.999Z, pane PaneInfo{isFirst=true, isLast=true, timing=ON_TIME, index=0, onTimeIndex=0}
Oct 27, 2018 2:07:43 AM org.apache.beam.sdk.nexmark.queries.Query10$2 processElement
INFO: shard-00024-of-00025 with timestamp 2015-07-15T00:00:09.999Z has 0 actually late and 4127 on-time elements in pane PaneInfo{isFirst=true, isLast=true, timing=ON_TIME, index=0, onTimeIndex=0} for window 2015-07-15T00:00:09.999Z
Oct 27, 2018 2:07:43 AM org.apache.beam.sdk.nexmark.queries.Query10$2 processElement
INFO: shard-00005-of-00025 with timestamp 2015-07-15T00:00:09.999Z has 0 actually late and 4060 on-time elements in pane PaneInfo{isFirst=true, isLast=true, timing=ON_TIME, index=0, onTimeIndex=0} for window 2015-07-15T00:00:09.999Z
Oct 27, 2018 2:07:43 AM org.apache.beam.sdk.nexmark.queries.Query10$3 processElement
INFO: Writing shard-00006-of-00025 with record timestamp 2015-07-15T00:00:09.999Z, window timestamp 2015-07-15T00:00:09.999Z, pane PaneInfo{isFirst=true, isLast=true, timing=ON_TIME, index=0, onTimeIndex=0}
Oct 27, 2018 2:07:43 AM org.apache.beam.sdk.nexmark.queries.Query10$3 processElement
INFO: Writing shard-00019-of-00025 with record timestamp 2015-07-15T00:00:09.999Z, window timestamp 2015-07-15T00:00:09.999Z, pane PaneInfo{isFirst=true, isLast=true, timing=ON_TIME, index=0, onTimeIndex=0}
Oct 27, 2018 2:07:43 AM org.apache.beam.sdk.nexmark.queries.Query10$3 processElement
INFO: Writing shard-00017-of-00025 with record timestamp 2015-07-15T00:00:09.999Z, window timestamp 2015-07-15T00:00:09.999Z, pane PaneInfo{isFirst=true, isLast=true, timing=ON_TIME, index=0, onTimeIndex=0}
Oct 27, 2018 2:07:43 AM org.apache.beam.sdk.nexmark.queries.Query10$3 processElement
INFO: Writing shard-00003-of-00025 with record timestamp 2015-07-15T00:00:09.999Z, window timestamp 2015-07-15T00:00:09.999Z, pane PaneInfo{isFirst=true, isLast=true, timing=ON_TIME, index=0, onTimeIndex=0}
Oct 27, 2018 2:07:43 AM org.apache.beam.sdk.nexmark.queries.Query10$3 processElement
INFO: Writing shard-00000-of-00025 with record timestamp 2015-07-15T00:00:09.999Z, window timestamp 2015-07-15T00:00:09.999Z, pane PaneInfo{isFirst=true, isLast=true, timing=ON_TIME, index=0, onTimeIndex=0}
Oct 27, 2018 2:07:43 AM org.apache.beam.sdk.nexmark.queries.Query10$3 processElement
INFO: Writing shard-00022-of-00025 with record timestamp 2015-07-15T00:00:09.999Z, window timestamp 2015-07-15T00:00:09.999Z, pane PaneInfo{isFirst=true, isLast=true, timing=ON_TIME, index=0, onTimeIndex=0}
Oct 27, 2018 2:07:43 AM org.apache.beam.sdk.util.MutationDetectors$CodedValueMutationDetector verifyUnmodifiedThrowingCheckedExceptions
WARNING: Coder of type class org.apache.beam.sdk.coders.KvCoder has a #structuralValue method which does not return true when the encoding of the elements is equal. Element KV{null, 2015-07-15T00:00:09.999Z shard-00008-of-00025 0 ON_TIME null
}
Oct 27, 2018 2:07:43 AM org.apache.beam.sdk.util.MutationDetectors$CodedValueMutationDetector verifyUnmodifiedThrowingCheckedExceptions
WARNING: Coder of type class org.apache.beam.sdk.coders.KvCoder has a #structuralValue method which does not return true when the encoding of the elements is equal. Element KV{null, 2015-07-15T00:00:09.999Z shard-00003-of-00025 0 ON_TIME null
}
Oct 27, 2018 2:07:43 AM org.apache.beam.sdk.util.MutationDetectors$CodedValueMutationDetector verifyUnmodifiedThrowingCheckedExceptions
WARNING: Coder of type class org.apache.beam.sdk.coders.KvCoder has a #structuralValue method which does not return true when the encoding of the elements is equal. Element KV{null, 2015-07-15T00:00:09.999Z shard-00019-of-00025 0 ON_TIME null
}
Oct 27, 2018 2:07:43 AM org.apache.beam.sdk.util.MutationDetectors$CodedValueMutationDetector verifyUnmodifiedThrowingCheckedExceptions
WARNING: Coder of type class org.apache.beam.sdk.coders.KvCoder has a #structuralValue method which does not return true when the encoding of the elements is equal. Element KV{null, 2015-07-15T00:00:09.999Z shard-00000-of-00025 0 ON_TIME null
}
Oct 27, 2018 2:07:43 AM org.apache.beam.sdk.util.MutationDetectors$CodedValueMutationDetector verifyUnmodifiedThrowingCheckedExceptions
WARNING: Coder of type class org.apache.beam.sdk.coders.KvCoder has a #structuralValue method which does not return true when the encoding of the elements is equal. Element KV{null, 2015-07-15T00:00:09.999Z shard-00022-of-00025 0 ON_TIME null
}
Oct 27, 2018 2:07:43 AM org.apache.beam.sdk.util.MutationDetectors$CodedValueMutationDetector verifyUnmodifiedThrowingCheckedExceptions
WARNING: Coder of type class org.apache.beam.sdk.coders.KvCoder has a #structuralValue method which does not return true when the encoding of the elements is equal. Element KV{null, 2015-07-15T00:00:09.999Z shard-00017-of-00025 0 ON_TIME null
}
Oct 27, 2018 2:07:43 AM org.apache.beam.sdk.util.MutationDetectors$CodedValueMutationDetector verifyUnmodifiedThrowingCheckedExceptions
WARNING: Coder of type class org.apache.beam.sdk.coders.KvCoder has a #structuralValue method which does not return true when the encoding of the elements is equal. Element KV{null, 2015-07-15T00:00:09.999Z shard-00006-of-00025 0 ON_TIME null
}
Oct 27, 2018 2:07:43 AM org.apache.beam.sdk.nexmark.queries.Query10$3 processElement
INFO: Writing shard-00023-of-00025 with record timestamp 2015-07-15T00:00:09.999Z, window timestamp 2015-07-15T00:00:09.999Z, pane PaneInfo{isFirst=true, isLast=true, timing=ON_TIME, index=0, onTimeIndex=0}
Oct 27, 2018 2:07:43 AM org.apache.beam.sdk.nexmark.queries.Query10$3 processElement
INFO: Writing shard-00007-of-00025 with record timestamp 2015-07-15T00:00:09.999Z, window timestamp 2015-07-15T00:00:09.999Z, pane PaneInfo{isFirst=true, isLast=true, timing=ON_TIME, index=0, onTimeIndex=0}
Oct 27, 2018 2:07:43 AM org.apache.beam.sdk.nexmark.queries.Query10$3 processElement
INFO: Writing shard-00014-of-00025 with record timestamp 2015-07-15T00:00:09.999Z, window timestamp 2015-07-15T00:00:09.999Z, pane PaneInfo{isFirst=true, isLast=true, timing=ON_TIME, index=0, onTimeIndex=0}
Oct 27, 2018 2:07:43 AM org.apache.beam.sdk.nexmark.queries.Query10$3 processElement
INFO: Writing shard-00016-of-00025 with record timestamp 2015-07-15T00:00:09.999Z, window timestamp 2015-07-15T00:00:09.999Z, pane PaneInfo{isFirst=true, isLast=true, timing=ON_TIME, index=0, onTimeIndex=0}
Oct 27, 2018 2:07:43 AM org.apache.beam.sdk.util.MutationDetectors$CodedValueMutationDetector verifyUnmodifiedThrowingCheckedExceptions
WARNING: Coder of type class org.apache.beam.sdk.coders.KvCoder has a #structuralValue method which does not return true when the encoding of the elements is equal. Element KV{null, 2015-07-15T00:00:09.999Z shard-00023-of-00025 0 ON_TIME null
}
Oct 27, 2018 2:07:43 AM org.apache.beam.sdk.nexmark.queries.Query10$3 processElement
INFO: Writing shard-00011-of-00025 with record timestamp 2015-07-15T00:00:09.999Z, window timestamp 2015-07-15T00:00:09.999Z, pane PaneInfo{isFirst=true, isLast=true, timing=ON_TIME, index=0, onTimeIndex=0}
Oct 27, 2018 2:07:43 AM org.apache.beam.sdk.nexmark.queries.Query10$3 processElement
INFO: Writing shard-00013-of-00025 with record timestamp 2015-07-15T00:00:09.999Z, window timestamp 2015-07-15T00:00:09.999Z, pane PaneInfo{isFirst=true, isLast=true, timing=ON_TIME, index=0, onTimeIndex=0}
Oct 27, 2018 2:07:43 AM org.apache.beam.sdk.nexmark.queries.Query10$3 processElement
INFO: Writing shard-00004-of-00025 with record timestamp 2015-07-15T00:00:09.999Z, window timestamp 2015-07-15T00:00:09.999Z, pane PaneInfo{isFirst=true, isLast=true, timing=ON_TIME, index=0, onTimeIndex=0}
Oct 27, 2018 2:07:43 AM org.apache.beam.sdk.util.MutationDetectors$CodedValueMutationDetector verifyUnmodifiedThrowingCheckedExceptions
WARNING: Coder of type class org.apache.beam.sdk.coders.KvCoder has a #structuralValue method which does not return true when the encoding of the elements is equal. Element KV{null, 2015-07-15T00:00:09.999Z shard-00007-of-00025 0 ON_TIME null
}
Oct 27, 2018 2:07:43 AM org.apache.beam.sdk.nexmark.queries.Query10$3 processElement
INFO: Writing shard-00012-of-00025 with record timestamp 2015-07-15T00:00:09.999Z, window timestamp 2015-07-15T00:00:09.999Z, pane PaneInfo{isFirst=true, isLast=true, timing=ON_TIME, index=0, onTimeIndex=0}
Oct 27, 2018 2:07:43 AM org.apache.beam.sdk.util.MutationDetectors$CodedValueMutationDetector verifyUnmodifiedThrowingCheckedExceptions
WARNING: Coder of type class org.apache.beam.sdk.coders.KvCoder has a #structuralValue method which does not return true when the encoding of the elements is equal. Element KV{null, 2015-07-15T00:00:09.999Z shard-00016-of-00025 0 ON_TIME null
}
Oct 27, 2018 2:07:43 AM org.apache.beam.sdk.nexmark.queries.Query10$3 processElement
INFO: Writing shard-00010-of-00025 with record timestamp 2015-07-15T00:00:09.999Z, window timestamp 2015-07-15T00:00:09.999Z, pane PaneInfo{isFirst=true, isLast=true, timing=ON_TIME, index=0, onTimeIndex=0}
Oct 27, 2018 2:07:43 AM org.apache.beam.sdk.util.MutationDetectors$CodedValueMutationDetector verifyUnmodifiedThrowingCheckedExceptions
WARNING: Coder of type class org.apache.beam.sdk.coders.KvCoder has a #structuralValue method which does not return true when the encoding of the elements is equal. Element KV{null, 2015-07-15T00:00:09.999Z shard-00011-of-00025 0 ON_TIME null
}
Oct 27, 2018 2:07:43 AM org.apache.beam.sdk.util.MutationDetectors$CodedValueMutationDetector verifyUnmodifiedThrowingCheckedExceptions
WARNING: Coder of type class org.apache.beam.sdk.coders.KvCoder has a #structuralValue method which does not return true when the encoding of the elements is equal. Element KV{null, 2015-07-15T00:00:09.999Z shard-00013-of-00025 0 ON_TIME null
}
Oct 27, 2018 2:07:43 AM org.apache.beam.sdk.util.MutationDetectors$CodedValueMutationDetector verifyUnmodifiedThrowingCheckedExceptions
WARNING: Coder of type class org.apache.beam.sdk.coders.KvCoder has a #structuralValue method which does not return true when the encoding of the elements is equal. Element KV{null, 2015-07-15T00:00:09.999Z shard-00004-of-00025 0 ON_TIME null
}
Oct 27, 2018 2:07:43 AM org.apache.beam.sdk.util.MutationDetectors$CodedValueMutationDetector verifyUnmodifiedThrowingCheckedExceptions
WARNING: Coder of type class org.apache.beam.sdk.coders.KvCoder has a #structuralValue method which does not return true when the encoding of the elements is equal. Element KV{null, 2015-07-15T00:00:09.999Z shard-00012-of-00025 0 ON_TIME null
}
Oct 27, 2018 2:07:43 AM org.apache.beam.sdk.nexmark.queries.Query10$3 processElement
INFO: Writing shard-00020-of-00025 with record timestamp 2015-07-15T00:00:09.999Z, window timestamp 2015-07-15T00:00:09.999Z, pane PaneInfo{isFirst=true, isLast=true, timing=ON_TIME, index=0, onTimeIndex=0}
Oct 27, 2018 2:07:43 AM org.apache.beam.sdk.util.MutationDetectors$CodedValueMutationDetector verifyUnmodifiedThrowingCheckedExceptions
WARNING: Coder of type class org.apache.beam.sdk.coders.KvCoder has a #structuralValue method which does not return true when the encoding of the elements is equal. Element KV{null, 2015-07-15T00:00:09.999Z shard-00014-of-00025 0 ON_TIME null
}
Oct 27, 2018 2:07:43 AM org.apache.beam.sdk.nexmark.queries.Query10$3 processElement
INFO: Writing shard-00002-of-00025 with record timestamp 2015-07-15T00:00:09.999Z, window timestamp 2015-07-15T00:00:09.999Z, pane PaneInfo{isFirst=true, isLast=true, timing=ON_TIME, index=0, onTimeIndex=0}
Oct 27, 2018 2:07:43 AM org.apache.beam.sdk.nexmark.queries.Query10$3 processElement
INFO: Writing shard-00018-of-00025 with record timestamp 2015-07-15T00:00:09.999Z, window timestamp 2015-07-15T00:00:09.999Z, pane PaneInfo{isFirst=true, isLast=true, timing=ON_TIME, index=0, onTimeIndex=0}
Oct 27, 2018 2:07:43 AM org.apache.beam.sdk.util.MutationDetectors$CodedValueMutationDetector verifyUnmodifiedThrowingCheckedExceptions
WARNING: Coder of type class org.apache.beam.sdk.coders.KvCoder has a #structuralValue method which does not return true when the encoding of the elements is equal. Element KV{null, 2015-07-15T00:00:09.999Z shard-00010-of-00025 0 ON_TIME null
}
Oct 27, 2018 2:07:43 AM org.apache.beam.sdk.nexmark.queries.Query10$3 processElement
INFO: Writing shard-00009-of-00025 with record timestamp 2015-07-15T00:00:09.999Z, window timestamp 2015-07-15T00:00:09.999Z, pane PaneInfo{isFirst=true, isLast=true, timing=ON_TIME, index=0, onTimeIndex=0}
Oct 27, 2018 2:07:43 AM org.apache.beam.sdk.util.MutationDetectors$CodedValueMutationDetector verifyUnmodifiedThrowingCheckedExceptions
WARNING: Coder of type class org.apache.beam.sdk.coders.KvCoder has a #structuralValue method which does not return true when the encoding of the elements is equal. Element KV{null, 2015-07-15T00:00:09.999Z shard-00002-of-00025 0 ON_TIME null
}
Oct 27, 2018 2:07:43 AM org.apache.beam.sdk.nexmark.queries.Query10$3 processElement
INFO: Writing shard-00024-of-00025 with record timestamp 2015-07-15T00:00:09.999Z, window timestamp 2015-07-15T00:00:09.999Z, pane PaneInfo{isFirst=true, isLast=true, timing=ON_TIME, index=0, onTimeIndex=0}
Oct 27, 2018 2:07:43 AM org.apache.beam.sdk.util.MutationDetectors$CodedValueMutationDetector verifyUnmodifiedThrowingCheckedExceptions
WARNING: Coder of type class org.apache.beam.sdk.coders.KvCoder has a #structuralValue method which does not return true when the encoding of the elements is equal. Element KV{null, 2015-07-15T00:00:09.999Z shard-00018-of-00025 0 ON_TIME null
}
Oct 27, 2018 2:07:43 AM org.apache.beam.sdk.nexmark.queries.Query10$3 processElement
INFO: Writing shard-00015-of-00025 with record timestamp 2015-07-15T00:00:09.999Z, window timestamp 2015-07-15T00:00:09.999Z, pane PaneInfo{isFirst=true, isLast=true, timing=ON_TIME, index=0, onTimeIndex=0}
Oct 27, 2018 2:07:43 AM org.apache.beam.sdk.util.MutationDetectors$CodedValueMutationDetector verifyUnmodifiedThrowingCheckedExceptions
WARNING: Coder of type class org.apache.beam.sdk.coders.KvCoder has a #structuralValue method which does not return true when the encoding of the elements is equal. Element KV{null, 2015-07-15T00:00:09.999Z shard-00009-of-00025 0 ON_TIME null
}
Oct 27, 2018 2:07:43 AM org.apache.beam.sdk.nexmark.queries.Query10$3 processElement
INFO: Writing shard-00021-of-00025 with record timestamp 2015-07-15T00:00:09.999Z, window timestamp 2015-07-15T00:00:09.999Z, pane PaneInfo{isFirst=true, isLast=true, timing=ON_TIME, index=0, onTimeIndex=0}
Oct 27, 2018 2:07:43 AM org.apache.beam.sdk.nexmark.queries.Query10$3 processElement
INFO: Writing shard-00001-of-00025 with record timestamp 2015-07-15T00:00:09.999Z, window timestamp 2015-07-15T00:00:09.999Z, pane PaneInfo{isFirst=true, isLast=true, timing=ON_TIME, index=0, onTimeIndex=0}
Oct 27, 2018 2:07:43 AM org.apache.beam.sdk.nexmark.queries.Query10$3 processElement
INFO: Writing shard-00005-of-00025 with record timestamp 2015-07-15T00:00:09.999Z, window timestamp 2015-07-15T00:00:09.999Z, pane PaneInfo{isFirst=true, isLast=true, timing=ON_TIME, index=0, onTimeIndex=0}
Oct 27, 2018 2:07:43 AM org.apache.beam.sdk.util.MutationDetectors$CodedValueMutationDetector verifyUnmodifiedThrowingCheckedExceptions
WARNING: Coder of type class org.apache.beam.sdk.coders.KvCoder has a #structuralValue method which does not return true when the encoding of the elements is equal. Element KV{null, 2015-07-15T00:00:09.999Z shard-00020-of-00025 0 ON_TIME null
}
Oct 27, 2018 2:07:43 AM org.apache.beam.sdk.util.MutationDetectors$CodedValueMutationDetector verifyUnmodifiedThrowingCheckedExceptions
WARNING: Coder of type class org.apache.beam.sdk.coders.KvCoder has a #structuralValue method which does not return true when the encoding of the elements is equal. Element KV{null, 2015-07-15T00:00:09.999Z shard-00015-of-00025 0 ON_TIME null
}
Oct 27, 2018 2:07:43 AM org.apache.beam.sdk.util.MutationDetectors$CodedValueMutationDetector verifyUnmodifiedThrowingCheckedExceptions
WARNING: Coder of type class org.apache.beam.sdk.coders.KvCoder has a #structuralValue method which does not return true when the encoding of the elements is equal. Element KV{null, 2015-07-15T00:00:09.999Z shard-00024-of-00025 0 ON_TIME null
}
Oct 27, 2018 2:07:43 AM org.apache.beam.sdk.util.MutationDetectors$CodedValueMutationDetector verifyUnmodifiedThrowingCheckedExceptions
WARNING: Coder of type class org.apache.beam.sdk.coders.KvCoder has a #structuralValue method which does not return true when the encoding of the elements is equal. Element KV{null, 2015-07-15T00:00:09.999Z shard-00001-of-00025 0 ON_TIME null
}
Oct 27, 2018 2:07:43 AM org.apache.beam.sdk.util.MutationDetectors$CodedValueMutationDetector verifyUnmodifiedThrowingCheckedExceptions
WARNING: Coder of type class org.apache.beam.sdk.coders.KvCoder has a #structuralValue method which does not return true when the encoding of the elements is equal. Element KV{null, 2015-07-15T00:00:09.999Z shard-00021-of-00025 0 ON_TIME null
}
Oct 27, 2018 2:07:43 AM org.apache.beam.sdk.util.MutationDetectors$CodedValueMutationDetector verifyUnmodifiedThrowingCheckedExceptions
WARNING: Coder of type class org.apache.beam.sdk.coders.KvCoder has a #structuralValue method which does not return true when the encoding of the elements is equal. Element KV{null, 2015-07-15T00:00:09.999Z shard-00005-of-00025 0 ON_TIME null
}
Oct 27, 2018 2:07:43 AM org.apache.beam.sdk.nexmark.queries.Query10$4 processElement
INFO: Index with record timestamp %s, window timestamp %s, pane %s
Oct 27, 2018 2:07:43 AM org.apache.beam.sdk.util.MutationDetectors$CodedValueMutationDetector verifyUnmodifiedThrowingCheckedExceptions
WARNING: Coder of type class org.apache.beam.sdk.coders.KvCoder has a #structuralValue method which does not return true when the encoding of the elements is equal. Element KV{null, [2015-07-15T00:00:09.999Z shard-00008-of-00025 0 ON_TIME null
, 2015-07-15T00:00:09.999Z shard-00003-of-00025 0 ON_TIME null
, 2015-07-15T00:00:09.999Z shard-00019-of-00025 0 ON_TIME null
, 2015-07-15T00:00:09.999Z shard-00022-of-00025 0 ON_TIME null
, 2015-07-15T00:00:09.999Z shard-00017-of-00025 0 ON_TIME null
, 2015-07-15T00:00:09.999Z shard-00006-of-00025 0 ON_TIME null
, 2015-07-15T00:00:09.999Z shard-00023-of-00025 0 ON_TIME null
, 2015-07-15T00:00:09.999Z shard-00007-of-00025 0 ON_TIME null
, 2015-07-15T00:00:09.999Z shard-00016-of-00025 0 ON_TIME null
, 2015-07-15T00:00:09.999Z shard-00011-of-00025 0 ON_TIME null
, 2015-07-15T00:00:09.999Z shard-00013-of-00025 0 ON_TIME null
, 2015-07-15T00:00:09.999Z shard-00004-of-00025 0 ON_TIME null
, 2015-07-15T00:00:09.999Z shard-00012-of-00025 0 ON_TIME null
, 2015-07-15T00:00:09.999Z shard-00014-of-00025 0 ON_TIME null
, 2015-07-15T00:00:09.999Z shard-00010-of-00025 0 ON_TIME null
, 2015-07-15T00:00:09.999Z shard-00000-of-00025 0 ON_TIME null
, 2015-07-15T00:00:09.999Z shard-00002-of-00025 0 ON_TIME null
, 2015-07-15T00:00:09.999Z shard-00018-of-00025 0 ON_TIME null
, 2015-07-15T00:00:09.999Z shard-00009-of-00025 0 ON_TIME null
, 2015-07-15T00:00:09.999Z shard-00020-of-00025 0 ON_TIME null
, 2015-07-15T00:00:09.999Z shard-00015-of-00025 0 ON_TIME null
, 2015-07-15T00:00:09.999Z shard-00024-of-00025 0 ON_TIME null
, 2015-07-15T00:00:09.999Z shard-00001-of-00025 0 ON_TIME null
, 2015-07-15T00:00:09.999Z shard-00021-of-00025 0 ON_TIME null
, 2015-07-15T00:00:09.999Z shard-00005-of-00025 0 ON_TIME null
]}
Oct 27, 2018 2:07:43 AM org.apache.beam.sdk.util.MutationDetectors$CodedValueMutationDetector verifyUnmodifiedThrowingCheckedExceptions
WARNING: Coder of type class org.apache.beam.sdk.coders.KvCoder has a #structuralValue method which does not return true when the encoding of the elements is equal. Element KV{null, [2015-07-15T00:00:09.999Z shard-00008-of-00025 0 ON_TIME null
, 2015-07-15T00:00:09.999Z shard-00003-of-00025 0 ON_TIME null
, 2015-07-15T00:00:09.999Z shard-00019-of-00025 0 ON_TIME null
, 2015-07-15T00:00:09.999Z shard-00022-of-00025 0 ON_TIME null
, 2015-07-15T00:00:09.999Z shard-00017-of-00025 0 ON_TIME null
, 2015-07-15T00:00:09.999Z shard-00006-of-00025 0 ON_TIME null
, 2015-07-15T00:00:09.999Z shard-00023-of-00025 0 ON_TIME null
, 2015-07-15T00:00:09.999Z shard-00007-of-00025 0 ON_TIME null
, 2015-07-15T00:00:09.999Z shard-00016-of-00025 0 ON_TIME null
, 2015-07-15T00:00:09.999Z shard-00011-of-00025 0 ON_TIME null
, 2015-07-15T00:00:09.999Z shard-00013-of-00025 0 ON_TIME null
, 2015-07-15T00:00:09.999Z shard-00004-of-00025 0 ON_TIME null
, 2015-07-15T00:00:09.999Z shard-00012-of-00025 0 ON_TIME null
, 2015-07-15T00:00:09.999Z shard-00014-of-00025 0 ON_TIME null
, 2015-07-15T00:00:09.999Z shard-00010-of-00025 0 ON_TIME null
, 2015-07-15T00:00:09.999Z shard-00000-of-00025 0 ON_TIME null
, 2015-07-15T00:00:09.999Z shard-00002-of-00025 0 ON_TIME null
, 2015-07-15T00:00:09.999Z shard-00018-of-00025 0 ON_TIME null
, 2015-07-15T00:00:09.999Z shard-00009-of-00025 0 ON_TIME null
, 2015-07-15T00:00:09.999Z shard-00020-of-00025 0 ON_TIME null
, 2015-07-15T00:00:09.999Z shard-00015-of-00025 0 ON_TIME null
, 2015-07-15T00:00:09.999Z shard-00024-of-00025 0 ON_TIME null
, 2015-07-15T00:00:09.999Z shard-00001-of-00025 0 ON_TIME null
, 2015-07-15T00:00:09.999Z shard-00021-of-00025 0 ON_TIME null
, 2015-07-15T00:00:09.999Z shard-00005-of-00025 0 ON_TIME null
]}
2018-10-27T02:07:43.562Z Waiting for main pipeline to 'finish'
2018-10-27T02:07:43.563Z DONE Query10
2018-10-27T02:07:43.563Z Running query:11; exportSummaryToBigQuery:true
2018-10-27T02:07:43.565Z Generating 100000 events in batch mode
2018-10-27T02:07:46.420Z Waiting for main pipeline to 'finish'
2018-10-27T02:07:46.420Z DONE Query11
2018-10-27T02:07:46.421Z Running query:12; exportSummaryToBigQuery:true
2018-10-27T02:07:46.422Z Generating 100000 events in batch mode
2018-10-27T02:07:48.389Z Waiting for main pipeline to 'finish'
2018-10-27T02:07:48.390Z DONE Query12
> Task :beam-sdks-java-nexmark:run FAILED
:beam-sdks-java-nexmark:run (Thread[Task worker for ':' Thread 9,5,main]) completed. Took 1 mins 4.233 secs.
FAILURE: Build failed with an exception.
* What went wrong:
Execution failed for task ':beam-sdks-java-nexmark:run'.
> Process 'command '/usr/local/asfpackages/java/jdk1.8.0_172/bin/java'' finished with non-zero exit value 1
* Try:
Run with --stacktrace option to get the stack trace. Run with --debug option to get more log output. Run with --scan to get full insights.
* Get more help at https://help.gradle.org
Deprecated Gradle features were used in this build, making it incompatible with Gradle 5.0.
Use '--warning-mode all' to show the individual deprecation warnings.
See https://docs.gradle.org/4.10.2/userguide/command_line_interface.html#sec:command_line_warnings
BUILD FAILED in 3m 51s
65 actionable tasks: 61 executed, 4 from cache
Publishing build scan...
https://gradle.com/s/aaco3uxpgyotg
Build step 'Invoke Gradle script' changed build result to FAILURE
Build step 'Invoke Gradle script' marked build as failure
---------------------------------------------------------------------
To unsubscribe, e-mail: builds-unsubscribe@beam.apache.org
For additional commands, e-mail: builds-help@beam.apache.org
Build failed in Jenkins: beam_PostCommit_Java_Nexmark_Direct #946
Posted by Apache Jenkins Server <je...@builds.apache.org>.
See <https://builds.apache.org/job/beam_PostCommit_Java_Nexmark_Direct/946/display/redirect?page=changes>
Changes:
[ccy] Support multiple versions of snappy for tfrecordio
------------------------------------------
[...truncated 190.46 KB...]
INFO: shard-00022-of-00025 with timestamp 2015-07-15T00:00:09.999Z has 0 actually late and 4066 on-time elements in pane PaneInfo{isFirst=true, isLast=true, timing=ON_TIME, index=0, onTimeIndex=0} for window 2015-07-15T00:00:09.999Z
Oct 27, 2018 12:19:56 AM org.apache.beam.sdk.nexmark.queries.Query10$2 processElement
INFO: shard-00014-of-00025 with timestamp 2015-07-15T00:00:09.999Z has 0 actually late and 4134 on-time elements in pane PaneInfo{isFirst=true, isLast=true, timing=ON_TIME, index=0, onTimeIndex=0} for window 2015-07-15T00:00:09.999Z
Oct 27, 2018 12:19:56 AM org.apache.beam.sdk.nexmark.queries.Query10$2 processElement
INFO: shard-00004-of-00025 with timestamp 2015-07-15T00:00:09.999Z has 0 actually late and 3985 on-time elements in pane PaneInfo{isFirst=true, isLast=true, timing=ON_TIME, index=0, onTimeIndex=0} for window 2015-07-15T00:00:09.999Z
Oct 27, 2018 12:19:56 AM org.apache.beam.sdk.nexmark.queries.Query10$2 processElement
INFO: shard-00006-of-00025 with timestamp 2015-07-15T00:00:09.999Z has 0 actually late and 3992 on-time elements in pane PaneInfo{isFirst=true, isLast=true, timing=ON_TIME, index=0, onTimeIndex=0} for window 2015-07-15T00:00:09.999Z
Oct 27, 2018 12:19:56 AM org.apache.beam.sdk.nexmark.queries.Query10$2 processElement
INFO: shard-00019-of-00025 with timestamp 2015-07-15T00:00:09.999Z has 0 actually late and 3909 on-time elements in pane PaneInfo{isFirst=true, isLast=true, timing=ON_TIME, index=0, onTimeIndex=0} for window 2015-07-15T00:00:09.999Z
Oct 27, 2018 12:19:56 AM org.apache.beam.sdk.nexmark.queries.Query10$2 processElement
INFO: shard-00007-of-00025 with timestamp 2015-07-15T00:00:09.999Z has 0 actually late and 3984 on-time elements in pane PaneInfo{isFirst=true, isLast=true, timing=ON_TIME, index=0, onTimeIndex=0} for window 2015-07-15T00:00:09.999Z
Oct 27, 2018 12:19:56 AM org.apache.beam.sdk.nexmark.queries.Query10$2 processElement
INFO: shard-00008-of-00025 with timestamp 2015-07-15T00:00:09.999Z has 0 actually late and 3939 on-time elements in pane PaneInfo{isFirst=true, isLast=true, timing=ON_TIME, index=0, onTimeIndex=0} for window 2015-07-15T00:00:09.999Z
Oct 27, 2018 12:19:56 AM org.apache.beam.sdk.nexmark.queries.Query10$2 processElement
INFO: shard-00009-of-00025 with timestamp 2015-07-15T00:00:09.999Z has 0 actually late and 4056 on-time elements in pane PaneInfo{isFirst=true, isLast=true, timing=ON_TIME, index=0, onTimeIndex=0} for window 2015-07-15T00:00:09.999Z
Oct 27, 2018 12:19:56 AM org.apache.beam.sdk.nexmark.queries.Query10$2 processElement
INFO: shard-00021-of-00025 with timestamp 2015-07-15T00:00:09.999Z has 0 actually late and 3969 on-time elements in pane PaneInfo{isFirst=true, isLast=true, timing=ON_TIME, index=0, onTimeIndex=0} for window 2015-07-15T00:00:09.999Z
Oct 27, 2018 12:19:56 AM org.apache.beam.sdk.nexmark.queries.Query10$2 processElement
INFO: shard-00020-of-00025 with timestamp 2015-07-15T00:00:09.999Z has 0 actually late and 4021 on-time elements in pane PaneInfo{isFirst=true, isLast=true, timing=ON_TIME, index=0, onTimeIndex=0} for window 2015-07-15T00:00:09.999Z
Oct 27, 2018 12:19:56 AM org.apache.beam.sdk.nexmark.queries.Query10$2 processElement
INFO: shard-00002-of-00025 with timestamp 2015-07-15T00:00:09.999Z has 0 actually late and 4002 on-time elements in pane PaneInfo{isFirst=true, isLast=true, timing=ON_TIME, index=0, onTimeIndex=0} for window 2015-07-15T00:00:09.999Z
Oct 27, 2018 12:19:56 AM org.apache.beam.sdk.nexmark.queries.Query10$2 processElement
INFO: shard-00015-of-00025 with timestamp 2015-07-15T00:00:09.999Z has 0 actually late and 4041 on-time elements in pane PaneInfo{isFirst=true, isLast=true, timing=ON_TIME, index=0, onTimeIndex=0} for window 2015-07-15T00:00:09.999Z
Oct 27, 2018 12:19:56 AM org.apache.beam.sdk.nexmark.queries.Query10$2 processElement
INFO: shard-00005-of-00025 with timestamp 2015-07-15T00:00:09.999Z has 0 actually late and 4060 on-time elements in pane PaneInfo{isFirst=true, isLast=true, timing=ON_TIME, index=0, onTimeIndex=0} for window 2015-07-15T00:00:09.999Z
Oct 27, 2018 12:19:56 AM org.apache.beam.sdk.nexmark.queries.Query10$2 processElement
INFO: shard-00018-of-00025 with timestamp 2015-07-15T00:00:09.999Z has 0 actually late and 3987 on-time elements in pane PaneInfo{isFirst=true, isLast=true, timing=ON_TIME, index=0, onTimeIndex=0} for window 2015-07-15T00:00:09.999Z
Oct 27, 2018 12:19:56 AM org.apache.beam.sdk.nexmark.queries.Query10$2 processElement
INFO: shard-00001-of-00025 with timestamp 2015-07-15T00:00:09.999Z has 0 actually late and 3953 on-time elements in pane PaneInfo{isFirst=true, isLast=true, timing=ON_TIME, index=0, onTimeIndex=0} for window 2015-07-15T00:00:09.999Z
Oct 27, 2018 12:19:56 AM org.apache.beam.sdk.nexmark.queries.Query10$2 processElement
INFO: shard-00024-of-00025 with timestamp 2015-07-15T00:00:09.999Z has 0 actually late and 4127 on-time elements in pane PaneInfo{isFirst=true, isLast=true, timing=ON_TIME, index=0, onTimeIndex=0} for window 2015-07-15T00:00:09.999Z
Oct 27, 2018 12:19:56 AM org.apache.beam.sdk.nexmark.queries.Query10$3 processElement
INFO: Writing shard-00013-of-00025 with record timestamp 2015-07-15T00:00:09.999Z, window timestamp 2015-07-15T00:00:09.999Z, pane PaneInfo{isFirst=true, isLast=true, timing=ON_TIME, index=0, onTimeIndex=0}
Oct 27, 2018 12:19:56 AM org.apache.beam.sdk.nexmark.queries.Query10$3 processElement
INFO: Writing shard-00000-of-00025 with record timestamp 2015-07-15T00:00:09.999Z, window timestamp 2015-07-15T00:00:09.999Z, pane PaneInfo{isFirst=true, isLast=true, timing=ON_TIME, index=0, onTimeIndex=0}
Oct 27, 2018 12:19:56 AM org.apache.beam.sdk.nexmark.queries.Query10$3 processElement
INFO: Writing shard-00003-of-00025 with record timestamp 2015-07-15T00:00:09.999Z, window timestamp 2015-07-15T00:00:09.999Z, pane PaneInfo{isFirst=true, isLast=true, timing=ON_TIME, index=0, onTimeIndex=0}
Oct 27, 2018 12:19:56 AM org.apache.beam.sdk.nexmark.queries.Query10$3 processElement
INFO: Writing shard-00023-of-00025 with record timestamp 2015-07-15T00:00:09.999Z, window timestamp 2015-07-15T00:00:09.999Z, pane PaneInfo{isFirst=true, isLast=true, timing=ON_TIME, index=0, onTimeIndex=0}
Oct 27, 2018 12:19:56 AM org.apache.beam.sdk.nexmark.queries.Query10$3 processElement
INFO: Writing shard-00017-of-00025 with record timestamp 2015-07-15T00:00:09.999Z, window timestamp 2015-07-15T00:00:09.999Z, pane PaneInfo{isFirst=true, isLast=true, timing=ON_TIME, index=0, onTimeIndex=0}
Oct 27, 2018 12:19:56 AM org.apache.beam.sdk.nexmark.queries.Query10$3 processElement
INFO: Writing shard-00010-of-00025 with record timestamp 2015-07-15T00:00:09.999Z, window timestamp 2015-07-15T00:00:09.999Z, pane PaneInfo{isFirst=true, isLast=true, timing=ON_TIME, index=0, onTimeIndex=0}
Oct 27, 2018 12:19:56 AM org.apache.beam.sdk.nexmark.queries.Query10$3 processElement
INFO: Writing shard-00016-of-00025 with record timestamp 2015-07-15T00:00:09.999Z, window timestamp 2015-07-15T00:00:09.999Z, pane PaneInfo{isFirst=true, isLast=true, timing=ON_TIME, index=0, onTimeIndex=0}
Oct 27, 2018 12:19:56 AM org.apache.beam.sdk.util.MutationDetectors$CodedValueMutationDetector verifyUnmodifiedThrowingCheckedExceptions
WARNING: Coder of type class org.apache.beam.sdk.coders.KvCoder has a #structuralValue method which does not return true when the encoding of the elements is equal. Element KV{null, 2015-07-15T00:00:09.999Z shard-00010-of-00025 0 ON_TIME null
}
Oct 27, 2018 12:19:56 AM org.apache.beam.sdk.util.MutationDetectors$CodedValueMutationDetector verifyUnmodifiedThrowingCheckedExceptions
WARNING: Coder of type class org.apache.beam.sdk.coders.KvCoder has a #structuralValue method which does not return true when the encoding of the elements is equal. Element KV{null, 2015-07-15T00:00:09.999Z shard-00013-of-00025 0 ON_TIME null
}
Oct 27, 2018 12:19:56 AM org.apache.beam.sdk.util.MutationDetectors$CodedValueMutationDetector verifyUnmodifiedThrowingCheckedExceptions
WARNING: Coder of type class org.apache.beam.sdk.coders.KvCoder has a #structuralValue method which does not return true when the encoding of the elements is equal. Element KV{null, 2015-07-15T00:00:09.999Z shard-00023-of-00025 0 ON_TIME null
}
Oct 27, 2018 12:19:56 AM org.apache.beam.sdk.util.MutationDetectors$CodedValueMutationDetector verifyUnmodifiedThrowingCheckedExceptions
WARNING: Coder of type class org.apache.beam.sdk.coders.KvCoder has a #structuralValue method which does not return true when the encoding of the elements is equal. Element KV{null, 2015-07-15T00:00:09.999Z shard-00017-of-00025 0 ON_TIME null
}
Oct 27, 2018 12:19:56 AM org.apache.beam.sdk.util.MutationDetectors$CodedValueMutationDetector verifyUnmodifiedThrowingCheckedExceptions
WARNING: Coder of type class org.apache.beam.sdk.coders.KvCoder has a #structuralValue method which does not return true when the encoding of the elements is equal. Element KV{null, 2015-07-15T00:00:09.999Z shard-00003-of-00025 0 ON_TIME null
}
Oct 27, 2018 12:19:56 AM org.apache.beam.sdk.util.MutationDetectors$CodedValueMutationDetector verifyUnmodifiedThrowingCheckedExceptions
WARNING: Coder of type class org.apache.beam.sdk.coders.KvCoder has a #structuralValue method which does not return true when the encoding of the elements is equal. Element KV{null, 2015-07-15T00:00:09.999Z shard-00000-of-00025 0 ON_TIME null
}
Oct 27, 2018 12:19:56 AM org.apache.beam.sdk.util.MutationDetectors$CodedValueMutationDetector verifyUnmodifiedThrowingCheckedExceptions
WARNING: Coder of type class org.apache.beam.sdk.coders.KvCoder has a #structuralValue method which does not return true when the encoding of the elements is equal. Element KV{null, 2015-07-15T00:00:09.999Z shard-00016-of-00025 0 ON_TIME null
}
Oct 27, 2018 12:19:56 AM org.apache.beam.sdk.nexmark.queries.Query10$3 processElement
INFO: Writing shard-00011-of-00025 with record timestamp 2015-07-15T00:00:09.999Z, window timestamp 2015-07-15T00:00:09.999Z, pane PaneInfo{isFirst=true, isLast=true, timing=ON_TIME, index=0, onTimeIndex=0}
Oct 27, 2018 12:19:56 AM org.apache.beam.sdk.nexmark.queries.Query10$3 processElement
INFO: Writing shard-00014-of-00025 with record timestamp 2015-07-15T00:00:09.999Z, window timestamp 2015-07-15T00:00:09.999Z, pane PaneInfo{isFirst=true, isLast=true, timing=ON_TIME, index=0, onTimeIndex=0}
Oct 27, 2018 12:19:56 AM org.apache.beam.sdk.nexmark.queries.Query10$3 processElement
INFO: Writing shard-00004-of-00025 with record timestamp 2015-07-15T00:00:09.999Z, window timestamp 2015-07-15T00:00:09.999Z, pane PaneInfo{isFirst=true, isLast=true, timing=ON_TIME, index=0, onTimeIndex=0}
Oct 27, 2018 12:19:56 AM org.apache.beam.sdk.nexmark.queries.Query10$3 processElement
INFO: Writing shard-00012-of-00025 with record timestamp 2015-07-15T00:00:09.999Z, window timestamp 2015-07-15T00:00:09.999Z, pane PaneInfo{isFirst=true, isLast=true, timing=ON_TIME, index=0, onTimeIndex=0}
Oct 27, 2018 12:19:56 AM org.apache.beam.sdk.nexmark.queries.Query10$3 processElement
INFO: Writing shard-00022-of-00025 with record timestamp 2015-07-15T00:00:09.999Z, window timestamp 2015-07-15T00:00:09.999Z, pane PaneInfo{isFirst=true, isLast=true, timing=ON_TIME, index=0, onTimeIndex=0}
Oct 27, 2018 12:19:56 AM org.apache.beam.sdk.nexmark.queries.Query10$3 processElement
INFO: Writing shard-00006-of-00025 with record timestamp 2015-07-15T00:00:09.999Z, window timestamp 2015-07-15T00:00:09.999Z, pane PaneInfo{isFirst=true, isLast=true, timing=ON_TIME, index=0, onTimeIndex=0}
Oct 27, 2018 12:19:56 AM org.apache.beam.sdk.nexmark.queries.Query10$3 processElement
INFO: Writing shard-00019-of-00025 with record timestamp 2015-07-15T00:00:09.999Z, window timestamp 2015-07-15T00:00:09.999Z, pane PaneInfo{isFirst=true, isLast=true, timing=ON_TIME, index=0, onTimeIndex=0}
Oct 27, 2018 12:19:56 AM org.apache.beam.sdk.util.MutationDetectors$CodedValueMutationDetector verifyUnmodifiedThrowingCheckedExceptions
WARNING: Coder of type class org.apache.beam.sdk.coders.KvCoder has a #structuralValue method which does not return true when the encoding of the elements is equal. Element KV{null, 2015-07-15T00:00:09.999Z shard-00011-of-00025 0 ON_TIME null
}
Oct 27, 2018 12:19:56 AM org.apache.beam.sdk.nexmark.queries.Query10$3 processElement
INFO: Writing shard-00007-of-00025 with record timestamp 2015-07-15T00:00:09.999Z, window timestamp 2015-07-15T00:00:09.999Z, pane PaneInfo{isFirst=true, isLast=true, timing=ON_TIME, index=0, onTimeIndex=0}
Oct 27, 2018 12:19:56 AM org.apache.beam.sdk.nexmark.queries.Query10$3 processElement
INFO: Writing shard-00008-of-00025 with record timestamp 2015-07-15T00:00:09.999Z, window timestamp 2015-07-15T00:00:09.999Z, pane PaneInfo{isFirst=true, isLast=true, timing=ON_TIME, index=0, onTimeIndex=0}
Oct 27, 2018 12:19:56 AM org.apache.beam.sdk.util.MutationDetectors$CodedValueMutationDetector verifyUnmodifiedThrowingCheckedExceptions
WARNING: Coder of type class org.apache.beam.sdk.coders.KvCoder has a #structuralValue method which does not return true when the encoding of the elements is equal. Element KV{null, 2015-07-15T00:00:09.999Z shard-00014-of-00025 0 ON_TIME null
}
Oct 27, 2018 12:19:56 AM org.apache.beam.sdk.util.MutationDetectors$CodedValueMutationDetector verifyUnmodifiedThrowingCheckedExceptions
WARNING: Coder of type class org.apache.beam.sdk.coders.KvCoder has a #structuralValue method which does not return true when the encoding of the elements is equal. Element KV{null, 2015-07-15T00:00:09.999Z shard-00004-of-00025 0 ON_TIME null
}
Oct 27, 2018 12:19:56 AM org.apache.beam.sdk.util.MutationDetectors$CodedValueMutationDetector verifyUnmodifiedThrowingCheckedExceptions
WARNING: Coder of type class org.apache.beam.sdk.coders.KvCoder has a #structuralValue method which does not return true when the encoding of the elements is equal. Element KV{null, 2015-07-15T00:00:09.999Z shard-00012-of-00025 0 ON_TIME null
}
Oct 27, 2018 12:19:56 AM org.apache.beam.sdk.util.MutationDetectors$CodedValueMutationDetector verifyUnmodifiedThrowingCheckedExceptions
WARNING: Coder of type class org.apache.beam.sdk.coders.KvCoder has a #structuralValue method which does not return true when the encoding of the elements is equal. Element KV{null, 2015-07-15T00:00:09.999Z shard-00022-of-00025 0 ON_TIME null
}
Oct 27, 2018 12:19:56 AM org.apache.beam.sdk.util.MutationDetectors$CodedValueMutationDetector verifyUnmodifiedThrowingCheckedExceptions
WARNING: Coder of type class org.apache.beam.sdk.coders.KvCoder has a #structuralValue method which does not return true when the encoding of the elements is equal. Element KV{null, 2015-07-15T00:00:09.999Z shard-00019-of-00025 0 ON_TIME null
}
Oct 27, 2018 12:19:56 AM org.apache.beam.sdk.util.MutationDetectors$CodedValueMutationDetector verifyUnmodifiedThrowingCheckedExceptions
WARNING: Coder of type class org.apache.beam.sdk.coders.KvCoder has a #structuralValue method which does not return true when the encoding of the elements is equal. Element KV{null, 2015-07-15T00:00:09.999Z shard-00006-of-00025 0 ON_TIME null
}
Oct 27, 2018 12:19:56 AM org.apache.beam.sdk.util.MutationDetectors$CodedValueMutationDetector verifyUnmodifiedThrowingCheckedExceptions
WARNING: Coder of type class org.apache.beam.sdk.coders.KvCoder has a #structuralValue method which does not return true when the encoding of the elements is equal. Element KV{null, 2015-07-15T00:00:09.999Z shard-00008-of-00025 0 ON_TIME null
}
Oct 27, 2018 12:19:56 AM org.apache.beam.sdk.nexmark.queries.Query10$3 processElement
INFO: Writing shard-00009-of-00025 with record timestamp 2015-07-15T00:00:09.999Z, window timestamp 2015-07-15T00:00:09.999Z, pane PaneInfo{isFirst=true, isLast=true, timing=ON_TIME, index=0, onTimeIndex=0}
Oct 27, 2018 12:19:56 AM org.apache.beam.sdk.util.MutationDetectors$CodedValueMutationDetector verifyUnmodifiedThrowingCheckedExceptions
WARNING: Coder of type class org.apache.beam.sdk.coders.KvCoder has a #structuralValue method which does not return true when the encoding of the elements is equal. Element KV{null, 2015-07-15T00:00:09.999Z shard-00007-of-00025 0 ON_TIME null
}
Oct 27, 2018 12:19:56 AM org.apache.beam.sdk.nexmark.queries.Query10$3 processElement
INFO: Writing shard-00021-of-00025 with record timestamp 2015-07-15T00:00:09.999Z, window timestamp 2015-07-15T00:00:09.999Z, pane PaneInfo{isFirst=true, isLast=true, timing=ON_TIME, index=0, onTimeIndex=0}
Oct 27, 2018 12:19:56 AM org.apache.beam.sdk.nexmark.queries.Query10$3 processElement
INFO: Writing shard-00002-of-00025 with record timestamp 2015-07-15T00:00:09.999Z, window timestamp 2015-07-15T00:00:09.999Z, pane PaneInfo{isFirst=true, isLast=true, timing=ON_TIME, index=0, onTimeIndex=0}
Oct 27, 2018 12:19:56 AM org.apache.beam.sdk.nexmark.queries.Query10$3 processElement
INFO: Writing shard-00020-of-00025 with record timestamp 2015-07-15T00:00:09.999Z, window timestamp 2015-07-15T00:00:09.999Z, pane PaneInfo{isFirst=true, isLast=true, timing=ON_TIME, index=0, onTimeIndex=0}
Oct 27, 2018 12:19:56 AM org.apache.beam.sdk.nexmark.queries.Query10$3 processElement
INFO: Writing shard-00015-of-00025 with record timestamp 2015-07-15T00:00:09.999Z, window timestamp 2015-07-15T00:00:09.999Z, pane PaneInfo{isFirst=true, isLast=true, timing=ON_TIME, index=0, onTimeIndex=0}
Oct 27, 2018 12:19:56 AM org.apache.beam.sdk.util.MutationDetectors$CodedValueMutationDetector verifyUnmodifiedThrowingCheckedExceptions
WARNING: Coder of type class org.apache.beam.sdk.coders.KvCoder has a #structuralValue method which does not return true when the encoding of the elements is equal. Element KV{null, 2015-07-15T00:00:09.999Z shard-00009-of-00025 0 ON_TIME null
}
Oct 27, 2018 12:19:56 AM org.apache.beam.sdk.nexmark.queries.Query10$3 processElement
INFO: Writing shard-00005-of-00025 with record timestamp 2015-07-15T00:00:09.999Z, window timestamp 2015-07-15T00:00:09.999Z, pane PaneInfo{isFirst=true, isLast=true, timing=ON_TIME, index=0, onTimeIndex=0}
Oct 27, 2018 12:19:56 AM org.apache.beam.sdk.util.MutationDetectors$CodedValueMutationDetector verifyUnmodifiedThrowingCheckedExceptions
WARNING: Coder of type class org.apache.beam.sdk.coders.KvCoder has a #structuralValue method which does not return true when the encoding of the elements is equal. Element KV{null, 2015-07-15T00:00:09.999Z shard-00002-of-00025 0 ON_TIME null
}
Oct 27, 2018 12:19:56 AM org.apache.beam.sdk.util.MutationDetectors$CodedValueMutationDetector verifyUnmodifiedThrowingCheckedExceptions
WARNING: Coder of type class org.apache.beam.sdk.coders.KvCoder has a #structuralValue method which does not return true when the encoding of the elements is equal. Element KV{null, 2015-07-15T00:00:09.999Z shard-00021-of-00025 0 ON_TIME null
}
Oct 27, 2018 12:19:56 AM org.apache.beam.sdk.util.MutationDetectors$CodedValueMutationDetector verifyUnmodifiedThrowingCheckedExceptions
WARNING: Coder of type class org.apache.beam.sdk.coders.KvCoder has a #structuralValue method which does not return true when the encoding of the elements is equal. Element KV{null, 2015-07-15T00:00:09.999Z shard-00020-of-00025 0 ON_TIME null
}
Oct 27, 2018 12:19:56 AM org.apache.beam.sdk.nexmark.queries.Query10$3 processElement
INFO: Writing shard-00018-of-00025 with record timestamp 2015-07-15T00:00:09.999Z, window timestamp 2015-07-15T00:00:09.999Z, pane PaneInfo{isFirst=true, isLast=true, timing=ON_TIME, index=0, onTimeIndex=0}
Oct 27, 2018 12:19:56 AM org.apache.beam.sdk.util.MutationDetectors$CodedValueMutationDetector verifyUnmodifiedThrowingCheckedExceptions
WARNING: Coder of type class org.apache.beam.sdk.coders.KvCoder has a #structuralValue method which does not return true when the encoding of the elements is equal. Element KV{null, 2015-07-15T00:00:09.999Z shard-00015-of-00025 0 ON_TIME null
}
Oct 27, 2018 12:19:56 AM org.apache.beam.sdk.nexmark.queries.Query10$3 processElement
INFO: Writing shard-00001-of-00025 with record timestamp 2015-07-15T00:00:09.999Z, window timestamp 2015-07-15T00:00:09.999Z, pane PaneInfo{isFirst=true, isLast=true, timing=ON_TIME, index=0, onTimeIndex=0}
Oct 27, 2018 12:19:56 AM org.apache.beam.sdk.util.MutationDetectors$CodedValueMutationDetector verifyUnmodifiedThrowingCheckedExceptions
WARNING: Coder of type class org.apache.beam.sdk.coders.KvCoder has a #structuralValue method which does not return true when the encoding of the elements is equal. Element KV{null, 2015-07-15T00:00:09.999Z shard-00005-of-00025 0 ON_TIME null
}
Oct 27, 2018 12:19:56 AM org.apache.beam.sdk.nexmark.queries.Query10$3 processElement
INFO: Writing shard-00024-of-00025 with record timestamp 2015-07-15T00:00:09.999Z, window timestamp 2015-07-15T00:00:09.999Z, pane PaneInfo{isFirst=true, isLast=true, timing=ON_TIME, index=0, onTimeIndex=0}
Oct 27, 2018 12:19:56 AM org.apache.beam.sdk.util.MutationDetectors$CodedValueMutationDetector verifyUnmodifiedThrowingCheckedExceptions
WARNING: Coder of type class org.apache.beam.sdk.coders.KvCoder has a #structuralValue method which does not return true when the encoding of the elements is equal. Element KV{null, 2015-07-15T00:00:09.999Z shard-00018-of-00025 0 ON_TIME null
}
Oct 27, 2018 12:19:56 AM org.apache.beam.sdk.util.MutationDetectors$CodedValueMutationDetector verifyUnmodifiedThrowingCheckedExceptions
WARNING: Coder of type class org.apache.beam.sdk.coders.KvCoder has a #structuralValue method which does not return true when the encoding of the elements is equal. Element KV{null, 2015-07-15T00:00:09.999Z shard-00001-of-00025 0 ON_TIME null
}
Oct 27, 2018 12:19:56 AM org.apache.beam.sdk.util.MutationDetectors$CodedValueMutationDetector verifyUnmodifiedThrowingCheckedExceptions
WARNING: Coder of type class org.apache.beam.sdk.coders.KvCoder has a #structuralValue method which does not return true when the encoding of the elements is equal. Element KV{null, 2015-07-15T00:00:09.999Z shard-00024-of-00025 0 ON_TIME null
}
Oct 27, 2018 12:19:56 AM org.apache.beam.sdk.nexmark.queries.Query10$4 processElement
INFO: Index with record timestamp %s, window timestamp %s, pane %s
Oct 27, 2018 12:19:56 AM org.apache.beam.sdk.util.MutationDetectors$CodedValueMutationDetector verifyUnmodifiedThrowingCheckedExceptions
WARNING: Coder of type class org.apache.beam.sdk.coders.KvCoder has a #structuralValue method which does not return true when the encoding of the elements is equal. Element KV{null, [2015-07-15T00:00:09.999Z shard-00013-of-00025 0 ON_TIME null
, 2015-07-15T00:00:09.999Z shard-00023-of-00025 0 ON_TIME null
, 2015-07-15T00:00:09.999Z shard-00003-of-00025 0 ON_TIME null
, 2015-07-15T00:00:09.999Z shard-00017-of-00025 0 ON_TIME null
, 2015-07-15T00:00:09.999Z shard-00010-of-00025 0 ON_TIME null
, 2015-07-15T00:00:09.999Z shard-00016-of-00025 0 ON_TIME null
, 2015-07-15T00:00:09.999Z shard-00000-of-00025 0 ON_TIME null
, 2015-07-15T00:00:09.999Z shard-00011-of-00025 0 ON_TIME null
, 2015-07-15T00:00:09.999Z shard-00014-of-00025 0 ON_TIME null
, 2015-07-15T00:00:09.999Z shard-00004-of-00025 0 ON_TIME null
, 2015-07-15T00:00:09.999Z shard-00006-of-00025 0 ON_TIME null
, 2015-07-15T00:00:09.999Z shard-00019-of-00025 0 ON_TIME null
, 2015-07-15T00:00:09.999Z shard-00007-of-00025 0 ON_TIME null
, 2015-07-15T00:00:09.999Z shard-00008-of-00025 0 ON_TIME null
, 2015-07-15T00:00:09.999Z shard-00012-of-00025 0 ON_TIME null
, 2015-07-15T00:00:09.999Z shard-00009-of-00025 0 ON_TIME null
, 2015-07-15T00:00:09.999Z shard-00022-of-00025 0 ON_TIME null
, 2015-07-15T00:00:09.999Z shard-00021-of-00025 0 ON_TIME null
, 2015-07-15T00:00:09.999Z shard-00002-of-00025 0 ON_TIME null
, 2015-07-15T00:00:09.999Z shard-00020-of-00025 0 ON_TIME null
, 2015-07-15T00:00:09.999Z shard-00015-of-00025 0 ON_TIME null
, 2015-07-15T00:00:09.999Z shard-00005-of-00025 0 ON_TIME null
, 2015-07-15T00:00:09.999Z shard-00018-of-00025 0 ON_TIME null
, 2015-07-15T00:00:09.999Z shard-00001-of-00025 0 ON_TIME null
, 2015-07-15T00:00:09.999Z shard-00024-of-00025 0 ON_TIME null
]}
Oct 27, 2018 12:19:56 AM org.apache.beam.sdk.util.MutationDetectors$CodedValueMutationDetector verifyUnmodifiedThrowingCheckedExceptions
WARNING: Coder of type class org.apache.beam.sdk.coders.KvCoder has a #structuralValue method which does not return true when the encoding of the elements is equal. Element KV{null, [2015-07-15T00:00:09.999Z shard-00013-of-00025 0 ON_TIME null
, 2015-07-15T00:00:09.999Z shard-00023-of-00025 0 ON_TIME null
, 2015-07-15T00:00:09.999Z shard-00003-of-00025 0 ON_TIME null
, 2015-07-15T00:00:09.999Z shard-00017-of-00025 0 ON_TIME null
, 2015-07-15T00:00:09.999Z shard-00010-of-00025 0 ON_TIME null
, 2015-07-15T00:00:09.999Z shard-00016-of-00025 0 ON_TIME null
, 2015-07-15T00:00:09.999Z shard-00000-of-00025 0 ON_TIME null
, 2015-07-15T00:00:09.999Z shard-00011-of-00025 0 ON_TIME null
, 2015-07-15T00:00:09.999Z shard-00014-of-00025 0 ON_TIME null
, 2015-07-15T00:00:09.999Z shard-00004-of-00025 0 ON_TIME null
, 2015-07-15T00:00:09.999Z shard-00006-of-00025 0 ON_TIME null
, 2015-07-15T00:00:09.999Z shard-00019-of-00025 0 ON_TIME null
, 2015-07-15T00:00:09.999Z shard-00007-of-00025 0 ON_TIME null
, 2015-07-15T00:00:09.999Z shard-00008-of-00025 0 ON_TIME null
, 2015-07-15T00:00:09.999Z shard-00012-of-00025 0 ON_TIME null
, 2015-07-15T00:00:09.999Z shard-00009-of-00025 0 ON_TIME null
, 2015-07-15T00:00:09.999Z shard-00022-of-00025 0 ON_TIME null
, 2015-07-15T00:00:09.999Z shard-00021-of-00025 0 ON_TIME null
, 2015-07-15T00:00:09.999Z shard-00002-of-00025 0 ON_TIME null
, 2015-07-15T00:00:09.999Z shard-00020-of-00025 0 ON_TIME null
, 2015-07-15T00:00:09.999Z shard-00015-of-00025 0 ON_TIME null
, 2015-07-15T00:00:09.999Z shard-00005-of-00025 0 ON_TIME null
, 2015-07-15T00:00:09.999Z shard-00018-of-00025 0 ON_TIME null
, 2015-07-15T00:00:09.999Z shard-00001-of-00025 0 ON_TIME null
, 2015-07-15T00:00:09.999Z shard-00024-of-00025 0 ON_TIME null
]}
2018-10-27T00:19:56.793Z Waiting for main pipeline to 'finish'
2018-10-27T00:19:56.793Z DONE Query10
2018-10-27T00:19:56.793Z Running query:11; exportSummaryToBigQuery:true
2018-10-27T00:19:56.795Z Generating 100000 events in batch mode
2018-10-27T00:19:59.788Z Waiting for main pipeline to 'finish'
2018-10-27T00:19:59.789Z DONE Query11
2018-10-27T00:19:59.789Z Running query:12; exportSummaryToBigQuery:true
2018-10-27T00:19:59.794Z Generating 100000 events in batch mode
2018-10-27T00:20:01.842Z Waiting for main pipeline to 'finish'
2018-10-27T00:20:01.843Z DONE Query12
> Task :beam-sdks-java-nexmark:run FAILED
:beam-sdks-java-nexmark:run (Thread[Task worker for ':' Thread 4,5,main]) completed. Took 1 mins 5.754 secs.
FAILURE: Build failed with an exception.
* What went wrong:
Execution failed for task ':beam-sdks-java-nexmark:run'.
> Process 'command '/usr/local/asfpackages/java/jdk1.8.0_172/bin/java'' finished with non-zero exit value 1
* Try:
Run with --stacktrace option to get the stack trace. Run with --debug option to get more log output. Run with --scan to get full insights.
* Get more help at https://help.gradle.org
Deprecated Gradle features were used in this build, making it incompatible with Gradle 5.0.
Use '--warning-mode all' to show the individual deprecation warnings.
See https://docs.gradle.org/4.10.2/userguide/command_line_interface.html#sec:command_line_warnings
BUILD FAILED in 4m 1s
65 actionable tasks: 61 executed, 4 from cache
Publishing build scan...
https://gradle.com/s/gem4eg6ibdbru
Build step 'Invoke Gradle script' changed build result to FAILURE
Build step 'Invoke Gradle script' marked build as failure
---------------------------------------------------------------------
To unsubscribe, e-mail: builds-unsubscribe@beam.apache.org
For additional commands, e-mail: builds-help@beam.apache.org
Build failed in Jenkins: beam_PostCommit_Java_Nexmark_Direct #945
Posted by Apache Jenkins Server <je...@builds.apache.org>.
See <https://builds.apache.org/job/beam_PostCommit_Java_Nexmark_Direct/945/display/redirect>
------------------------------------------
[...truncated 191.68 KB...]
INFO: shard-00004-of-00025 with timestamp 2015-07-15T00:00:09.999Z has 0 actually late and 3985 on-time elements in pane PaneInfo{isFirst=true, isLast=true, timing=ON_TIME, index=0, onTimeIndex=0} for window 2015-07-15T00:00:09.999Z
Oct 27, 2018 12:04:02 AM org.apache.beam.sdk.nexmark.queries.Query10$2 processElement
INFO: shard-00014-of-00025 with timestamp 2015-07-15T00:00:09.999Z has 0 actually late and 4134 on-time elements in pane PaneInfo{isFirst=true, isLast=true, timing=ON_TIME, index=0, onTimeIndex=0} for window 2015-07-15T00:00:09.999Z
Oct 27, 2018 12:04:02 AM org.apache.beam.sdk.nexmark.queries.Query10$2 processElement
INFO: shard-00011-of-00025 with timestamp 2015-07-15T00:00:09.999Z has 0 actually late and 4020 on-time elements in pane PaneInfo{isFirst=true, isLast=true, timing=ON_TIME, index=0, onTimeIndex=0} for window 2015-07-15T00:00:09.999Z
Oct 27, 2018 12:04:02 AM org.apache.beam.sdk.nexmark.queries.Query10$2 processElement
INFO: shard-00006-of-00025 with timestamp 2015-07-15T00:00:09.999Z has 0 actually late and 3992 on-time elements in pane PaneInfo{isFirst=true, isLast=true, timing=ON_TIME, index=0, onTimeIndex=0} for window 2015-07-15T00:00:09.999Z
Oct 27, 2018 12:04:02 AM org.apache.beam.sdk.nexmark.queries.Query10$2 processElement
INFO: shard-00007-of-00025 with timestamp 2015-07-15T00:00:09.999Z has 0 actually late and 3984 on-time elements in pane PaneInfo{isFirst=true, isLast=true, timing=ON_TIME, index=0, onTimeIndex=0} for window 2015-07-15T00:00:09.999Z
Oct 27, 2018 12:04:02 AM org.apache.beam.sdk.nexmark.queries.Query10$2 processElement
INFO: shard-00022-of-00025 with timestamp 2015-07-15T00:00:09.999Z has 0 actually late and 4066 on-time elements in pane PaneInfo{isFirst=true, isLast=true, timing=ON_TIME, index=0, onTimeIndex=0} for window 2015-07-15T00:00:09.999Z
Oct 27, 2018 12:04:02 AM org.apache.beam.sdk.nexmark.queries.Query10$2 processElement
INFO: shard-00019-of-00025 with timestamp 2015-07-15T00:00:09.999Z has 0 actually late and 3909 on-time elements in pane PaneInfo{isFirst=true, isLast=true, timing=ON_TIME, index=0, onTimeIndex=0} for window 2015-07-15T00:00:09.999Z
Oct 27, 2018 12:04:02 AM org.apache.beam.sdk.nexmark.queries.Query10$2 processElement
INFO: shard-00020-of-00025 with timestamp 2015-07-15T00:00:09.999Z has 0 actually late and 4021 on-time elements in pane PaneInfo{isFirst=true, isLast=true, timing=ON_TIME, index=0, onTimeIndex=0} for window 2015-07-15T00:00:09.999Z
Oct 27, 2018 12:04:02 AM org.apache.beam.sdk.nexmark.queries.Query10$2 processElement
INFO: shard-00001-of-00025 with timestamp 2015-07-15T00:00:09.999Z has 0 actually late and 3953 on-time elements in pane PaneInfo{isFirst=true, isLast=true, timing=ON_TIME, index=0, onTimeIndex=0} for window 2015-07-15T00:00:09.999Z
Oct 27, 2018 12:04:02 AM org.apache.beam.sdk.nexmark.queries.Query10$2 processElement
INFO: shard-00009-of-00025 with timestamp 2015-07-15T00:00:09.999Z has 0 actually late and 4056 on-time elements in pane PaneInfo{isFirst=true, isLast=true, timing=ON_TIME, index=0, onTimeIndex=0} for window 2015-07-15T00:00:09.999Z
Oct 27, 2018 12:04:02 AM org.apache.beam.sdk.nexmark.queries.Query10$2 processElement
INFO: shard-00021-of-00025 with timestamp 2015-07-15T00:00:09.999Z has 0 actually late and 3969 on-time elements in pane PaneInfo{isFirst=true, isLast=true, timing=ON_TIME, index=0, onTimeIndex=0} for window 2015-07-15T00:00:09.999Z
Oct 27, 2018 12:04:02 AM org.apache.beam.sdk.nexmark.queries.Query10$2 processElement
INFO: shard-00018-of-00025 with timestamp 2015-07-15T00:00:09.999Z has 0 actually late and 3987 on-time elements in pane PaneInfo{isFirst=true, isLast=true, timing=ON_TIME, index=0, onTimeIndex=0} for window 2015-07-15T00:00:09.999Z
Oct 27, 2018 12:04:02 AM org.apache.beam.sdk.nexmark.queries.Query10$2 processElement
INFO: shard-00024-of-00025 with timestamp 2015-07-15T00:00:09.999Z has 0 actually late and 4127 on-time elements in pane PaneInfo{isFirst=true, isLast=true, timing=ON_TIME, index=0, onTimeIndex=0} for window 2015-07-15T00:00:09.999Z
Oct 27, 2018 12:04:02 AM org.apache.beam.sdk.nexmark.queries.Query10$2 processElement
INFO: shard-00005-of-00025 with timestamp 2015-07-15T00:00:09.999Z has 0 actually late and 4060 on-time elements in pane PaneInfo{isFirst=true, isLast=true, timing=ON_TIME, index=0, onTimeIndex=0} for window 2015-07-15T00:00:09.999Z
Oct 27, 2018 12:04:02 AM org.apache.beam.sdk.nexmark.queries.Query10$2 processElement
INFO: shard-00015-of-00025 with timestamp 2015-07-15T00:00:09.999Z has 0 actually late and 4041 on-time elements in pane PaneInfo{isFirst=true, isLast=true, timing=ON_TIME, index=0, onTimeIndex=0} for window 2015-07-15T00:00:09.999Z
Oct 27, 2018 12:04:02 AM org.apache.beam.sdk.nexmark.queries.Query10$2 processElement
INFO: shard-00002-of-00025 with timestamp 2015-07-15T00:00:09.999Z has 0 actually late and 4002 on-time elements in pane PaneInfo{isFirst=true, isLast=true, timing=ON_TIME, index=0, onTimeIndex=0} for window 2015-07-15T00:00:09.999Z
Oct 27, 2018 12:04:02 AM org.apache.beam.sdk.nexmark.queries.Query10$3 processElement
INFO: Writing shard-00013-of-00025 with record timestamp 2015-07-15T00:00:09.999Z, window timestamp 2015-07-15T00:00:09.999Z, pane PaneInfo{isFirst=true, isLast=true, timing=ON_TIME, index=0, onTimeIndex=0}
Oct 27, 2018 12:04:02 AM org.apache.beam.sdk.nexmark.queries.Query10$3 processElement
INFO: Writing shard-00008-of-00025 with record timestamp 2015-07-15T00:00:09.999Z, window timestamp 2015-07-15T00:00:09.999Z, pane PaneInfo{isFirst=true, isLast=true, timing=ON_TIME, index=0, onTimeIndex=0}
Oct 27, 2018 12:04:02 AM org.apache.beam.sdk.nexmark.queries.Query10$3 processElement
INFO: Writing shard-00023-of-00025 with record timestamp 2015-07-15T00:00:09.999Z, window timestamp 2015-07-15T00:00:09.999Z, pane PaneInfo{isFirst=true, isLast=true, timing=ON_TIME, index=0, onTimeIndex=0}
Oct 27, 2018 12:04:02 AM org.apache.beam.sdk.nexmark.queries.Query10$3 processElement
INFO: Writing shard-00012-of-00025 with record timestamp 2015-07-15T00:00:09.999Z, window timestamp 2015-07-15T00:00:09.999Z, pane PaneInfo{isFirst=true, isLast=true, timing=ON_TIME, index=0, onTimeIndex=0}
Oct 27, 2018 12:04:02 AM org.apache.beam.sdk.nexmark.queries.Query10$3 processElement
INFO: Writing shard-00003-of-00025 with record timestamp 2015-07-15T00:00:09.999Z, window timestamp 2015-07-15T00:00:09.999Z, pane PaneInfo{isFirst=true, isLast=true, timing=ON_TIME, index=0, onTimeIndex=0}
Oct 27, 2018 12:04:02 AM org.apache.beam.sdk.nexmark.queries.Query10$3 processElement
INFO: Writing shard-00000-of-00025 with record timestamp 2015-07-15T00:00:09.999Z, window timestamp 2015-07-15T00:00:09.999Z, pane PaneInfo{isFirst=true, isLast=true, timing=ON_TIME, index=0, onTimeIndex=0}
Oct 27, 2018 12:04:02 AM org.apache.beam.sdk.util.MutationDetectors$CodedValueMutationDetector verifyUnmodifiedThrowingCheckedExceptions
WARNING: Coder of type class org.apache.beam.sdk.coders.KvCoder has a #structuralValue method which does not return true when the encoding of the elements is equal. Element KV{null, 2015-07-15T00:00:09.999Z shard-00023-of-00025 0 ON_TIME null
}
Oct 27, 2018 12:04:02 AM org.apache.beam.sdk.util.MutationDetectors$CodedValueMutationDetector verifyUnmodifiedThrowingCheckedExceptions
WARNING: Coder of type class org.apache.beam.sdk.coders.KvCoder has a #structuralValue method which does not return true when the encoding of the elements is equal. Element KV{null, 2015-07-15T00:00:09.999Z shard-00012-of-00025 0 ON_TIME null
}
Oct 27, 2018 12:04:02 AM org.apache.beam.sdk.nexmark.queries.Query10$3 processElement
INFO: Writing shard-00010-of-00025 with record timestamp 2015-07-15T00:00:09.999Z, window timestamp 2015-07-15T00:00:09.999Z, pane PaneInfo{isFirst=true, isLast=true, timing=ON_TIME, index=0, onTimeIndex=0}
Oct 27, 2018 12:04:02 AM org.apache.beam.sdk.util.MutationDetectors$CodedValueMutationDetector verifyUnmodifiedThrowingCheckedExceptions
WARNING: Coder of type class org.apache.beam.sdk.coders.KvCoder has a #structuralValue method which does not return true when the encoding of the elements is equal. Element KV{null, 2015-07-15T00:00:09.999Z shard-00000-of-00025 0 ON_TIME null
}
Oct 27, 2018 12:04:02 AM org.apache.beam.sdk.util.MutationDetectors$CodedValueMutationDetector verifyUnmodifiedThrowingCheckedExceptions
WARNING: Coder of type class org.apache.beam.sdk.coders.KvCoder has a #structuralValue method which does not return true when the encoding of the elements is equal. Element KV{null, 2015-07-15T00:00:09.999Z shard-00013-of-00025 0 ON_TIME null
}
Oct 27, 2018 12:04:02 AM org.apache.beam.sdk.util.MutationDetectors$CodedValueMutationDetector verifyUnmodifiedThrowingCheckedExceptions
WARNING: Coder of type class org.apache.beam.sdk.coders.KvCoder has a #structuralValue method which does not return true when the encoding of the elements is equal. Element KV{null, 2015-07-15T00:00:09.999Z shard-00008-of-00025 0 ON_TIME null
}
Oct 27, 2018 12:04:02 AM org.apache.beam.sdk.util.MutationDetectors$CodedValueMutationDetector verifyUnmodifiedThrowingCheckedExceptions
WARNING: Coder of type class org.apache.beam.sdk.coders.KvCoder has a #structuralValue method which does not return true when the encoding of the elements is equal. Element KV{null, 2015-07-15T00:00:09.999Z shard-00003-of-00025 0 ON_TIME null
}
Oct 27, 2018 12:04:02 AM org.apache.beam.sdk.nexmark.queries.Query10$3 processElement
INFO: Writing shard-00017-of-00025 with record timestamp 2015-07-15T00:00:09.999Z, window timestamp 2015-07-15T00:00:09.999Z, pane PaneInfo{isFirst=true, isLast=true, timing=ON_TIME, index=0, onTimeIndex=0}
Oct 27, 2018 12:04:02 AM org.apache.beam.sdk.nexmark.queries.Query10$3 processElement
INFO: Writing shard-00004-of-00025 with record timestamp 2015-07-15T00:00:09.999Z, window timestamp 2015-07-15T00:00:09.999Z, pane PaneInfo{isFirst=true, isLast=true, timing=ON_TIME, index=0, onTimeIndex=0}
Oct 27, 2018 12:04:02 AM org.apache.beam.sdk.nexmark.queries.Query10$3 processElement
INFO: Writing shard-00016-of-00025 with record timestamp 2015-07-15T00:00:09.999Z, window timestamp 2015-07-15T00:00:09.999Z, pane PaneInfo{isFirst=true, isLast=true, timing=ON_TIME, index=0, onTimeIndex=0}
Oct 27, 2018 12:04:02 AM org.apache.beam.sdk.nexmark.queries.Query10$3 processElement
INFO: Writing shard-00011-of-00025 with record timestamp 2015-07-15T00:00:09.999Z, window timestamp 2015-07-15T00:00:09.999Z, pane PaneInfo{isFirst=true, isLast=true, timing=ON_TIME, index=0, onTimeIndex=0}
Oct 27, 2018 12:04:02 AM org.apache.beam.sdk.util.MutationDetectors$CodedValueMutationDetector verifyUnmodifiedThrowingCheckedExceptions
WARNING: Coder of type class org.apache.beam.sdk.coders.KvCoder has a #structuralValue method which does not return true when the encoding of the elements is equal. Element KV{null, 2015-07-15T00:00:09.999Z shard-00010-of-00025 0 ON_TIME null
}
Oct 27, 2018 12:04:02 AM org.apache.beam.sdk.nexmark.queries.Query10$3 processElement
INFO: Writing shard-00014-of-00025 with record timestamp 2015-07-15T00:00:09.999Z, window timestamp 2015-07-15T00:00:09.999Z, pane PaneInfo{isFirst=true, isLast=true, timing=ON_TIME, index=0, onTimeIndex=0}
Oct 27, 2018 12:04:02 AM org.apache.beam.sdk.nexmark.queries.Query10$3 processElement
INFO: Writing shard-00007-of-00025 with record timestamp 2015-07-15T00:00:09.999Z, window timestamp 2015-07-15T00:00:09.999Z, pane PaneInfo{isFirst=true, isLast=true, timing=ON_TIME, index=0, onTimeIndex=0}
Oct 27, 2018 12:04:02 AM org.apache.beam.sdk.util.MutationDetectors$CodedValueMutationDetector verifyUnmodifiedThrowingCheckedExceptions
WARNING: Coder of type class org.apache.beam.sdk.coders.KvCoder has a #structuralValue method which does not return true when the encoding of the elements is equal. Element KV{null, 2015-07-15T00:00:09.999Z shard-00017-of-00025 0 ON_TIME null
}
Oct 27, 2018 12:04:02 AM org.apache.beam.sdk.nexmark.queries.Query10$3 processElement
INFO: Writing shard-00006-of-00025 with record timestamp 2015-07-15T00:00:09.999Z, window timestamp 2015-07-15T00:00:09.999Z, pane PaneInfo{isFirst=true, isLast=true, timing=ON_TIME, index=0, onTimeIndex=0}
Oct 27, 2018 12:04:02 AM org.apache.beam.sdk.nexmark.queries.Query10$3 processElement
INFO: Writing shard-00022-of-00025 with record timestamp 2015-07-15T00:00:09.999Z, window timestamp 2015-07-15T00:00:09.999Z, pane PaneInfo{isFirst=true, isLast=true, timing=ON_TIME, index=0, onTimeIndex=0}
Oct 27, 2018 12:04:02 AM org.apache.beam.sdk.nexmark.queries.Query10$3 processElement
INFO: Writing shard-00019-of-00025 with record timestamp 2015-07-15T00:00:09.999Z, window timestamp 2015-07-15T00:00:09.999Z, pane PaneInfo{isFirst=true, isLast=true, timing=ON_TIME, index=0, onTimeIndex=0}
Oct 27, 2018 12:04:02 AM org.apache.beam.sdk.util.MutationDetectors$CodedValueMutationDetector verifyUnmodifiedThrowingCheckedExceptions
WARNING: Coder of type class org.apache.beam.sdk.coders.KvCoder has a #structuralValue method which does not return true when the encoding of the elements is equal. Element KV{null, 2015-07-15T00:00:09.999Z shard-00016-of-00025 0 ON_TIME null
}
Oct 27, 2018 12:04:03 AM org.apache.beam.sdk.util.MutationDetectors$CodedValueMutationDetector verifyUnmodifiedThrowingCheckedExceptions
WARNING: Coder of type class org.apache.beam.sdk.coders.KvCoder has a #structuralValue method which does not return true when the encoding of the elements is equal. Element KV{null, 2015-07-15T00:00:09.999Z shard-00004-of-00025 0 ON_TIME null
}
Oct 27, 2018 12:04:03 AM org.apache.beam.sdk.nexmark.queries.Query10$3 processElement
INFO: Writing shard-00001-of-00025 with record timestamp 2015-07-15T00:00:09.999Z, window timestamp 2015-07-15T00:00:09.999Z, pane PaneInfo{isFirst=true, isLast=true, timing=ON_TIME, index=0, onTimeIndex=0}
Oct 27, 2018 12:04:03 AM org.apache.beam.sdk.util.MutationDetectors$CodedValueMutationDetector verifyUnmodifiedThrowingCheckedExceptions
WARNING: Coder of type class org.apache.beam.sdk.coders.KvCoder has a #structuralValue method which does not return true when the encoding of the elements is equal. Element KV{null, 2015-07-15T00:00:09.999Z shard-00007-of-00025 0 ON_TIME null
}
Oct 27, 2018 12:04:02 AM org.apache.beam.sdk.util.MutationDetectors$CodedValueMutationDetector verifyUnmodifiedThrowingCheckedExceptions
WARNING: Coder of type class org.apache.beam.sdk.coders.KvCoder has a #structuralValue method which does not return true when the encoding of the elements is equal. Element KV{null, 2015-07-15T00:00:09.999Z shard-00011-of-00025 0 ON_TIME null
}
Oct 27, 2018 12:04:03 AM org.apache.beam.sdk.nexmark.queries.Query10$3 processElement
INFO: Writing shard-00024-of-00025 with record timestamp 2015-07-15T00:00:09.999Z, window timestamp 2015-07-15T00:00:09.999Z, pane PaneInfo{isFirst=true, isLast=true, timing=ON_TIME, index=0, onTimeIndex=0}
Oct 27, 2018 12:04:03 AM org.apache.beam.sdk.nexmark.queries.Query10$3 processElement
INFO: Writing shard-00020-of-00025 with record timestamp 2015-07-15T00:00:09.999Z, window timestamp 2015-07-15T00:00:09.999Z, pane PaneInfo{isFirst=true, isLast=true, timing=ON_TIME, index=0, onTimeIndex=0}
Oct 27, 2018 12:04:03 AM org.apache.beam.sdk.util.MutationDetectors$CodedValueMutationDetector verifyUnmodifiedThrowingCheckedExceptions
WARNING: Coder of type class org.apache.beam.sdk.coders.KvCoder has a #structuralValue method which does not return true when the encoding of the elements is equal. Element KV{null, 2015-07-15T00:00:09.999Z shard-00014-of-00025 0 ON_TIME null
}
Oct 27, 2018 12:04:03 AM org.apache.beam.sdk.util.MutationDetectors$CodedValueMutationDetector verifyUnmodifiedThrowingCheckedExceptions
WARNING: Coder of type class org.apache.beam.sdk.coders.KvCoder has a #structuralValue method which does not return true when the encoding of the elements is equal. Element KV{null, 2015-07-15T00:00:09.999Z shard-00006-of-00025 0 ON_TIME null
}
Oct 27, 2018 12:04:03 AM org.apache.beam.sdk.util.MutationDetectors$CodedValueMutationDetector verifyUnmodifiedThrowingCheckedExceptions
WARNING: Coder of type class org.apache.beam.sdk.coders.KvCoder has a #structuralValue method which does not return true when the encoding of the elements is equal. Element KV{null, 2015-07-15T00:00:09.999Z shard-00022-of-00025 0 ON_TIME null
}
Oct 27, 2018 12:04:03 AM org.apache.beam.sdk.util.MutationDetectors$CodedValueMutationDetector verifyUnmodifiedThrowingCheckedExceptions
WARNING: Coder of type class org.apache.beam.sdk.coders.KvCoder has a #structuralValue method which does not return true when the encoding of the elements is equal. Element KV{null, 2015-07-15T00:00:09.999Z shard-00019-of-00025 0 ON_TIME null
}
Oct 27, 2018 12:04:03 AM org.apache.beam.sdk.util.MutationDetectors$CodedValueMutationDetector verifyUnmodifiedThrowingCheckedExceptions
WARNING: Coder of type class org.apache.beam.sdk.coders.KvCoder has a #structuralValue method which does not return true when the encoding of the elements is equal. Element KV{null, 2015-07-15T00:00:09.999Z shard-00001-of-00025 0 ON_TIME null
}
Oct 27, 2018 12:04:03 AM org.apache.beam.sdk.nexmark.queries.Query10$3 processElement
INFO: Writing shard-00021-of-00025 with record timestamp 2015-07-15T00:00:09.999Z, window timestamp 2015-07-15T00:00:09.999Z, pane PaneInfo{isFirst=true, isLast=true, timing=ON_TIME, index=0, onTimeIndex=0}
Oct 27, 2018 12:04:03 AM org.apache.beam.sdk.util.MutationDetectors$CodedValueMutationDetector verifyUnmodifiedThrowingCheckedExceptions
WARNING: Coder of type class org.apache.beam.sdk.coders.KvCoder has a #structuralValue method which does not return true when the encoding of the elements is equal. Element KV{null, 2015-07-15T00:00:09.999Z shard-00020-of-00025 0 ON_TIME null
}
Oct 27, 2018 12:04:03 AM org.apache.beam.sdk.nexmark.queries.Query10$3 processElement
INFO: Writing shard-00018-of-00025 with record timestamp 2015-07-15T00:00:09.999Z, window timestamp 2015-07-15T00:00:09.999Z, pane PaneInfo{isFirst=true, isLast=true, timing=ON_TIME, index=0, onTimeIndex=0}
Oct 27, 2018 12:04:03 AM org.apache.beam.sdk.nexmark.queries.Query10$3 processElement
INFO: Writing shard-00009-of-00025 with record timestamp 2015-07-15T00:00:09.999Z, window timestamp 2015-07-15T00:00:09.999Z, pane PaneInfo{isFirst=true, isLast=true, timing=ON_TIME, index=0, onTimeIndex=0}
Oct 27, 2018 12:04:03 AM org.apache.beam.sdk.util.MutationDetectors$CodedValueMutationDetector verifyUnmodifiedThrowingCheckedExceptions
WARNING: Coder of type class org.apache.beam.sdk.coders.KvCoder has a #structuralValue method which does not return true when the encoding of the elements is equal. Element KV{null, 2015-07-15T00:00:09.999Z shard-00024-of-00025 0 ON_TIME null
}
Oct 27, 2018 12:04:03 AM org.apache.beam.sdk.util.MutationDetectors$CodedValueMutationDetector verifyUnmodifiedThrowingCheckedExceptions
WARNING: Coder of type class org.apache.beam.sdk.coders.KvCoder has a #structuralValue method which does not return true when the encoding of the elements is equal. Element KV{null, 2015-07-15T00:00:09.999Z shard-00021-of-00025 0 ON_TIME null
}
Oct 27, 2018 12:04:03 AM org.apache.beam.sdk.nexmark.queries.Query10$3 processElement
INFO: Writing shard-00005-of-00025 with record timestamp 2015-07-15T00:00:09.999Z, window timestamp 2015-07-15T00:00:09.999Z, pane PaneInfo{isFirst=true, isLast=true, timing=ON_TIME, index=0, onTimeIndex=0}
Oct 27, 2018 12:04:03 AM org.apache.beam.sdk.nexmark.queries.Query10$3 processElement
INFO: Writing shard-00002-of-00025 with record timestamp 2015-07-15T00:00:09.999Z, window timestamp 2015-07-15T00:00:09.999Z, pane PaneInfo{isFirst=true, isLast=true, timing=ON_TIME, index=0, onTimeIndex=0}
Oct 27, 2018 12:04:03 AM org.apache.beam.sdk.nexmark.queries.Query10$3 processElement
INFO: Writing shard-00015-of-00025 with record timestamp 2015-07-15T00:00:09.999Z, window timestamp 2015-07-15T00:00:09.999Z, pane PaneInfo{isFirst=true, isLast=true, timing=ON_TIME, index=0, onTimeIndex=0}
Oct 27, 2018 12:04:03 AM org.apache.beam.sdk.util.MutationDetectors$CodedValueMutationDetector verifyUnmodifiedThrowingCheckedExceptions
WARNING: Coder of type class org.apache.beam.sdk.coders.KvCoder has a #structuralValue method which does not return true when the encoding of the elements is equal. Element KV{null, 2015-07-15T00:00:09.999Z shard-00018-of-00025 0 ON_TIME null
}
Oct 27, 2018 12:04:03 AM org.apache.beam.sdk.util.MutationDetectors$CodedValueMutationDetector verifyUnmodifiedThrowingCheckedExceptions
WARNING: Coder of type class org.apache.beam.sdk.coders.KvCoder has a #structuralValue method which does not return true when the encoding of the elements is equal. Element KV{null, 2015-07-15T00:00:09.999Z shard-00009-of-00025 0 ON_TIME null
}
Oct 27, 2018 12:04:03 AM org.apache.beam.sdk.util.MutationDetectors$CodedValueMutationDetector verifyUnmodifiedThrowingCheckedExceptions
WARNING: Coder of type class org.apache.beam.sdk.coders.KvCoder has a #structuralValue method which does not return true when the encoding of the elements is equal. Element KV{null, 2015-07-15T00:00:09.999Z shard-00002-of-00025 0 ON_TIME null
}
Oct 27, 2018 12:04:03 AM org.apache.beam.sdk.util.MutationDetectors$CodedValueMutationDetector verifyUnmodifiedThrowingCheckedExceptions
WARNING: Coder of type class org.apache.beam.sdk.coders.KvCoder has a #structuralValue method which does not return true when the encoding of the elements is equal. Element KV{null, 2015-07-15T00:00:09.999Z shard-00005-of-00025 0 ON_TIME null
}
Oct 27, 2018 12:04:03 AM org.apache.beam.sdk.util.MutationDetectors$CodedValueMutationDetector verifyUnmodifiedThrowingCheckedExceptions
WARNING: Coder of type class org.apache.beam.sdk.coders.KvCoder has a #structuralValue method which does not return true when the encoding of the elements is equal. Element KV{null, 2015-07-15T00:00:09.999Z shard-00015-of-00025 0 ON_TIME null
}
Oct 27, 2018 12:04:03 AM org.apache.beam.sdk.nexmark.queries.Query10$4 processElement
INFO: Index with record timestamp %s, window timestamp %s, pane %s
Oct 27, 2018 12:04:03 AM org.apache.beam.sdk.util.MutationDetectors$CodedValueMutationDetector verifyUnmodifiedThrowingCheckedExceptions
WARNING: Coder of type class org.apache.beam.sdk.coders.KvCoder has a #structuralValue method which does not return true when the encoding of the elements is equal. Element KV{null, [2015-07-15T00:00:09.999Z shard-00012-of-00025 0 ON_TIME null
, 2015-07-15T00:00:09.999Z shard-00013-of-00025 0 ON_TIME null
, 2015-07-15T00:00:09.999Z shard-00008-of-00025 0 ON_TIME null
, 2015-07-15T00:00:09.999Z shard-00003-of-00025 0 ON_TIME null
, 2015-07-15T00:00:09.999Z shard-00023-of-00025 0 ON_TIME null
, 2015-07-15T00:00:09.999Z shard-00000-of-00025 0 ON_TIME null
, 2015-07-15T00:00:09.999Z shard-00010-of-00025 0 ON_TIME null
, 2015-07-15T00:00:09.999Z shard-00017-of-00025 0 ON_TIME null
, 2015-07-15T00:00:09.999Z shard-00016-of-00025 0 ON_TIME null
, 2015-07-15T00:00:09.999Z shard-00004-of-00025 0 ON_TIME null
, 2015-07-15T00:00:09.999Z shard-00007-of-00025 0 ON_TIME null
, 2015-07-15T00:00:09.999Z shard-00014-of-00025 0 ON_TIME null
, 2015-07-15T00:00:09.999Z shard-00006-of-00025 0 ON_TIME null
, 2015-07-15T00:00:09.999Z shard-00022-of-00025 0 ON_TIME null
, 2015-07-15T00:00:09.999Z shard-00019-of-00025 0 ON_TIME null
, 2015-07-15T00:00:09.999Z shard-00001-of-00025 0 ON_TIME null
, 2015-07-15T00:00:09.999Z shard-00020-of-00025 0 ON_TIME null
, 2015-07-15T00:00:09.999Z shard-00024-of-00025 0 ON_TIME null
, 2015-07-15T00:00:09.999Z shard-00011-of-00025 0 ON_TIME null
, 2015-07-15T00:00:09.999Z shard-00021-of-00025 0 ON_TIME null
, 2015-07-15T00:00:09.999Z shard-00018-of-00025 0 ON_TIME null
, 2015-07-15T00:00:09.999Z shard-00009-of-00025 0 ON_TIME null
, 2015-07-15T00:00:09.999Z shard-00002-of-00025 0 ON_TIME null
, 2015-07-15T00:00:09.999Z shard-00005-of-00025 0 ON_TIME null
, 2015-07-15T00:00:09.999Z shard-00015-of-00025 0 ON_TIME null
]}
Oct 27, 2018 12:04:03 AM org.apache.beam.sdk.util.MutationDetectors$CodedValueMutationDetector verifyUnmodifiedThrowingCheckedExceptions
WARNING: Coder of type class org.apache.beam.sdk.coders.KvCoder has a #structuralValue method which does not return true when the encoding of the elements is equal. Element KV{null, [2015-07-15T00:00:09.999Z shard-00012-of-00025 0 ON_TIME null
, 2015-07-15T00:00:09.999Z shard-00013-of-00025 0 ON_TIME null
, 2015-07-15T00:00:09.999Z shard-00008-of-00025 0 ON_TIME null
, 2015-07-15T00:00:09.999Z shard-00003-of-00025 0 ON_TIME null
, 2015-07-15T00:00:09.999Z shard-00023-of-00025 0 ON_TIME null
, 2015-07-15T00:00:09.999Z shard-00000-of-00025 0 ON_TIME null
, 2015-07-15T00:00:09.999Z shard-00010-of-00025 0 ON_TIME null
, 2015-07-15T00:00:09.999Z shard-00017-of-00025 0 ON_TIME null
, 2015-07-15T00:00:09.999Z shard-00016-of-00025 0 ON_TIME null
, 2015-07-15T00:00:09.999Z shard-00004-of-00025 0 ON_TIME null
, 2015-07-15T00:00:09.999Z shard-00007-of-00025 0 ON_TIME null
, 2015-07-15T00:00:09.999Z shard-00014-of-00025 0 ON_TIME null
, 2015-07-15T00:00:09.999Z shard-00006-of-00025 0 ON_TIME null
, 2015-07-15T00:00:09.999Z shard-00022-of-00025 0 ON_TIME null
, 2015-07-15T00:00:09.999Z shard-00019-of-00025 0 ON_TIME null
, 2015-07-15T00:00:09.999Z shard-00001-of-00025 0 ON_TIME null
, 2015-07-15T00:00:09.999Z shard-00020-of-00025 0 ON_TIME null
, 2015-07-15T00:00:09.999Z shard-00024-of-00025 0 ON_TIME null
, 2015-07-15T00:00:09.999Z shard-00011-of-00025 0 ON_TIME null
, 2015-07-15T00:00:09.999Z shard-00021-of-00025 0 ON_TIME null
, 2015-07-15T00:00:09.999Z shard-00018-of-00025 0 ON_TIME null
, 2015-07-15T00:00:09.999Z shard-00009-of-00025 0 ON_TIME null
, 2015-07-15T00:00:09.999Z shard-00002-of-00025 0 ON_TIME null
, 2015-07-15T00:00:09.999Z shard-00005-of-00025 0 ON_TIME null
, 2015-07-15T00:00:09.999Z shard-00015-of-00025 0 ON_TIME null
]}
2018-10-27T00:04:03.154Z Waiting for main pipeline to 'finish'
2018-10-27T00:04:03.155Z DONE Query10
2018-10-27T00:04:03.155Z Running query:11; exportSummaryToBigQuery:true
2018-10-27T00:04:03.157Z Generating 100000 events in batch mode
2018-10-27T00:04:06.142Z Waiting for main pipeline to 'finish'
2018-10-27T00:04:06.142Z DONE Query11
2018-10-27T00:04:06.143Z Running query:12; exportSummaryToBigQuery:true
2018-10-27T00:04:06.144Z Generating 100000 events in batch mode
2018-10-27T00:04:08.017Z Waiting for main pipeline to 'finish'
2018-10-27T00:04:08.018Z DONE Query12
> Task :beam-sdks-java-nexmark:run FAILED
:beam-sdks-java-nexmark:run (Thread[Task worker for ':' Thread 5,5,main]) completed. Took 1 mins 6.284 secs.
FAILURE: Build failed with an exception.
* What went wrong:
Execution failed for task ':beam-sdks-java-nexmark:run'.
> Process 'command '/usr/local/asfpackages/java/jdk1.8.0_172/bin/java'' finished with non-zero exit value 1
* Try:
Run with --stacktrace option to get the stack trace. Run with --debug option to get more log output. Run with --scan to get full insights.
* Get more help at https://help.gradle.org
Deprecated Gradle features were used in this build, making it incompatible with Gradle 5.0.
Use '--warning-mode all' to show the individual deprecation warnings.
See https://docs.gradle.org/4.10.2/userguide/command_line_interface.html#sec:command_line_warnings
BUILD FAILED in 4m 2s
65 actionable tasks: 61 executed, 4 from cache
Publishing build scan...
https://gradle.com/s/rgx6ixdgg4qpu
Build step 'Invoke Gradle script' changed build result to FAILURE
Build step 'Invoke Gradle script' marked build as failure
---------------------------------------------------------------------
To unsubscribe, e-mail: builds-unsubscribe@beam.apache.org
For additional commands, e-mail: builds-help@beam.apache.org