You are viewing a plain text version of this content. The canonical link for it is here.
Posted to builds@cassandra.apache.org by Apache Jenkins Server <je...@builds.apache.org> on 2023/03/23 00:36:27 UTC

Build complete: Cassandra-trunk #1501 [FAILURE] fc9efd6357fb4255174689b3c107b897254a7d2f

-------------------------------------------------------------------------------
Build Cassandra-trunk #1501 Failure
URL: https://ci-cassandra.apache.org/job/Cassandra-trunk/1501/
-------------------------------------------------------------------------------
Changes:
[Stefan Miklosovic] Add virtual table system_views.snapshots


-------------------------------------------------------------------------------
Failed Tests:
6 tests failed.
FAILED:  dtest-novnode.transient_replication_test.TestTransientReplicationRepairStreamEntireSSTable.test_transient_incremental_repair
FAILED:  dtest-upgrade.upgrade_tests.cql_tests.cls.test_limit_bugs
FAILED:  dtest.snapshot_test.TestArchiveCommitlog.test_dont_archive_commitlog
FAILED:  dtest.secondary_indexes_test.TestSecondaryIndexes.test_failing_manual_rebuild_index
FAILED:  org.apache.cassandra.net.ProxyHandlerConnectionsTest.testExpireSome-cdc.jdk11
FAILED:  org.apache.cassandra.net.ProxyHandlerConnectionsTest.suddenDisconnect-compression.jdk11

-------------------------------------------------------------------------------
For complete test report and logs see https://nightlies.apache.org/cassandra/Cassandra-trunk/1501/