You are viewing a plain text version of this content. The canonical link for it is here.
Posted to dev@zookeeper.apache.org by Apache Jenkins Server <je...@builds.apache.org> on 2015/08/17 12:52:00 UTC

ZooKeeper-trunk - Build # 2787 - Still Failing

See https://builds.apache.org/job/ZooKeeper-trunk/2787/

###################################################################################
########################## LAST 60 LINES OF THE CONSOLE ###########################
[...truncated 372672 lines...]
    [junit] 2015-08-17 10:52:38,773 [myid:] - INFO  [NIOServerCxnFactory.SelectorThread-0:NIOServerCnxnFactory$SelectorThread@420] - selector thread exitted run method
    [junit] 2015-08-17 10:52:38,773 [myid:] - WARN  [LearnerHandler-/127.0.0.1:36321:LearnerHandler@903] - Ignoring unexpected exception
    [junit] java.lang.InterruptedException
    [junit] 	at java.util.concurrent.locks.AbstractQueuedSynchronizer.acquireInterruptibly(AbstractQueuedSynchronizer.java:1219)
    [junit] 	at java.util.concurrent.locks.ReentrantLock.lockInterruptibly(ReentrantLock.java:340)
    [junit] 	at java.util.concurrent.LinkedBlockingQueue.put(LinkedBlockingQueue.java:338)
    [junit] 	at org.apache.zookeeper.server.quorum.LearnerHandler.shutdown(LearnerHandler.java:901)
    [junit] 	at org.apache.zookeeper.server.quorum.LearnerHandler.run(LearnerHandler.java:622)
    [junit] 2015-08-17 10:52:38,774 [myid:] - INFO  [QuorumPeer[myid=5](plain=/0:0:0:0:0:0:0:0:19442)(secure=disabled):MBeanRegistry@119] - Unregister MBean [org.apache.ZooKeeperService:name0=ReplicatedServer_id5,name1=replica.5,name2=Leader]
    [junit] 2015-08-17 10:52:38,774 [myid:] - INFO  [/127.0.0.1:19444:QuorumCnxManager$Listener@659] - Leaving listener
    [junit] 2015-08-17 10:52:38,775 [myid:] - WARN  [QuorumPeer[myid=5](plain=/0:0:0:0:0:0:0:0:19442)(secure=disabled):QuorumPeer@1080] - Unexpected exception
    [junit] java.lang.InterruptedException
    [junit] 	at java.lang.Object.wait(Native Method)
    [junit] 	at org.apache.zookeeper.server.quorum.Leader.lead(Leader.java:559)
    [junit] 	at org.apache.zookeeper.server.quorum.QuorumPeer.run(QuorumPeer.java:1077)
    [junit] 2015-08-17 10:52:38,776 [myid:] - INFO  [QuorumPeer[myid=5](plain=/0:0:0:0:0:0:0:0:19442)(secure=disabled):Leader@613] - Shutting down
    [junit] 2015-08-17 10:52:38,776 [myid:] - WARN  [QuorumPeer[myid=5](plain=/0:0:0:0:0:0:0:0:19442)(secure=disabled):QuorumPeer@1111] - PeerState set to LOOKING
    [junit] 2015-08-17 10:52:38,776 [myid:] - WARN  [QuorumPeer[myid=5](plain=/0:0:0:0:0:0:0:0:19442)(secure=disabled):QuorumPeer@1093] - QuorumPeer main thread exited
    [junit] 2015-08-17 10:52:38,776 [myid:] - INFO  [QuorumPeer[myid=5](plain=/0:0:0:0:0:0:0:0:19442)(secure=disabled):MBeanRegistry@119] - Unregister MBean [org.apache.ZooKeeperService:name0=ReplicatedServer_id5]
    [junit] 2015-08-17 10:52:38,776 [myid:] - INFO  [main:QuorumUtil@254] - Shutting down leader election QuorumPeer[myid=5](plain=/0:0:0:0:0:0:0:0:19442)(secure=disabled)
    [junit] 2015-08-17 10:52:38,776 [myid:] - INFO  [main:QuorumUtil@259] - Waiting for QuorumPeer[myid=5](plain=/0:0:0:0:0:0:0:0:19442)(secure=disabled) to exit thread
    [junit] 2015-08-17 10:52:38,776 [myid:] - INFO  [QuorumPeer[myid=5](plain=/0:0:0:0:0:0:0:0:19442)(secure=disabled):MBeanRegistry@119] - Unregister MBean [org.apache.ZooKeeperService:name0=ReplicatedServer_id5,name1=replica.5]
    [junit] 2015-08-17 10:52:38,777 [myid:] - INFO  [QuorumPeer[myid=5](plain=/0:0:0:0:0:0:0:0:19442)(secure=disabled):MBeanRegistry@119] - Unregister MBean [org.apache.ZooKeeperService:name0=ReplicatedServer_id5,name1=replica.1]
    [junit] 2015-08-17 10:52:38,777 [myid:] - INFO  [QuorumPeer[myid=5](plain=/0:0:0:0:0:0:0:0:19442)(secure=disabled):MBeanRegistry@119] - Unregister MBean [org.apache.ZooKeeperService:name0=ReplicatedServer_id5,name1=replica.2]
    [junit] 2015-08-17 10:52:38,777 [myid:] - INFO  [QuorumPeer[myid=5](plain=/0:0:0:0:0:0:0:0:19442)(secure=disabled):MBeanRegistry@119] - Unregister MBean [org.apache.ZooKeeperService:name0=ReplicatedServer_id5,name1=replica.3]
    [junit] 2015-08-17 10:52:38,777 [myid:] - INFO  [main:FourLetterWordMain@84] - connecting to 127.0.0.1 19430
    [junit] 2015-08-17 10:52:38,777 [myid:] - INFO  [main:QuorumUtil@243] - 127.0.0.1:19430 is no longer accepting client connections
    [junit] 2015-08-17 10:52:38,778 [myid:] - INFO  [main:FourLetterWordMain@84] - connecting to 127.0.0.1 19433
    [junit] 2015-08-17 10:52:38,778 [myid:] - INFO  [main:QuorumUtil@243] - 127.0.0.1:19433 is no longer accepting client connections
    [junit] 2015-08-17 10:52:38,778 [myid:] - INFO  [main:FourLetterWordMain@84] - connecting to 127.0.0.1 19436
    [junit] 2015-08-17 10:52:38,778 [myid:] - INFO  [main:QuorumUtil@243] - 127.0.0.1:19436 is no longer accepting client connections
    [junit] 2015-08-17 10:52:38,778 [myid:] - INFO  [main:FourLetterWordMain@84] - connecting to 127.0.0.1 19439
    [junit] 2015-08-17 10:52:38,779 [myid:] - INFO  [main:QuorumUtil@243] - 127.0.0.1:19439 is no longer accepting client connections
    [junit] 2015-08-17 10:52:38,779 [myid:] - INFO  [main:FourLetterWordMain@84] - connecting to 127.0.0.1 19442
    [junit] 2015-08-17 10:52:38,779 [myid:] - INFO  [main:QuorumUtil@243] - 127.0.0.1:19442 is no longer accepting client connections
    [junit] 2015-08-17 10:52:38,781 [myid:] - INFO  [main:ZKTestCase$1@65] - SUCCEEDED testRemoveOneAsynchronous
    [junit] 2015-08-17 10:52:38,781 [myid:] - INFO  [main:ZKTestCase$1@60] - FINISHED testRemoveOneAsynchronous
    [junit] Tests run: 11, Failures: 0, Errors: 0, Skipped: 0, Time elapsed: 116.083 sec, Thread: 4, Class: org.apache.zookeeper.test.ReconfigTest

BUILD FAILED
/home/jenkins/jenkins-slave/workspace/ZooKeeper-trunk/trunk/build.xml:1494: The following error occurred while executing this line:
/home/jenkins/jenkins-slave/workspace/ZooKeeper-trunk/trunk/build.xml:1379: Tests failed!

Total time: 5 minutes 49 seconds
Build step 'Execute shell' marked build as failure
[FINDBUGS] Skipping publisher since build result is FAILURE
[WARNINGS] Skipping publisher since build result is FAILURE
Archiving artifacts
Sending artifact delta relative to ZooKeeper-trunk #2779
Archived 3 artifacts
Archive block size is 32768
Received 2 blocks and 18224348 bytes
Compression is 0.4%
Took 4.8 sec
Recording fingerprints
Recording test results
Publishing Javadoc
Email was triggered for: Failure
Sending email for trigger: Failure



###################################################################################
############################## FAILED TESTS (if any) ##############################
1 tests failed.
REGRESSION:  org.apache.zookeeper.test.StaticHostProviderTest.testTwoInvalidHostAddresses

Error Message:
Expected exception: java.lang.IllegalArgumentException

Stack Trace:
junit.framework.AssertionFailedError: Expected exception: java.lang.IllegalArgumentException