You are viewing a plain text version of this content. The canonical link for it is here.
Posted to yarn-dev@hadoop.apache.org by Apache Jenkins Server <je...@builds.apache.org> on 2015/08/05 07:05:26 UTC
Failed: YARN-4019 PreCommit Build #8768
Jira: https://issues.apache.org/jira/browse/YARN-4019
Build: https://builds.apache.org/job/PreCommit-YARN-Build/8768/
###################################################################################
########################## LAST 60 LINES OF THE CONSOLE ###########################
[...truncated 309 lines...]
| | | | eclipse:eclipse.
| +1 | findbugs | 2m 58s | The patch does not introduce any
| | | | new Findbugs (version 3.0.0)
| | | | warnings.
| -1 | yarn tests | 7m 8s | Tests failed in
| | | | hadoop-yarn-server-nodemanager.
| -1 | yarn tests | 53m 52s | Tests failed in
| | | | hadoop-yarn-server-resourcemanager.
| | | 110m 42s |
Reason | Tests
Failed unit tests | hadoop.yarn.server.nodemanager.containermanager.logaggregation.TestLogAggregationService
Timed out tests | org.apache.hadoop.yarn.server.resourcemanager.webapp.TestRMWebServicesApps
|| Subsystem || Report/Notes ||
============================================================================
| Patch URL | http://issues.apache.org/jira/secure/attachment/12748757/YARN-4019.002.patch |
| Optional Tests | javadoc javac unit findbugs checkstyle |
| git revision | trunk / d540374 |
| checkstyle | /home/jenkins/jenkins-slave/workspace/PreCommit-YARN-Build/patchprocess/diffcheckstylehadoop-yarn-server-resourcemanager.txt |
| hadoop-yarn-server-nodemanager test log | /home/jenkins/jenkins-slave/workspace/PreCommit-YARN-Build/patchprocess/testrun_hadoop-yarn-server-nodemanager.txt |
| hadoop-yarn-server-resourcemanager test log | /home/jenkins/jenkins-slave/workspace/PreCommit-YARN-Build/patchprocess/testrun_hadoop-yarn-server-resourcemanager.txt |
| Test Results | https://builds.apache.org/job/PreCommit-YARN-Build/8768/testReport/ |
| Java | 1.7.0_55 |
| uname | Linux asf903.gq1.ygridcore.net 3.13.0-36-lowlatency #63-Ubuntu SMP PREEMPT Wed Sep 3 21:56:12 UTC 2014 x86_64 x86_64 x86_64 GNU/Linux |
============================================================================
============================================================================
Adding comment to JIRA
============================================================================
============================================================================
Comment added.
be4bb650095fe615220c5286fea612bc576a6b8d logged out
============================================================================
============================================================================
Finished build.
============================================================================
============================================================================
Build step 'Execute shell' marked build as failure
Archiving artifacts
Sending artifact delta relative to PreCommit-YARN-Build #8763
Archived 44 artifacts
Archive block size is 32768
Received 87 blocks and 12865264 bytes
Compression is 18.1%
Took 3 sec
[description-setter] Could not determine description.
Recording test results
Email was triggered for: Failure
Sending email for trigger: Failure
###################################################################################
############################## FAILED TESTS (if any) ##############################
1 tests failed.
FAILED: org.apache.hadoop.yarn.server.nodemanager.containermanager.logaggregation.TestLogAggregationService.testLocalFileDeletionOnDiskFull
Error Message:
check /home/jenkins/jenkins-slave/workspace/PreCommit-YARN-Build/hadoop-yarn-project/hadoop-yarn/hadoop-yarn-server/hadoop-yarn-server-nodemanager/target/TestLogAggregationService-localLogDir/application_1234_0001/container_1234_0001_01_000001/stdout
Stack Trace:
java.lang.AssertionError: check /home/jenkins/jenkins-slave/workspace/PreCommit-YARN-Build/hadoop-yarn-project/hadoop-yarn/hadoop-yarn-server/hadoop-yarn-server-nodemanager/target/TestLogAggregationService-localLogDir/application_1234_0001/container_1234_0001_01_000001/stdout
at org.junit.Assert.fail(Assert.java:88)
at org.junit.Assert.assertTrue(Assert.java:41)
at org.junit.Assert.assertFalse(Assert.java:64)
at org.apache.hadoop.yarn.server.nodemanager.containermanager.logaggregation.TestLogAggregationService.verifyLocalFileDeletion(TestLogAggregationService.java:222)
at org.apache.hadoop.yarn.server.nodemanager.containermanager.logaggregation.TestLogAggregationService.testLocalFileDeletionOnDiskFull(TestLogAggregationService.java:281)