You are viewing a plain text version of this content. The canonical link for it is here.
Posted to builds@beam.apache.org by Apache Jenkins Server <je...@builds.apache.org> on 2022/08/01 21:11:31 UTC
Build failed in Jenkins: beam_PostCommit_Go_VR_Samza #1524
See <https://ci-beam.apache.org/job/beam_PostCommit_Go_VR_Samza/1524/display/redirect?page=changes>
Changes:
[noreply] Exclude grpcio==1.48.0 (#22539)
[noreply] Merge PR #22304 fixing #22331 fixing JDBC IO IT
------------------------------------------
[...truncated 47.53 KB...]
- Gradle detected a problem with the following location: '<https://ci-beam.apache.org/job/beam_PostCommit_Go_VR_Samza/ws/src/sdks/java/container/build/target'.> Reason: Task ':sdks:java:container:java11:copySdkHarnessLauncher' uses this output of task ':sdks:java:container:downloadCloudProfilerAgent' without declaring an explicit or implicit dependency. This can lead to incorrect results being produced, depending on what order the tasks are executed. Please refer to https://docs.gradle.org/7.4/userguide/validation_problems.html#implicit_dependency for more details about this problem.
- Gradle detected a problem with the following location: '<https://ci-beam.apache.org/job/beam_PostCommit_Go_VR_Samza/ws/src/sdks/java/container/build/target'.> Reason: Task ':sdks:java:container:java11:copySdkHarnessLauncher' uses this output of task ':sdks:java:container:pullLicenses' without declaring an explicit or implicit dependency. This can lead to incorrect results being produced, depending on what order the tasks are executed. Please refer to https://docs.gradle.org/7.4/userguide/validation_problems.html#implicit_dependency for more details about this problem.
> Task :sdks:java:container:java8:copySdkHarnessLauncher
Execution optimizations have been disabled for task ':sdks:java:container:java8:copySdkHarnessLauncher' to ensure correctness due to the following reasons:
- Gradle detected a problem with the following location: '<https://ci-beam.apache.org/job/beam_PostCommit_Go_VR_Samza/ws/src/sdks/java/container/build/target'.> Reason: Task ':sdks:java:container:java8:copySdkHarnessLauncher' uses this output of task ':sdks:java:container:downloadCloudProfilerAgent' without declaring an explicit or implicit dependency. This can lead to incorrect results being produced, depending on what order the tasks are executed. Please refer to https://docs.gradle.org/7.4/userguide/validation_problems.html#implicit_dependency for more details about this problem.
- Gradle detected a problem with the following location: '<https://ci-beam.apache.org/job/beam_PostCommit_Go_VR_Samza/ws/src/sdks/java/container/build/target'.> Reason: Task ':sdks:java:container:java8:copySdkHarnessLauncher' uses this output of task ':sdks:java:container:pullLicenses' without declaring an explicit or implicit dependency. This can lead to incorrect results being produced, depending on what order the tasks are executed. Please refer to https://docs.gradle.org/7.4/userguide/validation_problems.html#implicit_dependency for more details about this problem.
> Task :release:go-licenses:java:dockerRun
go: downloading github.com/golang/protobuf v1.5.2
go: downloading google.golang.org/grpc v1.47.0
go: downloading google.golang.org/protobuf v1.28.0
> Task :release:go-licenses:go:dockerRun
go: downloading github.com/golang/protobuf v1.5.2
go: downloading google.golang.org/grpc v1.47.0
go: downloading google.golang.org/protobuf v1.28.0
go: downloading google.golang.org/genproto v0.0.0-20220602131408-e326c6e8e9c8
go: downloading golang.org/x/net v0.0.0-20220607020251-c690dde0001d
go: downloading golang.org/x/sys v0.0.0-20220520151302-bc2c85ada10a
go: downloading golang.org/x/text v0.3.7
go: added github.com/apache/beam/sdks/v2 v2.40.0
go: added github.com/golang/protobuf v1.5.2
go: added golang.org/x/net v0.0.0-20220607020251-c690dde0001d
go: added golang.org/x/sys v0.0.0-20220520151302-bc2c85ada10a
go: added golang.org/x/text v0.3.7
go: added google.golang.org/genproto v0.0.0-20220602131408-e326c6e8e9c8
go: added google.golang.org/grpc v1.47.0
go: added google.golang.org/protobuf v1.28.0
+ go-licenses save github.com/apache/beam/sdks/v2/go/container --save_path=/output/licenses
W0801 21:09:59.969429 27 library.go:94] "golang.org/x/sys/unix" contains non-Go code that can't be inspected for further dependencies:
/go/pkg/mod/golang.org/x/sys@v0.0.0-20220520151302-bc2c85ada10a/unix/asm_linux_amd64.s
+ go-licenses csv github.com/apache/beam/sdks/v2/go/container
+ tee /output/licenses/list.csv
W0801 21:10:05.137062 184 library.go:94] "golang.org/x/sys/unix" contains non-Go code that can't be inspected for further dependencies:
/go/pkg/mod/golang.org/x/sys@v0.0.0-20220520151302-bc2c85ada10a/unix/asm_linux_amd64.s
github.com/apache/beam/sdks/v2/go,https://github.com/apache/beam/blob/sdks/v2.40.0/sdks/go/README.md,Apache-2.0
github.com/golang/protobuf,https://github.com/golang/protobuf/blob/v1.5.2/LICENSE,BSD-3-Clause
golang.org/x/net,https://cs.opensource.google/go/x/net/+/c690dde0:LICENSE,BSD-3-Clause
golang.org/x/sys,https://cs.opensource.google/go/x/sys/+/bc2c85ad:LICENSE,BSD-3-Clause
golang.org/x/text,https://cs.opensource.google/go/x/text/+/v0.3.7:LICENSE,BSD-3-Clause
google.golang.org/genproto/googleapis/rpc/status,https://github.com/googleapis/go-genproto/blob/e326c6e8e9c8/LICENSE,Apache-2.0
google.golang.org/grpc,https://github.com/grpc/grpc-go/blob/v1.47.0/LICENSE,Apache-2.0
google.golang.org/protobuf,https://github.com/protocolbuffers/protobuf-go/blob/v1.28.0/LICENSE,BSD-3-Clause
+ chmod -R a+w /output/licenses
> Task :release:go-licenses:go:createLicenses
> Task :sdks:go:container:copyGolangLicenses
> Task :release:go-licenses:java:dockerRun
go: downloading google.golang.org/genproto v0.0.0-20220602131408-e326c6e8e9c8
go: downloading golang.org/x/net v0.0.0-20220607020251-c690dde0001d
go: downloading golang.org/x/sys v0.0.0-20220520151302-bc2c85ada10a
go: downloading golang.org/x/text v0.3.7
go: added github.com/apache/beam/sdks/v2 v2.40.0
go: added github.com/golang/protobuf v1.5.2
go: added golang.org/x/net v0.0.0-20220607020251-c690dde0001d
go: added golang.org/x/sys v0.0.0-20220520151302-bc2c85ada10a
go: added golang.org/x/text v0.3.7
go: added google.golang.org/genproto v0.0.0-20220602131408-e326c6e8e9c8
go: added google.golang.org/grpc v1.47.0
go: added google.golang.org/protobuf v1.28.0
+ go-licenses save github.com/apache/beam/sdks/v2/java/container --save_path=/output/licenses
W0801 21:10:00.010242 34 library.go:94] "golang.org/x/sys/unix" contains non-Go code that can't be inspected for further dependencies:
/go/pkg/mod/golang.org/x/sys@v0.0.0-20220520151302-bc2c85ada10a/unix/asm_linux_amd64.s
+ go-licenses csv github.com/apache/beam/sdks/v2/java/container
+ tee /output/licenses/list.csv
W0801 21:10:05.602728 182 library.go:94] "golang.org/x/sys/unix" contains non-Go code that can't be inspected for further dependencies:
/go/pkg/mod/golang.org/x/sys@v0.0.0-20220520151302-bc2c85ada10a/unix/asm_linux_amd64.s
github.com/apache/beam/sdks/v2/go/pkg/beam,https://github.com/apache/beam/blob/sdks/v2.40.0/sdks/go/README.md,Apache-2.0
github.com/apache/beam/sdks/v2/java/container,https://github.com/apache/beam/blob/sdks/v2.40.0/sdks/LICENSE,Apache-2.0
github.com/golang/protobuf,https://github.com/golang/protobuf/blob/v1.5.2/LICENSE,BSD-3-Clause
golang.org/x/net,https://cs.opensource.google/go/x/net/+/c690dde0:LICENSE,BSD-3-Clause
golang.org/x/sys,https://cs.opensource.google/go/x/sys/+/bc2c85ad:LICENSE,BSD-3-Clause
golang.org/x/text,https://cs.opensource.google/go/x/text/+/v0.3.7:LICENSE,BSD-3-Clause
google.golang.org/genproto/googleapis/rpc/status,https://github.com/googleapis/go-genproto/blob/e326c6e8e9c8/LICENSE,Apache-2.0
google.golang.org/grpc,https://github.com/grpc/grpc-go/blob/v1.47.0/LICENSE,Apache-2.0
google.golang.org/protobuf,https://github.com/protocolbuffers/protobuf-go/blob/v1.28.0/LICENSE,BSD-3-Clause
+ chmod -R a+w /output/licenses
> Task :sdks:go:container:dockerPrepare
> Task :release:go-licenses:java:createLicenses
> Task :sdks:java:container:java11:copyGolangLicenses
> Task :sdks:java:container:java8:copyGolangLicenses
> Task :sdks:java:container:java8:dockerPrepare
> Task :sdks:java:container:java11:dockerPrepare
> Task :sdks:java:container:java11:docker
> Task :sdks:java:container:java8:docker
> Task :sdks:go:container:docker
0 added, 0 removed; done.
Running hooks in /etc/ca-certificates/update.d...
done.
Removing intermediate container 7f1e6fd0392c
---> 5c611c5806f8
Step 5/11 : ADD target/linux_amd64/boot /opt/apache/beam/
---> cf38d6737a28
Step 6/11 : COPY target/LICENSE /opt/apache/beam/
---> 8f81aec9b2c2
Step 7/11 : COPY target/NOTICE /opt/apache/beam/
---> 2c691861656c
Step 8/11 : COPY target/LICENSE target/go-licenses/* /opt/apache/beam/third_party_licenses/golang/
---> a8cafe6d6961
Step 9/11 : RUN rm /opt/apache/beam/third_party_licenses/golang/LICENSE
---> Running in c4ee34ccb5da
Removing intermediate container c4ee34ccb5da
---> 1958e148c056
Step 10/11 : RUN if [ "$pull_licenses" = "false" ] ; then rm -rf /opt/apache/beam/third_party_licenses ; fi
---> Running in 23f41f6509d9
Removing intermediate container 23f41f6509d9
---> 28425da7a44b
Step 11/11 : ENTRYPOINT ["/opt/apache/beam/boot"]
---> Running in 0a408a598ebe
Removing intermediate container 0a408a598ebe
---> c18444ac3682
Successfully built c18444ac3682
Successfully tagged apache/beam_go_sdk:latest
> Task :sdks:go:test:samzaValidatesRunner
$ CURRENT_DIRECTORY=<https://ci-beam.apache.org/job/beam_PostCommit_Go_VR_Samza/ws/src/sdks/go/test>
$ TESTS=./test/integration/... ./test/regression
$ RUNNER=portable
$ TIMEOUT=2h
$ SIMULTANEOUS=3
$ GCS_LOCATION=gs://temp-storage-for-end-to-end-tests
$ GCS_SUBFOLDER=test18386
$ PROJECT=apache-beam-testing
$ DATAFLOW_PROJECT=apache-beam-testing
$ REGION=us-central1
$ trap exit_background_processes SIGINT SIGTERM EXIT
$ key=--runner
$ case --runner in
$ RUNNER=samza
$ key=--samza_job_server_jar
$ case --samza_job_server_jar in
$ SAMZA_JOB_SERVER_JAR=<https://ci-beam.apache.org/job/beam_PostCommit_Go_VR_Samza/ws/src/runners/samza/job-server/build/libs/beam-runners-samza-job-server-2.42.0-SNAPSHOT.jar>
$ key=--pipeline_opts
$ case --pipeline_opts in
$ PIPELINE_OPTS=--expansion_jar=test:<https://ci-beam.apache.org/job/beam_PostCommit_Go_VR_Samza/ws/src/sdks/java/testing/expansion-service/build/libs/beam-sdks-java-testing-expansion-service-testExpansionService-2.42.0-SNAPSHOT.jar>
$ cd <https://ci-beam.apache.org/job/beam_PostCommit_Go_VR_Samza/ws/src>
$ test -d sdks/go/test
$ JOB_PORT=48587
$ ENDPOINT=localhost:53633
No endpoint specified; starting a new samza job server on localhost:53633
$ java -jar <https://ci-beam.apache.org/job/beam_PostCommit_Go_VR_Samza/ws/src/runners/samza/job-server/build/libs/beam-runners-samza-job-server-2.42.0-SNAPSHOT.jar> --job-port 53633 --expansion-port 0 --artifact-port 0
$ JOBSERVER_PID=1100543
$ SIMULTANEOUS=1
$ TAG=dev
$ ./gradlew :sdks:go:container:docker -Pdocker-tag=dev
Starting a Gradle Daemon, 2 busy Daemons could not be reused, use --status for details
[main] INFO org.apache.beam.runners.jobsubmission.JobServerDriver - ArtifactStagingService started on localhost:34827
[main] INFO org.apache.beam.runners.jobsubmission.JobServerDriver - Java ExpansionService started on localhost:45869
[main] INFO org.apache.beam.runners.jobsubmission.JobServerDriver - JobService started on localhost:53633
[main] INFO org.apache.beam.runners.jobsubmission.JobServerDriver - Job server now running, terminate with Ctrl+C
Configuration on demand is an incubating feature.
> Task :buildSrc:compileJava NO-SOURCE
> Task :buildSrc:compileGroovy UP-TO-DATE
> Task :buildSrc:pluginDescriptors UP-TO-DATE
> Task :buildSrc:processResources UP-TO-DATE
> Task :buildSrc:classes UP-TO-DATE
> Task :buildSrc:jar UP-TO-DATE
> Task :buildSrc:assemble UP-TO-DATE
> Task :buildSrc:spotlessGroovy UP-TO-DATE
> Task :buildSrc:spotlessGroovyCheck UP-TO-DATE
> Task :buildSrc:spotlessGroovyGradle UP-TO-DATE
> Task :buildSrc:spotlessGroovyGradleCheck UP-TO-DATE
> Task :buildSrc:spotlessCheck UP-TO-DATE
> Task :buildSrc:pluginUnderTestMetadata UP-TO-DATE
> Task :buildSrc:compileTestJava NO-SOURCE
> Task :buildSrc:compileTestGroovy NO-SOURCE
> Task :buildSrc:processTestResources NO-SOURCE
> Task :buildSrc:testClasses UP-TO-DATE
> Task :buildSrc:test NO-SOURCE
> Task :buildSrc:validatePlugins UP-TO-DATE
> Task :buildSrc:check UP-TO-DATE
> Task :buildSrc:build UP-TO-DATE
System Go installation: /snap/bin/go is go version go1.16.15 linux/amd64; Preparing to use /home/jenkins/go/bin/go1.18.1
GOCMD=/home/jenkins/go/bin/go1.18.1
go1.18.1: already downloaded in /home/jenkins/sdk/go1.18.1
> Task :sdks:go:container:copyLicenses UP-TO-DATE
> Task :sdks:go:container:dockerClean
> Task :sdks:go:container:goPrepare UP-TO-DATE
> Task :sdks:go:container:goBuild
/home/jenkins/go/bin/go1.18.1 build -o ./build/target/linux_amd64/boot boot.go boot_test.go
> Task :sdks:go:container:skipPullLicenses
> Task :sdks:go:container:dockerPrepare
> Task :sdks:go:container:docker
The command '/bin/sh -c apt-get update && DEBIAN_FRONTEND=noninteractive apt-get install -y ca-certificates && rm -rf /var/lib/apt/lists/*' returned a non-zero code: 100
FAILURE: Build failed with an exception.
* What went wrong:
Execution failed for task ':sdks:go:container:docker'.
> Process 'command 'docker'' finished with non-zero exit value 100
* Try:
> Run with --stacktrace option to get the stack trace.
> Run with --info or --debug option to get more log output.
> Run with --scan to get full insights.
* Get more help at https://help.gradle.org
BUILD FAILED in 46s
> Task :sdks:go:container:docker FAILED
16 actionable tasks: 5 executed, 11 up-to-date
Publishing build scan...
https://gradle.com/s/olaqb5ubaj6qk
$ ./gradlew :sdks:go:container:docker -Pdocker-tag=dev
> Task :sdks:go:test:samzaValidatesRunner FAILED
FAILURE: Build failed with an exception.
* Where:
Build file '<https://ci-beam.apache.org/job/beam_PostCommit_Go_VR_Samza/ws/src/sdks/go/test/build.gradle'> line: 95
* What went wrong:
Execution failed for task ':sdks:go:test:samzaValidatesRunner'.
> Process 'command 'sh'' finished with non-zero exit value 1
* Try:
> Run with --stacktrace option to get the stack trace.
> Run with --info or --debug option to get more log output.
> Run with --scan to get full insights.
* Get more help at https://help.gradle.org
Deprecated Gradle features were used in this build, making it incompatible with Gradle 8.0.
You can use '--warning-mode all' to show the individual deprecation warnings and determine if they come from your own scripts or plugins.
See https://docs.gradle.org/7.4/userguide/command_line_interface.html#sec:command_line_warnings
Execution optimizations have been disabled for 2 invalid unit(s) of work during this build to ensure correctness.
Please consult deprecation warnings for more details.
BUILD FAILED in 2m 57s
120 actionable tasks: 81 executed, 32 from cache, 7 up-to-date
Publishing build scan...
https://gradle.com/s/uhmnfl6smodc6
Build step 'Invoke Gradle script' changed build result to FAILURE
Build step 'Invoke Gradle script' marked build as failure
---------------------------------------------------------------------
To unsubscribe, e-mail: builds-unsubscribe@beam.apache.org
For additional commands, e-mail: builds-help@beam.apache.org
Jenkins build is back to normal : beam_PostCommit_Go_VR_Samza #1525
Posted by Apache Jenkins Server <je...@builds.apache.org>.
See <https://ci-beam.apache.org/job/beam_PostCommit_Go_VR_Samza/1525/display/redirect?page=changes>
---------------------------------------------------------------------
To unsubscribe, e-mail: builds-unsubscribe@beam.apache.org
For additional commands, e-mail: builds-help@beam.apache.org