You are viewing a plain text version of this content. The canonical link for it is here.
Posted to dev@uima.apache.org by Apache Jenkins Server <je...@builds.apache.org> on 2013/04/27 07:00:25 UTC
Build failed in Jenkins: UIMA-uimaFIT » uimaFIT - Legacy uimaFIT support #43
See <https://builds.apache.org/job/UIMA-uimaFIT/org.apache.uima$uimafit-legacy-support/43/changes>
Changes:
[rec] [UIMA-2803] createFSArray should return FSArray instead of ArrayFS
------------------------------------------
[INFO]
[INFO] ------------------------------------------------------------------------
[INFO] Building uimaFIT - Legacy uimaFIT support 2.0.0-SNAPSHOT
[INFO] ------------------------------------------------------------------------
[INFO]
[INFO] --- maven-clean-plugin:2.5:clean (default-clean) @ uimafit-legacy-support ---
[TASKS] Scanning folder '<https://builds.apache.org/job/UIMA-uimaFIT/org.apache.uima$uimafit-legacy-support/ws/'> for files matching the pattern '**/*.java' - excludes:
[TASKS] Found 72 files to scan for tasks
Found 4 open tasks.
[TASKS] Computing warning deltas based on reference build #42
[INFO]
[INFO] --- build-helper-maven-plugin:1.7:parse-version (parse-project-version) @ uimafit-legacy-support ---
[INFO]
[INFO] --- uima-build-helper-maven-plugin:4:parse-date-time (set buildYear and buildMonth) @ uimafit-legacy-support ---
[INFO]
[INFO] --- gmaven-plugin:1.4:execute (read-notice) @ uimafit-legacy-support ---
[INFO]
[INFO] --- maven-remote-resources-plugin:1.2.1:process (default) @ uimafit-legacy-support ---
[INFO] [INFO] Using 'UTF-8' encoding to copy filtered resources.
[INFO] skip non existing resourceDirectory <https://builds.apache.org/job/UIMA-uimaFIT/org.apache.uima$uimafit-legacy-support/ws/src/main/resources>
[INFO] Copying 3 resources
[INFO] --- maven-resources-plugin:2.6:resources (default-resources) @ uimafit-legacy-support ---
[INFO]
[INFO] --- maven-compiler-plugin:3.0:compile (default-compile) @ uimafit-legacy-support ---
[INFO] Changes detected - recompiling the module!
[INFO] Compiling 13 source files to <https://builds.apache.org/job/UIMA-uimaFIT/org.apache.uima$uimafit-legacy-support/ws/target/classes>
[INFO]
[INFO] --- build-helper-maven-plugin:1.7:parse-version (parse-project-version) @ uimafit-legacy-support ---
[INFO]
[INFO] --- uima-build-helper-maven-plugin:4:parse-date-time (set buildYear and buildMonth) @ uimafit-legacy-support ---
Apr 27, 2013 5:00:21 AM hudson.maven.ExecutedMojo <init>
WARNING: Failed to getClass for org.codehaus.mojo.exec.ExecJavaMojo
[INFO]
[INFO] --- exec-maven-plugin:1.2.1:java (default) @ uimafit-legacy-support ---
Apr 27, 2013 5:00:21 AM org.apache.uima.tools.jcasgen.UimaLoggerProgressMonitor subTask(35)
INFO: >>JCasGen Creating: 'org.apache.uima.fit.type.AnalyzedText'.
Apr 27, 2013 5:00:21 AM org.apache.uima.tools.jcasgen.UimaLoggerProgressMonitor subTask(35)
INFO: >>JCasGen Creating: 'org.apache.uima.fit.type.AnalyzedText_Type'.
Apr 27, 2013 5:00:21 AM org.apache.uima.tools.jcasgen.UimaLoggerProgressMonitor subTask(35)
INFO: >>JCasGen Creating: 'org.apache.uima.fit.type.Sentence'.
Apr 27, 2013 5:00:21 AM org.apache.uima.tools.jcasgen.UimaLoggerProgressMonitor subTask(35)
INFO: >>JCasGen Creating: 'org.apache.uima.fit.type.Sentence_Type'.
Apr 27, 2013 5:00:21 AM org.apache.uima.tools.jcasgen.UimaLoggerProgressMonitor subTask(35)
INFO: >>JCasGen Creating: 'org.apache.uima.fit.type.Token'.
Apr 27, 2013 5:00:21 AM org.apache.uima.tools.jcasgen.UimaLoggerProgressMonitor subTask(35)
INFO: >>JCasGen Creating: 'org.apache.uima.fit.type.Token_Type'.
[INFO] [INFO] Using 'UTF-8' encoding to copy filtered resources.
[INFO] --- maven-resources-plugin:2.6:testResources (default-testResources) @ uimafit-legacy-support ---
[INFO] Copying 24 resources
[INFO] Copying 3 resources
[INFO] Test Source directory: <https://builds.apache.org/job/UIMA-uimaFIT/org.apache.uima$uimafit-legacy-support/ws/target/generated-sources/jcasgen> added.
[INFO]
[INFO] --- build-helper-maven-plugin:1.7:add-test-source (add-test-source) @ uimafit-legacy-support ---
[INFO]
[INFO] --- maven-compiler-plugin:3.0:testCompile (default-testCompile) @ uimafit-legacy-support ---
[INFO] Changes detected - recompiling the module!
[INFO] Compiling 65 source files to <https://builds.apache.org/job/UIMA-uimaFIT/org.apache.uima$uimafit-legacy-support/ws/target/test-classes>
[INFO] -------------------------------------------------------------
[ERROR] COMPILATION ERROR :
[INFO] -------------------------------------------------------------
[ERROR] <https://builds.apache.org/job/UIMA-uimaFIT/org.apache.uima$uimafit-legacy-support/ws/src/test/java/org/apache/uima/fit/util/JCasUtilTest.java>:[32] cannot find symbol
symbol : static isCovered
location: class org.apache.uima.fit.util.JCasUtil
[ERROR] <https://builds.apache.org/job/UIMA-uimaFIT/org.apache.uima$uimafit-legacy-support/ws/src/test/java/org/apache/uima/fit/factory/AnalysisEngineFactoryTest.java>:[196,58] cannot find symbol
symbol : method createAggregate(java.util.List<org.apache.uima.analysis_engine.AnalysisEngineDescription>,java.util.List<java.lang.String>,org.apache.uima.resource.metadata.TypeSystemDescription,<nulltype>,org.apache.uima.analysis_engine.metadata.SofaMapping[])
location: class org.apache.uima.fit.factory.AnalysisEngineFactory
[ERROR] <https://builds.apache.org/job/UIMA-uimaFIT/org.apache.uima$uimafit-legacy-support/ws/src/test/java/org/apache/uima/fit/util/JCasUtilTest.java>:[542,15] cannot find symbol
symbol : method isCovered(org.apache.uima.jcas.JCas,org.apache.uima.fit.type.Sentence,java.lang.Class<org.apache.uima.fit.type.Token>)
location: class org.apache.uima.fit.util.JCasUtilTest
[ERROR] <https://builds.apache.org/job/UIMA-uimaFIT/org.apache.uima$uimafit-legacy-support/ws/src/test/java/org/apache/uima/fit/util/JCasUtilTest.java>:[549,16] cannot find symbol
symbol : method isCovered(org.apache.uima.jcas.JCas,org.apache.uima.fit.type.Sentence,java.lang.Class<org.apache.uima.fit.type.Token>)
location: class org.apache.uima.fit.util.JCasUtilTest
[INFO] 4 errors
[INFO] -------------------------------------------------------------
Jenkins build is back to normal : UIMA-uimaFIT » uimaFIT - Legacy uimaFIT support #44
Posted by Apache Jenkins Server <je...@builds.apache.org>.
See <https://builds.apache.org/job/UIMA-uimaFIT/org.apache.uima$uimafit-legacy-support/44/changes>