You are viewing a plain text version of this content. The canonical link for it is here.
Posted to dev@brooklyn.apache.org by Apache Jenkins Server <je...@builds.apache.org> on 2015/10/21 16:02:30 UTC
Build failed in Jenkins: incubator-brooklyn-master-windows #328
See <https://builds.apache.org/job/incubator-brooklyn-master-windows/328/changes>
Changes:
[christopher.burke] Updated sensors section
------------------------------------------
[...truncated 16630 lines...]
[INFO] Using 'UTF-8' encoding to copy filtered resources.
[INFO] skip non existing resourceDirectory F:\hudson\hudson-slave\workspace\incubator-brooklyn-master-windows\utils\jmx\jmxrmi-agent\src\test\resources
[INFO] Copying 4 resources
[INFO]
[INFO] --- maven-compiler-plugin:3.3:testCompile (default-testCompile) @ brooklyn-jmxrmi-agent ---
[INFO] Changes detected - recompiling the module!
[INFO] Compiling 1 source file to F:\hudson\hudson-slave\workspace\incubator-brooklyn-master-windows\utils\jmx\jmxrmi-agent\target\test-classes
[INFO]
[INFO] --- maven-surefire-plugin:2.18.1:test (default-test) @ brooklyn-jmxrmi-agent ---
[JENKINS] Recording test results
[INFO]
[INFO] --- maven-jar-plugin:2.6:jar (default-jar) @ brooklyn-jmxrmi-agent ---
[INFO] Building jar: F:\hudson\hudson-slave\workspace\incubator-brooklyn-master-windows\utils\jmx\jmxrmi-agent\target\brooklyn-jmxrmi-agent-0.9.0-SNAPSHOT.jar
[INFO]
[INFO] --- maven-site-plugin:3.4:attach-descriptor (attach-descriptor) @ brooklyn-jmxrmi-agent ---
[INFO]
[INFO] --- maven-jar-plugin:2.6:test-jar (test-jar-creation) @ brooklyn-jmxrmi-agent ---
[INFO] Building jar: F:\hudson\hudson-slave\workspace\incubator-brooklyn-master-windows\utils\jmx\jmxrmi-agent\target\brooklyn-jmxrmi-agent-0.9.0-SNAPSHOT-tests.jar
[INFO]
[INFO] --- apache-rat-plugin:0.10:check (default) @ brooklyn-jmxrmi-agent ---
[INFO] 51 implicit excludes (use -debug for more details).
[INFO] Exclude: sandbox/**
[INFO] Exclude: release/**
[INFO] Exclude: **/nbactions.xml
[INFO] Exclude: **/nb-configuration.xml
[INFO] Exclude: **/.git/**
[INFO] Exclude: **/.gitignore
[INFO] Exclude: **/.repository/**
[INFO] Exclude: **/.idea/**
[INFO] Exclude: **/*.iml
[INFO] Exclude: **/.classpath/**
[INFO] Exclude: **/.project
[INFO] Exclude: **/.settings/**
[INFO] Exclude: **/*.log
[INFO] Exclude: **/brooklyn*.log.*
[INFO] Exclude: **/target/**
[INFO] Exclude: ignored/**
[INFO] Exclude: LICENSE.md
[INFO] Exclude: **/src/main/license/**
[INFO] Exclude: **/src/test/license/**
[INFO] Exclude: **/MANIFEST.MF
[INFO] Exclude: **/test-output/**
[INFO] Exclude: **/*.pem.pub
[INFO] Exclude: **/*.pem
[INFO] Exclude: **/*_rsa.pub
[INFO] Exclude: **/*_rsa
[INFO] Exclude: **/*.svg
[INFO] Exclude: **/*.crt
[INFO] Exclude: **/*.csr
[INFO] Exclude: **/*.key
[INFO] Exclude: **/*.key.org
[INFO] Exclude: **/*.psd
[INFO] Exclude: **/*.json
[INFO] Exclude: **/*.plxarc
[INFO] Exclude: **/src/test/resources/org/apache/brooklyn/entity/software/base/template_with_extra_substitutions.txt
[INFO] Exclude: **/src/main/resources/banner.txt
[INFO] Exclude: **/src/test/resources/ssl/certs/localhost/info.txt
[INFO] Exclude: **/sandbox/examples/src/main/scripts/amis.txt
[INFO] Exclude: docs/**
[INFO] 3 resources included (use -debug for more details)
[INFO] Rat check: Summary of files. Unapproved: 0 unknown: 0 generated: 0 approved: 3 licence.
[INFO]
[INFO] --- maven-source-plugin:2.4:jar-no-fork (attach-sources) @ brooklyn-jmxrmi-agent ---
[INFO] Building jar: F:\hudson\hudson-slave\workspace\incubator-brooklyn-master-windows\utils\jmx\jmxrmi-agent\target\brooklyn-jmxrmi-agent-0.9.0-SNAPSHOT-sources.jar
[INFO]
[INFO] --- maven-install-plugin:2.5.2:install (default-install) @ brooklyn-jmxrmi-agent ---
[INFO] Installing F:\hudson\hudson-slave\workspace\incubator-brooklyn-master-windows\utils\jmx\jmxrmi-agent\target\brooklyn-jmxrmi-agent-0.9.0-SNAPSHOT.jar to f:\hudson\hudson-slave\maven-repositories\1\org\apache\brooklyn\brooklyn-jmxrmi-agent\0.9.0-SNAPSHOT\brooklyn-jmxrmi-agent-0.9.0-SNAPSHOT.jar
[INFO] Installing F:\hudson\hudson-slave\workspace\incubator-brooklyn-master-windows\utils\jmx\jmxrmi-agent\pom.xml to f:\hudson\hudson-slave\maven-repositories\1\org\apache\brooklyn\brooklyn-jmxrmi-agent\0.9.0-SNAPSHOT\brooklyn-jmxrmi-agent-0.9.0-SNAPSHOT.pom
[INFO] Installing F:\hudson\hudson-slave\workspace\incubator-brooklyn-master-windows\utils\jmx\jmxrmi-agent\target\brooklyn-jmxrmi-agent-0.9.0-SNAPSHOT-tests.jar to f:\hudson\hudson-slave\maven-repositories\1\org\apache\brooklyn\brooklyn-jmxrmi-agent\0.9.0-SNAPSHOT\brooklyn-jmxrmi-agent-0.9.0-SNAPSHOT-tests.jar
[INFO] Installing F:\hudson\hudson-slave\workspace\incubator-brooklyn-master-windows\utils\jmx\jmxrmi-agent\target\brooklyn-jmxrmi-agent-0.9.0-SNAPSHOT-sources.jar to f:\hudson\hudson-slave\maven-repositories\1\org\apache\brooklyn\brooklyn-jmxrmi-agent\0.9.0-SNAPSHOT\brooklyn-jmxrmi-agent-0.9.0-SNAPSHOT-sources.jar
[JENKINS] Archiving disabled
[INFO]
[INFO] ------------------------------------------------------------------------
[INFO] Skipping Brooklyn Software Base
[INFO] This project has been banned from the build due to previous failures.
[INFO] ------------------------------------------------------------------------
[INFO]
[INFO] ------------------------------------------------------------------------
[INFO] Skipping Brooklyn Web App Software Entities
[INFO] This project has been banned from the build due to previous failures.
[INFO] ------------------------------------------------------------------------
[INFO]
[INFO] ------------------------------------------------------------------------
[INFO] Skipping Brooklyn Database Software Entities
[INFO] This project has been banned from the build due to previous failures.
[INFO] ------------------------------------------------------------------------
[INFO]
[INFO] ------------------------------------------------------------------------
[INFO] Skipping Brooklyn NoSQL Data Store Software Entities
[INFO] This project has been banned from the build due to previous failures.
[INFO] ------------------------------------------------------------------------
[INFO]
[INFO] ------------------------------------------------------------------------
[INFO] Skipping Brooklyn CAMP REST API
[INFO] This project has been banned from the build due to previous failures.
[INFO] ------------------------------------------------------------------------
[INFO]
[INFO] ------------------------------------------------------------------------
[INFO] Skipping Brooklyn REST Server
[INFO] This project has been banned from the build due to previous failures.
[INFO] ------------------------------------------------------------------------
[INFO]
[INFO] ------------------------------------------------------------------------
[INFO] Skipping Brooklyn REST JavaScript Web GUI
[INFO] This project has been banned from the build due to previous failures.
[INFO] ------------------------------------------------------------------------
[INFO]
[INFO] ------------------------------------------------------------------------
[INFO] Skipping Brooklyn Launcher
[INFO] This project has been banned from the build due to previous failures.
[INFO] ------------------------------------------------------------------------
[INFO]
[INFO] ------------------------------------------------------------------------
[INFO] Skipping Brooklyn Command Line Interface
[INFO] This project has been banned from the build due to previous failures.
[INFO] ------------------------------------------------------------------------
[INFO]
[INFO] ------------------------------------------------------------------------
[INFO] Skipping Brooklyn All Things
[INFO] This project has been banned from the build due to previous failures.
[INFO] ------------------------------------------------------------------------
[INFO]
[INFO] ------------------------------------------------------------------------
[INFO] Skipping Brooklyn Simple Web Cluster Example
[INFO] This project has been banned from the build due to previous failures.
[INFO] ------------------------------------------------------------------------
[INFO]
[INFO] ------------------------------------------------------------------------
[INFO] Skipping Brooklyn Global Web Fabric Example
[INFO] This project has been banned from the build due to previous failures.
[INFO] ------------------------------------------------------------------------
[INFO]
[INFO] ------------------------------------------------------------------------
[INFO] Skipping Brooklyn Simple Messaging Publish-Subscribe Example
[INFO] This project has been banned from the build due to previous failures.
[INFO] ------------------------------------------------------------------------
[INFO]
[INFO] ------------------------------------------------------------------------
[INFO] Skipping Brooklyn NoSQL Cluster Examples
[INFO] This project has been banned from the build due to previous failures.
[INFO] ------------------------------------------------------------------------
[INFO]
[INFO] ------------------------------------------------------------------------
[INFO] Skipping Brooklyn Distribution
[INFO] This project has been banned from the build due to previous failures.
[INFO] ------------------------------------------------------------------------
[INFO]
[INFO] ------------------------------------------------------------------------
[INFO] Skipping Brooklyn QA
[INFO] This project has been banned from the build due to previous failures.
[INFO] ------------------------------------------------------------------------
[INFO]
[INFO] ------------------------------------------------------------------------
[INFO] Skipping Brooklyn REST Client
[INFO] This project has been banned from the build due to previous failures.
[INFO] ------------------------------------------------------------------------
[INFO] ------------------------------------------------------------------------
[INFO] Reactor Summary:
[INFO]
[INFO] Brooklyn Root ..................................... SUCCESS [2.431s]
[INFO] Brooklyn Parent Project ........................... SUCCESS [7.152s]
[INFO] Brooklyn Logback Configuration .................... SUCCESS [4.881s]
[INFO] Brooklyn Test Support Utilities ................... SUCCESS [3.393s]
[INFO] Brooklyn Logback Includable Configuration ......... SUCCESS [1.719s]
[INFO] Brooklyn Common Utilities ......................... SUCCESS [29.983s]
[INFO] Brooklyn API ...................................... SUCCESS [5.103s]
[INFO] Brooklyn Test Support ............................. SUCCESS [2.992s]
[INFO] CAMP Server Parent Project ........................ SUCCESS [0.405s]
[INFO] CAMP Base ......................................... SUCCESS [7.076s]
[INFO] Brooklyn Groovy Utilities ......................... SUCCESS [9.793s]
[INFO] Brooklyn Core ..................................... FAILURE [5:24.587s]
[INFO] Brooklyn Policies ................................. SKIPPED
[INFO] Brooklyn WinRM Software Entities .................. SKIPPED
[INFO] Brooklyn Jclouds Location Targets ................. SKIPPED
[INFO] Brooklyn Secure JMXMP Agent ....................... SKIPPED
[INFO] Brooklyn JMX RMI Agent ............................ SUCCESS [4.994s]
[INFO] Brooklyn Software Base ............................ SKIPPED
[INFO] Brooklyn Web App Software Entities ................ SKIPPED
[INFO] Brooklyn Database Software Entities ............... SKIPPED
[INFO] Brooklyn NoSQL Data Store Software Entities ....... SKIPPED
[INFO] Brooklyn CAMP REST API ............................ SKIPPED
[INFO] Brooklyn REST Server .............................. SKIPPED
[INFO] Brooklyn REST JavaScript Web GUI .................. SKIPPED
[INFO] Brooklyn Launcher ................................. SKIPPED
[INFO] Brooklyn Command Line Interface ................... SKIPPED
[INFO] Brooklyn All Things ............................... SKIPPED
[INFO] Brooklyn Simple Web Cluster Example ............... SKIPPED
[INFO] Brooklyn Global Web Fabric Example ................ SKIPPED
[INFO] Brooklyn Simple Messaging Publish-Subscribe Example SKIPPED
[INFO] Brooklyn NoSQL Cluster Examples ................... SKIPPED
[INFO] Brooklyn Distribution ............................. SKIPPED
[INFO] Brooklyn QA ....................................... SKIPPED
[INFO] Brooklyn REST Client .............................. SKIPPED
[INFO] ------------------------------------------------------------------------
[INFO] BUILD FAILURE
[INFO] ------------------------------------------------------------------------
[INFO] Total time: 6:52.060s
[INFO] Finished at: Wed Oct 21 15:03:16 BST 2015
[INFO] Final Memory: 55M/244M
[INFO] ------------------------------------------------------------------------
[JENKINS] Archiving disabled
[JENKINS] Archiving disabled
[JENKINS] Archiving disabled
[JENKINS] Archiving disabled
[JENKINS] Archiving disabled
[JENKINS] Archiving disabled
[JENKINS] Archiving disabled
[JENKINS] Archiving disabled
[JENKINS] Archiving disabled
[JENKINS] Archiving disabled
[JENKINS] Archiving disabled
[JENKINS] Archiving disabled
[JENKINS] Archiving disabled
[JENKINS] Archiving disabled
[JENKINS] Archiving disabled
[JENKINS] Archiving disabled
[JENKINS] Archiving disabled
[JENKINS] Archiving disabled
[JENKINS] Archiving disabled
[JENKINS] Archiving disabled
[JENKINS] Archiving disabled
[JENKINS] Archiving disabled
[JENKINS] Archiving disabled
[JENKINS] Archiving disabled
[JENKINS] Archiving disabled
[JENKINS] Archiving disabled
[JENKINS] Archiving disabled
[JENKINS] Archiving disabled
[JENKINS] Archiving disabled
[JENKINS] Archiving disabled
[JENKINS] Archiving disabled
[JENKINS] Archiving disabled
[JENKINS] Archiving disabled
[JENKINS] Archiving disabled
Waiting for Jenkins to finish collecting data
[ERROR] Failed to execute goal org.apache.maven.plugins:maven-surefire-plugin:2.18.1:test (default-test) on project brooklyn-core: There are test failures.
[ERROR]
[ERROR] Please refer to F:\hudson\hudson-slave\workspace\incubator-brooklyn-master-windows\core\target\surefire-reports for the individual test results.
[ERROR] -> [Help 1]
[ERROR]
[ERROR] To see the full stack trace of the errors, re-run Maven with the -e switch.
[ERROR] Re-run Maven using the -X switch to enable full debug logging.
[ERROR]
[ERROR] For more information about the errors and possible solutions, please read the following articles:
[ERROR] [Help 1] http://cwiki.apache.org/confluence/display/MAVEN/MojoFailureException
[ERROR]
[ERROR] After correcting the problems, you can resume the build with the command
[ERROR] mvn <goals> -rf :brooklyn-core
channel stopped
Jenkins build is back to normal : incubator-brooklyn-master-windows
#334
Posted by Apache Jenkins Server <je...@builds.apache.org>.
See <https://builds.apache.org/job/incubator-brooklyn-master-windows/334/changes>
Build failed in Jenkins: incubator-brooklyn-master-windows #333
Posted by Apache Jenkins Server <je...@builds.apache.org>.
See <https://builds.apache.org/job/incubator-brooklyn-master-windows/333/changes>
Changes:
[svetoslav.neykov] Convert groovy tests to java
[svetoslav.neykov] Adjuncts shouldn't mutate passed flags
[svetoslav.neykov] Remove deprecated and unused groovy code
[svetoslav.neykov] Reimplement GroovyJavaMethods in Java
[svetoslav.neykov] Remove groovy dependencies
------------------------------------------
[...truncated 32370 lines...]
[INFO] 2015-10-25 23:33:16,369 INFO Stopping MySqlNodeImpl{id=Zg7NeJPF} in []
[INFO] 2015-10-25 23:33:16,420 INFO Stopping NginxControllerImpl{id=d3yQXwWi} in []
[INFO] 2015-10-25 23:33:16,502 INFO Stopped application ClusterWebServerDatabaseSample{id=UJ8eCDBt}
[INFO] 2015-10-25 23:33:16,915 INFO TESTNG PASSED CONFIGURATION: "Surefire test" - @AfterMethod com.acme.sample.brooklyn.sample.app.SampleUnitTest.shutdown() finished in 737 ms
[INFO] 2015-10-25 23:33:16,917 INFO TESTNG INVOKING CONFIGURATION: "Surefire test" - @BeforeMethod com.acme.sample.brooklyn.sample.app.SampleUnitTest.setup()
[INFO] 2015-10-25 23:33:18,339 INFO TESTNG PASSED CONFIGURATION: "Surefire test" - @BeforeMethod com.acme.sample.brooklyn.sample.app.SampleUnitTest.setup() finished in 1422 ms
[INFO] 2015-10-25 23:33:18,339 INFO TESTNG INVOKING: "Surefire test" - com.acme.sample.brooklyn.sample.app.SampleUnitTest.testSampleSingleStructure()
[INFO] 2015-10-25 23:33:18,442 INFO app from spec is: SingleWebServerSample{id=RjTEZuH7}
[INFO] 2015-10-25 23:33:18,446 INFO TESTNG PASSED: "Surefire test" - com.acme.sample.brooklyn.sample.app.SampleUnitTest.testSampleSingleStructure() finished in 107 ms
[INFO] 2015-10-25 23:33:18,447 INFO TESTNG INVOKING CONFIGURATION: "Surefire test" - @AfterMethod com.acme.sample.brooklyn.sample.app.SampleUnitTest.shutdown()
[INFO] 2015-10-25 23:33:18,463 INFO Stopping application SingleWebServerSample{id=RjTEZuH7}
[INFO] 2015-10-25 23:33:18,467 INFO Stopping JBoss7ServerImpl{id=TrceVlkc} in []
[INFO] 2015-10-25 23:33:18,479 INFO Stopped application SingleWebServerSample{id=RjTEZuH7}
[INFO] 2015-10-25 23:33:18,872 INFO TESTNG PASSED CONFIGURATION: "Surefire test" - @AfterMethod com.acme.sample.brooklyn.sample.app.SampleUnitTest.shutdown() finished in 426 ms
[INFO] 2015-10-25 23:33:18,887 INFO TESTNG
[INFO] ===============================================
[INFO] Surefire test
[INFO] Tests run: 2, Failures: 0, Skips: 0
[INFO] ===============================================
[INFO] Tests run: 2, Failures: 0, Errors: 0, Skipped: 0, Time elapsed: 8.45 sec - in TestSuite
[INFO]
[INFO] Results :
[INFO]
[INFO] Tests run: 2, Failures: 0, Errors: 0, Skipped: 0
[INFO]
[INFO] [INFO]
[INFO] [INFO] --- maven-jar-plugin:2.6:jar (default-jar) @ brooklyn-sample ---
[INFO] [INFO] Building jar: F:\hudson\hudson-slave\workspace\incubator-brooklyn-master-windows\usage\archetypes\quickstart\target\test-classes\projects\integration-test-1\project\brooklyn-sample\target\brooklyn-sample-0.1.0-SNAPSHOT.jar
[INFO] [INFO]
[INFO] [INFO] --- maven-site-plugin:3.4:attach-descriptor (attach-descriptor) @ brooklyn-sample ---
[INFO] [INFO]
[INFO] [INFO] --- maven-jar-plugin:2.6:test-jar (test-jar-creation) @ brooklyn-sample ---
[INFO] [INFO] Building jar: F:\hudson\hudson-slave\workspace\incubator-brooklyn-master-windows\usage\archetypes\quickstart\target\test-classes\projects\integration-test-1\project\brooklyn-sample\target\brooklyn-sample-0.1.0-SNAPSHOT-tests.jar
[INFO] [INFO]
[INFO] [INFO] --- maven-install-plugin:2.5.2:install (default-install) @ brooklyn-sample ---
[INFO] [INFO] Installing F:\hudson\hudson-slave\workspace\incubator-brooklyn-master-windows\usage\archetypes\quickstart\target\test-classes\projects\integration-test-1\project\brooklyn-sample\target\brooklyn-sample-0.1.0-SNAPSHOT.jar to F:\hudson\hudson-slave\maven-repositories\0\com\acme\sample\brooklyn-sample\0.1.0-SNAPSHOT\brooklyn-sample-0.1.0-SNAPSHOT.jar
[INFO] [INFO] Installing F:\hudson\hudson-slave\workspace\incubator-brooklyn-master-windows\usage\archetypes\quickstart\target\test-classes\projects\integration-test-1\project\brooklyn-sample\pom.xml to F:\hudson\hudson-slave\maven-repositories\0\com\acme\sample\brooklyn-sample\0.1.0-SNAPSHOT\brooklyn-sample-0.1.0-SNAPSHOT.pom
[INFO] [INFO] Installing F:\hudson\hudson-slave\workspace\incubator-brooklyn-master-windows\usage\archetypes\quickstart\target\test-classes\projects\integration-test-1\project\brooklyn-sample\target\brooklyn-sample-0.1.0-SNAPSHOT-tests.jar to F:\hudson\hudson-slave\maven-repositories\0\com\acme\sample\brooklyn-sample\0.1.0-SNAPSHOT\brooklyn-sample-0.1.0-SNAPSHOT-tests.jar
[INFO] [INFO] ------------------------------------------------------------------------
[INFO] [INFO] BUILD SUCCESS
[INFO] [INFO] ------------------------------------------------------------------------
[INFO] [INFO] Total time: 33.040s
[INFO] [INFO] Finished at: Sun Oct 25 23:33:20 GMT 2015
[INFO] [INFO] Final Memory: 44M/236M
[INFO] [INFO] ------------------------------------------------------------------------
[INFO] Post-archetype-generation invoker exit code: 0
[JENKINS] Recording test results
[INFO]
[INFO] --- apache-rat-plugin:0.10:check (default) @ brooklyn-archetype-quickstart ---
[INFO] 51 implicit excludes (use -debug for more details).
[INFO] Exclude: sandbox/**
[INFO] Exclude: release/**
[INFO] Exclude: **/nbactions.xml
[INFO] Exclude: **/nb-configuration.xml
[INFO] Exclude: **/src/main/resources/archetype-resources/**/*
[INFO] Exclude: **/src/test/resources/projects/integration-test-1/goal.txt
[INFO] Exclude: **/src/test/resources/projects/integration-test-1/reference/**/*
[INFO] Exclude: **/src/main/java/sample/**/*Sample*.java
[INFO] Exclude: **/src/main/resources/logback-custom.xml
[INFO] Exclude: **/src/brooklyn-sample/README.md
[INFO] Exclude: **/src/brooklyn-sample/pom.xml
[INFO] Exclude: **/src/brooklyn-sample/src/main/assembly/files/conf/*
[INFO] Exclude: **/src/brooklyn-sample/src/main/java/**/*.java
[INFO] Exclude: **/src/brooklyn-sample/src/main/resources/logback-custom.xml
[INFO] Exclude: **/src/brooklyn-sample/src/test/java/**/*.java
[INFO] Exclude: **/.git/**
[INFO] Exclude: **/.gitignore
[INFO] Exclude: **/.repository/**
[INFO] Exclude: **/.idea/**
[INFO] Exclude: **/*.iml
[INFO] Exclude: **/.classpath/**
[INFO] Exclude: **/.project
[INFO] Exclude: **/.settings/**
[INFO] Exclude: **/*.log
[INFO] Exclude: **/brooklyn*.log.*
[INFO] Exclude: **/target/**
[INFO] Exclude: ignored/**
[INFO] Exclude: LICENSE.md
[INFO] Exclude: **/src/main/license/**
[INFO] Exclude: **/src/test/license/**
[INFO] Exclude: **/MANIFEST.MF
[INFO] Exclude: **/test-output/**
[INFO] Exclude: **/*.pem.pub
[INFO] Exclude: **/*.pem
[INFO] Exclude: **/*_rsa.pub
[INFO] Exclude: **/*_rsa
[INFO] Exclude: **/*.svg
[INFO] Exclude: **/*.crt
[INFO] Exclude: **/*.csr
[INFO] Exclude: **/*.key
[INFO] Exclude: **/*.key.org
[INFO] Exclude: **/*.psd
[INFO] Exclude: **/*.json
[INFO] Exclude: **/*.plxarc
[INFO] Exclude: **/src/test/resources/org/apache/brooklyn/entity/software/base/template_with_extra_substitutions.txt
[INFO] Exclude: **/src/main/resources/banner.txt
[INFO] Exclude: **/src/test/resources/ssl/certs/localhost/info.txt
[INFO] Exclude: **/sandbox/examples/src/main/scripts/amis.txt
[INFO] Exclude: docs/**
[INFO] 9 resources included (use -debug for more details)
[INFO] Rat check: Summary of files. Unapproved: 0 unknown: 0 generated: 0 approved: 7 licence.
[INFO]
[INFO] --- maven-source-plugin:2.4:jar-no-fork (attach-sources) @ brooklyn-archetype-quickstart ---
[INFO] Building jar: F:\hudson\hudson-slave\workspace\incubator-brooklyn-master-windows\usage\archetypes\quickstart\target\brooklyn-archetype-quickstart-0.9.0-SNAPSHOT-sources.jar
[INFO]
[INFO] --- maven-install-plugin:2.5.2:install (default-install) @ brooklyn-archetype-quickstart ---
[INFO] Installing F:\hudson\hudson-slave\workspace\incubator-brooklyn-master-windows\usage\archetypes\quickstart\target\brooklyn-archetype-quickstart-0.9.0-SNAPSHOT.jar to f:\hudson\hudson-slave\maven-repositories\0\org\apache\brooklyn\brooklyn-archetype-quickstart\0.9.0-SNAPSHOT\brooklyn-archetype-quickstart-0.9.0-SNAPSHOT.jar
[INFO] Installing F:\hudson\hudson-slave\workspace\incubator-brooklyn-master-windows\usage\archetypes\quickstart\pom.xml to f:\hudson\hudson-slave\maven-repositories\0\org\apache\brooklyn\brooklyn-archetype-quickstart\0.9.0-SNAPSHOT\brooklyn-archetype-quickstart-0.9.0-SNAPSHOT.pom
[INFO] Installing F:\hudson\hudson-slave\workspace\incubator-brooklyn-master-windows\usage\archetypes\quickstart\target\brooklyn-archetype-quickstart-0.9.0-SNAPSHOT-tests.jar to f:\hudson\hudson-slave\maven-repositories\0\org\apache\brooklyn\brooklyn-archetype-quickstart\0.9.0-SNAPSHOT\brooklyn-archetype-quickstart-0.9.0-SNAPSHOT-tests.jar
[INFO] Installing F:\hudson\hudson-slave\workspace\incubator-brooklyn-master-windows\usage\archetypes\quickstart\target\brooklyn-archetype-quickstart-0.9.0-SNAPSHOT-sources.jar to f:\hudson\hudson-slave\maven-repositories\0\org\apache\brooklyn\brooklyn-archetype-quickstart\0.9.0-SNAPSHOT\brooklyn-archetype-quickstart-0.9.0-SNAPSHOT-sources.jar
[INFO]
[INFO] --- maven-archetype-plugin:2.3:update-local-catalog (default-update-local-catalog) @ brooklyn-archetype-quickstart ---
[JENKINS] Archiving disabled
[INFO]
[INFO] ------------------------------------------------------------------------
[INFO] Skipping Brooklyn Distribution
[INFO] This project has been banned from the build due to previous failures.
[INFO] ------------------------------------------------------------------------
[INFO]
[INFO] ------------------------------------------------------------------------
[INFO] Skipping Brooklyn QA
[INFO] This project has been banned from the build due to previous failures.
[INFO] ------------------------------------------------------------------------
[INFO]
[INFO] ------------------------------------------------------------------------
[INFO] Skipping Brooklyn REST Client
[INFO] This project has been banned from the build due to previous failures.
[INFO] ------------------------------------------------------------------------
[INFO] ------------------------------------------------------------------------
[INFO] Reactor Summary:
[INFO]
[INFO] Brooklyn Root ..................................... SUCCESS [3.359s]
[INFO] Brooklyn Parent Project ........................... SUCCESS [8.136s]
[INFO] Brooklyn Logback Configuration .................... SUCCESS [5.054s]
[INFO] Brooklyn Test Support Utilities ................... SUCCESS [3.767s]
[INFO] Brooklyn Logback Includable Configuration ......... SUCCESS [1.173s]
[INFO] Brooklyn Common Utilities ......................... SUCCESS [28.428s]
[INFO] Brooklyn API ...................................... SUCCESS [4.935s]
[INFO] Brooklyn Test Support ............................. SUCCESS [2.752s]
[INFO] Brooklyn Downstream Project Parent ................ SUCCESS [0.284s]
[INFO] CAMP Server Parent Project ........................ SUCCESS [0.743s]
[INFO] CAMP Base ......................................... SUCCESS [5.275s]
[INFO] Brooklyn REST Swagger Apidoc Utilities ............ SUCCESS [5.385s]
[INFO] CAMP Server ....................................... SUCCESS [9.776s]
[INFO] Brooklyn Groovy Utilities ......................... SUCCESS [1.454s]
[INFO] Brooklyn Core ..................................... SUCCESS [4:16.711s]
[INFO] Brooklyn Examples Aggregator Project .............. SUCCESS [0.511s]
[INFO] Brooklyn Examples Aggregator Project - Webapps .... SUCCESS [0.283s]
[INFO] hello-world-webapp Maven Webapp ................... SUCCESS [1.446s]
[INFO] hello-world-sql-webapp Maven Webapp ............... SUCCESS [2.647s]
[INFO] Brooklyn Policies ................................. SUCCESS [1:30.214s]
[INFO] Brooklyn WinRM Software Entities .................. SUCCESS [11.312s]
[INFO] Brooklyn Jclouds Location Targets ................. SUCCESS [41.478s]
[INFO] Brooklyn Secure JMXMP Agent ....................... SUCCESS [11.375s]
[INFO] Brooklyn JMX RMI Agent ............................ SUCCESS [1.002s]
[INFO] Brooklyn Software Base ............................ SUCCESS [1:11.219s]
[INFO] Brooklyn Web App Software Entities ................ SUCCESS [2:01.392s]
[INFO] Brooklyn Messaging Software Entities .............. SUCCESS [10.403s]
[INFO] Brooklyn Database Software Entities ............... SUCCESS [6.504s]
[INFO] Brooklyn Monitoring Software Entities ............. SUCCESS [4.187s]
[INFO] Brooklyn OSGi Software Entities ................... SUCCESS [5.902s]
[INFO] Brooklyn NoSQL Data Store Software Entities ....... SUCCESS [21.119s]
[INFO] Brooklyn Network Software Entities ................ SUCCESS [5.365s]
[INFO] Brooklyn REST API ................................. SUCCESS [5.365s]
[INFO] Brooklyn CAMP REST API ............................ FAILURE [3:49.958s]
[INFO] Brooklyn REST Server .............................. SKIPPED
[INFO] Brooklyn REST JavaScript Web GUI .................. SKIPPED
[INFO] Brooklyn Launcher ................................. SKIPPED
[INFO] Brooklyn Command Line Interface ................... SKIPPED
[INFO] Brooklyn All Things ............................... SKIPPED
[INFO] Brooklyn Simple Web Cluster Example ............... SKIPPED
[INFO] Brooklyn Global Web Fabric Example ................ SKIPPED
[INFO] Brooklyn Simple Messaging Publish-Subscribe Example SKIPPED
[INFO] Brooklyn NoSQL Cluster Examples ................... SKIPPED
[INFO] Brooklyn Hazelcast Storage ........................ SUCCESS [3.354s]
[INFO] Brooklyn Quick-Start Project Archetype ............ SUCCESS [39.070s]
[INFO] Brooklyn Distribution ............................. SKIPPED
[INFO] Brooklyn QA ....................................... SKIPPED
[INFO] Brooklyn REST Client .............................. SKIPPED
[INFO] ------------------------------------------------------------------------
[INFO] BUILD FAILURE
[INFO] ------------------------------------------------------------------------
[INFO] Total time: 17:12.335s
[INFO] Finished at: Sun Oct 25 23:33:20 GMT 2015
[INFO] Final Memory: 96M/242M
[INFO] ------------------------------------------------------------------------
[JENKINS] Archiving disabled
[JENKINS] Archiving disabled
[JENKINS] Archiving disabled
[JENKINS] Archiving disabled
[JENKINS] Archiving disabled
[JENKINS] Archiving disabled
[JENKINS] Archiving disabled
[JENKINS] Archiving disabled
[JENKINS] Archiving disabled
[JENKINS] Archiving disabled
[JENKINS] Archiving disabled
[JENKINS] Archiving disabled
[JENKINS] Archiving disabled
[JENKINS] Archiving disabled
[JENKINS] Archiving disabled
[JENKINS] Archiving disabled
[JENKINS] Archiving disabled
[JENKINS] Archiving disabled
[JENKINS] Archiving disabled
[JENKINS] Archiving disabled
[JENKINS] Archiving disabled
[JENKINS] Archiving disabled
[JENKINS] Archiving disabled
[JENKINS] Archiving disabled
[JENKINS] Archiving disabled
[JENKINS] Archiving disabled
[JENKINS] Archiving disabled
[JENKINS] Archiving disabled
[JENKINS] Archiving disabled
[JENKINS] Archiving disabled
[JENKINS] Archiving disabled
[JENKINS] Archiving disabled
[JENKINS] Archiving disabled
[JENKINS] Archiving disabled
[JENKINS] Archiving disabled
[JENKINS] Archiving disabled
[JENKINS] Archiving disabled
[JENKINS] Archiving disabled
[JENKINS] Archiving disabled
[JENKINS] Archiving disabled
[JENKINS] Archiving disabled
[JENKINS] Archiving disabled
[JENKINS] Archiving disabled
[JENKINS] Archiving disabled
[JENKINS] Archiving disabled
[JENKINS] Archiving disabled
[JENKINS] Archiving disabled
[JENKINS] Archiving disabled
Waiting for Jenkins to finish collecting data
[ERROR] Failed to execute goal org.apache.maven.plugins:maven-surefire-plugin:2.18.1:test (default-test) on project brooklyn-camp: There are test failures.
[ERROR]
[ERROR] Please refer to F:\hudson\hudson-slave\workspace\incubator-brooklyn-master-windows\usage\camp\target\surefire-reports for the individual test results.
[ERROR] -> [Help 1]
[ERROR]
[ERROR] To see the full stack trace of the errors, re-run Maven with the -e switch.
[ERROR] Re-run Maven using the -X switch to enable full debug logging.
[ERROR]
[ERROR] For more information about the errors and possible solutions, please read the following articles:
[ERROR] [Help 1] http://cwiki.apache.org/confluence/display/MAVEN/MojoFailureException
[ERROR]
[ERROR] After correcting the problems, you can resume the build with the command
[ERROR] mvn <goals> -rf :brooklyn-camp
channel stopped
Build failed in Jenkins: incubator-brooklyn-master-windows #332
Posted by Apache Jenkins Server <je...@builds.apache.org>.
See <https://builds.apache.org/job/incubator-brooklyn-master-windows/332/changes>
Changes:
[valentin.aitken] Powershell scripting documentation - Remove the unnecessary
------------------------------------------
[...truncated 16578 lines...]
[INFO] Exclude: **/target/**
[INFO] Exclude: ignored/**
[INFO] Exclude: LICENSE.md
[INFO] Exclude: **/src/main/license/**
[INFO] Exclude: **/src/test/license/**
[INFO] Exclude: **/MANIFEST.MF
[INFO] Exclude: **/test-output/**
[INFO] Exclude: **/*.pem.pub
[INFO] Exclude: **/*.pem
[INFO] Exclude: **/*_rsa.pub
[INFO] Exclude: **/*_rsa
[INFO] Exclude: **/*.svg
[INFO] Exclude: **/*.crt
[INFO] Exclude: **/*.csr
[INFO] Exclude: **/*.key
[INFO] Exclude: **/*.key.org
[INFO] Exclude: **/*.psd
[INFO] Exclude: **/*.json
[INFO] Exclude: **/*.plxarc
[INFO] Exclude: **/src/test/resources/org/apache/brooklyn/entity/software/base/template_with_extra_substitutions.txt
[INFO] Exclude: **/src/main/resources/banner.txt
[INFO] Exclude: **/src/test/resources/ssl/certs/localhost/info.txt
[INFO] Exclude: **/sandbox/examples/src/main/scripts/amis.txt
[INFO] Exclude: docs/**
[INFO] 3 resources included (use -debug for more details)
[INFO] Rat check: Summary of files. Unapproved: 0 unknown: 0 generated: 0 approved: 3 licence.
[INFO]
[INFO] --- maven-source-plugin:2.4:jar-no-fork (attach-sources) @ brooklyn-jmxrmi-agent ---
[INFO] Building jar: F:\hudson\hudson-slave\workspace\incubator-brooklyn-master-windows\utils\jmx\jmxrmi-agent\target\brooklyn-jmxrmi-agent-0.9.0-SNAPSHOT-sources.jar
[INFO]
[INFO] --- maven-install-plugin:2.5.2:install (default-install) @ brooklyn-jmxrmi-agent ---
[INFO] Installing F:\hudson\hudson-slave\workspace\incubator-brooklyn-master-windows\utils\jmx\jmxrmi-agent\target\brooklyn-jmxrmi-agent-0.9.0-SNAPSHOT.jar to f:\hudson\hudson-slave\maven-repositories\0\org\apache\brooklyn\brooklyn-jmxrmi-agent\0.9.0-SNAPSHOT\brooklyn-jmxrmi-agent-0.9.0-SNAPSHOT.jar
[INFO] Installing F:\hudson\hudson-slave\workspace\incubator-brooklyn-master-windows\utils\jmx\jmxrmi-agent\pom.xml to f:\hudson\hudson-slave\maven-repositories\0\org\apache\brooklyn\brooklyn-jmxrmi-agent\0.9.0-SNAPSHOT\brooklyn-jmxrmi-agent-0.9.0-SNAPSHOT.pom
[INFO] Installing F:\hudson\hudson-slave\workspace\incubator-brooklyn-master-windows\utils\jmx\jmxrmi-agent\target\brooklyn-jmxrmi-agent-0.9.0-SNAPSHOT-tests.jar to f:\hudson\hudson-slave\maven-repositories\0\org\apache\brooklyn\brooklyn-jmxrmi-agent\0.9.0-SNAPSHOT\brooklyn-jmxrmi-agent-0.9.0-SNAPSHOT-tests.jar
[INFO] Installing F:\hudson\hudson-slave\workspace\incubator-brooklyn-master-windows\utils\jmx\jmxrmi-agent\target\brooklyn-jmxrmi-agent-0.9.0-SNAPSHOT-sources.jar to f:\hudson\hudson-slave\maven-repositories\0\org\apache\brooklyn\brooklyn-jmxrmi-agent\0.9.0-SNAPSHOT\brooklyn-jmxrmi-agent-0.9.0-SNAPSHOT-sources.jar
[JENKINS] Archiving disabled
[INFO]
[INFO] ------------------------------------------------------------------------
[INFO] Skipping Brooklyn Software Base
[INFO] This project has been banned from the build due to previous failures.
[INFO] ------------------------------------------------------------------------
[INFO]
[INFO] ------------------------------------------------------------------------
[INFO] Skipping Brooklyn Web App Software Entities
[INFO] This project has been banned from the build due to previous failures.
[INFO] ------------------------------------------------------------------------
[INFO]
[INFO] ------------------------------------------------------------------------
[INFO] Skipping Brooklyn Messaging Software Entities
[INFO] This project has been banned from the build due to previous failures.
[INFO] ------------------------------------------------------------------------
[INFO]
[INFO] ------------------------------------------------------------------------
[INFO] Skipping Brooklyn Database Software Entities
[INFO] This project has been banned from the build due to previous failures.
[INFO] ------------------------------------------------------------------------
[INFO]
[INFO] ------------------------------------------------------------------------
[INFO] Skipping Brooklyn Monitoring Software Entities
[INFO] This project has been banned from the build due to previous failures.
[INFO] ------------------------------------------------------------------------
[INFO]
[INFO] ------------------------------------------------------------------------
[INFO] Skipping Brooklyn OSGi Software Entities
[INFO] This project has been banned from the build due to previous failures.
[INFO] ------------------------------------------------------------------------
[INFO]
[INFO] ------------------------------------------------------------------------
[INFO] Skipping Brooklyn NoSQL Data Store Software Entities
[INFO] This project has been banned from the build due to previous failures.
[INFO] ------------------------------------------------------------------------
[INFO]
[INFO] ------------------------------------------------------------------------
[INFO] Skipping Brooklyn Network Software Entities
[INFO] This project has been banned from the build due to previous failures.
[INFO] ------------------------------------------------------------------------
[INFO]
[INFO] ------------------------------------------------------------------------
[INFO] Skipping Brooklyn CAMP REST API
[INFO] This project has been banned from the build due to previous failures.
[INFO] ------------------------------------------------------------------------
[INFO]
[INFO] ------------------------------------------------------------------------
[INFO] Skipping Brooklyn REST Server
[INFO] This project has been banned from the build due to previous failures.
[INFO] ------------------------------------------------------------------------
[INFO]
[INFO] ------------------------------------------------------------------------
[INFO] Skipping Brooklyn REST JavaScript Web GUI
[INFO] This project has been banned from the build due to previous failures.
[INFO] ------------------------------------------------------------------------
[INFO]
[INFO] ------------------------------------------------------------------------
[INFO] Skipping Brooklyn Launcher
[INFO] This project has been banned from the build due to previous failures.
[INFO] ------------------------------------------------------------------------
[INFO]
[INFO] ------------------------------------------------------------------------
[INFO] Skipping Brooklyn Command Line Interface
[INFO] This project has been banned from the build due to previous failures.
[INFO] ------------------------------------------------------------------------
[INFO]
[INFO] ------------------------------------------------------------------------
[INFO] Skipping Brooklyn All Things
[INFO] This project has been banned from the build due to previous failures.
[INFO] ------------------------------------------------------------------------
[INFO]
[INFO] ------------------------------------------------------------------------
[INFO] Skipping Brooklyn Simple Web Cluster Example
[INFO] This project has been banned from the build due to previous failures.
[INFO] ------------------------------------------------------------------------
[INFO]
[INFO] ------------------------------------------------------------------------
[INFO] Skipping Brooklyn Global Web Fabric Example
[INFO] This project has been banned from the build due to previous failures.
[INFO] ------------------------------------------------------------------------
[INFO]
[INFO] ------------------------------------------------------------------------
[INFO] Skipping Brooklyn Simple Messaging Publish-Subscribe Example
[INFO] This project has been banned from the build due to previous failures.
[INFO] ------------------------------------------------------------------------
[INFO]
[INFO] ------------------------------------------------------------------------
[INFO] Skipping Brooklyn NoSQL Cluster Examples
[INFO] This project has been banned from the build due to previous failures.
[INFO] ------------------------------------------------------------------------
[INFO]
[INFO] ------------------------------------------------------------------------
[INFO] Skipping Brooklyn Hazelcast Storage
[INFO] This project has been banned from the build due to previous failures.
[INFO] ------------------------------------------------------------------------
[INFO]
[INFO] ------------------------------------------------------------------------
[INFO] Skipping Brooklyn Distribution
[INFO] This project has been banned from the build due to previous failures.
[INFO] ------------------------------------------------------------------------
[INFO]
[INFO] ------------------------------------------------------------------------
[INFO] Skipping Brooklyn QA
[INFO] This project has been banned from the build due to previous failures.
[INFO] ------------------------------------------------------------------------
[INFO]
[INFO] ------------------------------------------------------------------------
[INFO] Skipping Brooklyn REST Client
[INFO] This project has been banned from the build due to previous failures.
[INFO] ------------------------------------------------------------------------
[INFO] ------------------------------------------------------------------------
[INFO] Reactor Summary:
[INFO]
[INFO] Brooklyn Root ..................................... SUCCESS [5.178s]
[INFO] Brooklyn Parent Project ........................... SUCCESS [7.243s]
[INFO] Brooklyn Logback Configuration .................... SUCCESS [6.106s]
[INFO] Brooklyn Test Support Utilities ................... SUCCESS [3.660s]
[INFO] Brooklyn Logback Includable Configuration ......... SUCCESS [1.804s]
[INFO] Brooklyn Common Utilities ......................... SUCCESS [31.107s]
[INFO] Brooklyn API ...................................... SUCCESS [6.892s]
[INFO] Brooklyn Test Support ............................. SUCCESS [3.359s]
[INFO] CAMP Server Parent Project ........................ SUCCESS [0.999s]
[INFO] CAMP Base ......................................... SUCCESS [7.718s]
[INFO] Brooklyn Groovy Utilities ......................... SUCCESS [13.286s]
[INFO] Brooklyn Core ..................................... FAILURE [7:16.780s]
[INFO] Brooklyn Policies ................................. SKIPPED
[INFO] Brooklyn WinRM Software Entities .................. SKIPPED
[INFO] Brooklyn Jclouds Location Targets ................. SKIPPED
[INFO] Brooklyn Secure JMXMP Agent ....................... SKIPPED
[INFO] Brooklyn JMX RMI Agent ............................ SUCCESS [5.138s]
[INFO] Brooklyn Software Base ............................ SKIPPED
[INFO] Brooklyn Web App Software Entities ................ SKIPPED
[INFO] Brooklyn Messaging Software Entities .............. SKIPPED
[INFO] Brooklyn Database Software Entities ............... SKIPPED
[INFO] Brooklyn Monitoring Software Entities ............. SKIPPED
[INFO] Brooklyn OSGi Software Entities ................... SKIPPED
[INFO] Brooklyn NoSQL Data Store Software Entities ....... SKIPPED
[INFO] Brooklyn Network Software Entities ................ SKIPPED
[INFO] Brooklyn CAMP REST API ............................ SKIPPED
[INFO] Brooklyn REST Server .............................. SKIPPED
[INFO] Brooklyn REST JavaScript Web GUI .................. SKIPPED
[INFO] Brooklyn Launcher ................................. SKIPPED
[INFO] Brooklyn Command Line Interface ................... SKIPPED
[INFO] Brooklyn All Things ............................... SKIPPED
[INFO] Brooklyn Simple Web Cluster Example ............... SKIPPED
[INFO] Brooklyn Global Web Fabric Example ................ SKIPPED
[INFO] Brooklyn Simple Messaging Publish-Subscribe Example SKIPPED
[INFO] Brooklyn NoSQL Cluster Examples ................... SKIPPED
[INFO] Brooklyn Hazelcast Storage ........................ SKIPPED
[INFO] Brooklyn Distribution ............................. SKIPPED
[INFO] Brooklyn QA ....................................... SKIPPED
[INFO] Brooklyn REST Client .............................. SKIPPED
[INFO] ------------------------------------------------------------------------
[INFO] BUILD FAILURE
[INFO] ------------------------------------------------------------------------
[INFO] Total time: 9:08.608s
[INFO] Finished at: Fri Oct 23 20:29:25 BST 2015
[INFO] Final Memory: 56M/240M
[INFO] ------------------------------------------------------------------------
[JENKINS] Archiving disabled
[JENKINS] Archiving disabled
[JENKINS] Archiving disabled
[JENKINS] Archiving disabled
[JENKINS] Archiving disabled
[JENKINS] Archiving disabled
[JENKINS] Archiving disabled
[JENKINS] Archiving disabled
[JENKINS] Archiving disabled
[JENKINS] Archiving disabled
[JENKINS] Archiving disabled
[JENKINS] Archiving disabled
[JENKINS] Archiving disabled
[JENKINS] Archiving disabled
[JENKINS] Archiving disabled
[JENKINS] Archiving disabled
[JENKINS] Archiving disabled
[JENKINS] Archiving disabled
[JENKINS] Archiving disabled
[JENKINS] Archiving disabled
[JENKINS] Archiving disabled
[JENKINS] Archiving disabled
[JENKINS] Archiving disabled
[JENKINS] Archiving disabled
[JENKINS] Archiving disabled
[JENKINS] Archiving disabled
[JENKINS] Archiving disabled
[JENKINS] Archiving disabled
[JENKINS] Archiving disabled
[JENKINS] Archiving disabled
[JENKINS] Archiving disabled
[JENKINS] Archiving disabled
[JENKINS] Archiving disabled
[JENKINS] Archiving disabled
[JENKINS] Archiving disabled
[JENKINS] Archiving disabled
[JENKINS] Archiving disabled
[JENKINS] Archiving disabled
[JENKINS] Archiving disabled
Waiting for Jenkins to finish collecting data
[ERROR] Failed to execute goal org.apache.maven.plugins:maven-surefire-plugin:2.18.1:test (default-test) on project brooklyn-core: There are test failures.
[ERROR]
[ERROR] Please refer to F:\hudson\hudson-slave\workspace\incubator-brooklyn-master-windows\core\target\surefire-reports for the individual test results.
[ERROR] -> [Help 1]
[ERROR]
[ERROR] To see the full stack trace of the errors, re-run Maven with the -e switch.
[ERROR] Re-run Maven using the -X switch to enable full debug logging.
[ERROR]
[ERROR] For more information about the errors and possible solutions, please read the following articles:
[ERROR] [Help 1] http://cwiki.apache.org/confluence/display/MAVEN/MojoFailureException
[ERROR]
[ERROR] After correcting the problems, you can resume the build with the command
[ERROR] mvn <goals> -rf :brooklyn-core
channel stopped
Build failed in Jenkins: incubator-brooklyn-master-windows #331
Posted by Apache Jenkins Server <je...@builds.apache.org>.
See <https://builds.apache.org/job/incubator-brooklyn-master-windows/331/changes>
Changes:
[aled.sage] Adds Exceptions.getFirstThrowableMatching
[aled.sage] Adds SetHostnameCustomizer.MACHINE_FILTER config
[aled.sage] BROOKLYN-188: set PATH in JcloudsLocation.createUser
------------------------------------------
[...truncated 16486 lines...]
[INFO] Using 'UTF-8' encoding to copy filtered resources.
[INFO] skip non existing resourceDirectory F:\hudson\hudson-slave\workspace\incubator-brooklyn-master-windows\utils\jmx\jmxrmi-agent\src\test\resources
[INFO] Copying 4 resources
[INFO]
[INFO] --- maven-compiler-plugin:3.3:testCompile (default-testCompile) @ brooklyn-jmxrmi-agent ---
[INFO] Changes detected - recompiling the module!
[INFO] Compiling 1 source file to F:\hudson\hudson-slave\workspace\incubator-brooklyn-master-windows\utils\jmx\jmxrmi-agent\target\test-classes
[INFO]
[INFO] --- maven-surefire-plugin:2.18.1:test (default-test) @ brooklyn-jmxrmi-agent ---
[JENKINS] Recording test results
[INFO]
[INFO] --- maven-jar-plugin:2.6:jar (default-jar) @ brooklyn-jmxrmi-agent ---
[INFO] Building jar: F:\hudson\hudson-slave\workspace\incubator-brooklyn-master-windows\utils\jmx\jmxrmi-agent\target\brooklyn-jmxrmi-agent-0.9.0-SNAPSHOT.jar
[INFO]
[INFO] --- maven-site-plugin:3.4:attach-descriptor (attach-descriptor) @ brooklyn-jmxrmi-agent ---
[INFO]
[INFO] --- maven-jar-plugin:2.6:test-jar (test-jar-creation) @ brooklyn-jmxrmi-agent ---
[INFO] Building jar: F:\hudson\hudson-slave\workspace\incubator-brooklyn-master-windows\utils\jmx\jmxrmi-agent\target\brooklyn-jmxrmi-agent-0.9.0-SNAPSHOT-tests.jar
[INFO]
[INFO] --- apache-rat-plugin:0.10:check (default) @ brooklyn-jmxrmi-agent ---
[INFO] 51 implicit excludes (use -debug for more details).
[INFO] Exclude: sandbox/**
[INFO] Exclude: release/**
[INFO] Exclude: **/nbactions.xml
[INFO] Exclude: **/nb-configuration.xml
[INFO] Exclude: **/.git/**
[INFO] Exclude: **/.gitignore
[INFO] Exclude: **/.repository/**
[INFO] Exclude: **/.idea/**
[INFO] Exclude: **/*.iml
[INFO] Exclude: **/.classpath/**
[INFO] Exclude: **/.project
[INFO] Exclude: **/.settings/**
[INFO] Exclude: **/*.log
[INFO] Exclude: **/brooklyn*.log.*
[INFO] Exclude: **/target/**
[INFO] Exclude: ignored/**
[INFO] Exclude: LICENSE.md
[INFO] Exclude: **/src/main/license/**
[INFO] Exclude: **/src/test/license/**
[INFO] Exclude: **/MANIFEST.MF
[INFO] Exclude: **/test-output/**
[INFO] Exclude: **/*.pem.pub
[INFO] Exclude: **/*.pem
[INFO] Exclude: **/*_rsa.pub
[INFO] Exclude: **/*_rsa
[INFO] Exclude: **/*.svg
[INFO] Exclude: **/*.crt
[INFO] Exclude: **/*.csr
[INFO] Exclude: **/*.key
[INFO] Exclude: **/*.key.org
[INFO] Exclude: **/*.psd
[INFO] Exclude: **/*.json
[INFO] Exclude: **/*.plxarc
[INFO] Exclude: **/src/test/resources/org/apache/brooklyn/entity/software/base/template_with_extra_substitutions.txt
[INFO] Exclude: **/src/main/resources/banner.txt
[INFO] Exclude: **/src/test/resources/ssl/certs/localhost/info.txt
[INFO] Exclude: **/sandbox/examples/src/main/scripts/amis.txt
[INFO] Exclude: docs/**
[INFO] 3 resources included (use -debug for more details)
[INFO] Rat check: Summary of files. Unapproved: 0 unknown: 0 generated: 0 approved: 3 licence.
[INFO]
[INFO] --- maven-source-plugin:2.4:jar-no-fork (attach-sources) @ brooklyn-jmxrmi-agent ---
[INFO] Building jar: F:\hudson\hudson-slave\workspace\incubator-brooklyn-master-windows\utils\jmx\jmxrmi-agent\target\brooklyn-jmxrmi-agent-0.9.0-SNAPSHOT-sources.jar
[INFO]
[INFO] --- maven-install-plugin:2.5.2:install (default-install) @ brooklyn-jmxrmi-agent ---
[INFO] Installing F:\hudson\hudson-slave\workspace\incubator-brooklyn-master-windows\utils\jmx\jmxrmi-agent\target\brooklyn-jmxrmi-agent-0.9.0-SNAPSHOT.jar to f:\hudson\hudson-slave\maven-repositories\0\org\apache\brooklyn\brooklyn-jmxrmi-agent\0.9.0-SNAPSHOT\brooklyn-jmxrmi-agent-0.9.0-SNAPSHOT.jar
[INFO] Installing F:\hudson\hudson-slave\workspace\incubator-brooklyn-master-windows\utils\jmx\jmxrmi-agent\pom.xml to f:\hudson\hudson-slave\maven-repositories\0\org\apache\brooklyn\brooklyn-jmxrmi-agent\0.9.0-SNAPSHOT\brooklyn-jmxrmi-agent-0.9.0-SNAPSHOT.pom
[INFO] Installing F:\hudson\hudson-slave\workspace\incubator-brooklyn-master-windows\utils\jmx\jmxrmi-agent\target\brooklyn-jmxrmi-agent-0.9.0-SNAPSHOT-tests.jar to f:\hudson\hudson-slave\maven-repositories\0\org\apache\brooklyn\brooklyn-jmxrmi-agent\0.9.0-SNAPSHOT\brooklyn-jmxrmi-agent-0.9.0-SNAPSHOT-tests.jar
[INFO] Installing F:\hudson\hudson-slave\workspace\incubator-brooklyn-master-windows\utils\jmx\jmxrmi-agent\target\brooklyn-jmxrmi-agent-0.9.0-SNAPSHOT-sources.jar to f:\hudson\hudson-slave\maven-repositories\0\org\apache\brooklyn\brooklyn-jmxrmi-agent\0.9.0-SNAPSHOT\brooklyn-jmxrmi-agent-0.9.0-SNAPSHOT-sources.jar
[JENKINS] Archiving disabled
[INFO]
[INFO] ------------------------------------------------------------------------
[INFO] Skipping Brooklyn Software Base
[INFO] This project has been banned from the build due to previous failures.
[INFO] ------------------------------------------------------------------------
[INFO]
[INFO] ------------------------------------------------------------------------
[INFO] Skipping Brooklyn Web App Software Entities
[INFO] This project has been banned from the build due to previous failures.
[INFO] ------------------------------------------------------------------------
[INFO]
[INFO] ------------------------------------------------------------------------
[INFO] Skipping Brooklyn Database Software Entities
[INFO] This project has been banned from the build due to previous failures.
[INFO] ------------------------------------------------------------------------
[INFO]
[INFO] ------------------------------------------------------------------------
[INFO] Skipping Brooklyn NoSQL Data Store Software Entities
[INFO] This project has been banned from the build due to previous failures.
[INFO] ------------------------------------------------------------------------
[INFO]
[INFO] ------------------------------------------------------------------------
[INFO] Skipping Brooklyn CAMP REST API
[INFO] This project has been banned from the build due to previous failures.
[INFO] ------------------------------------------------------------------------
[INFO]
[INFO] ------------------------------------------------------------------------
[INFO] Skipping Brooklyn REST Server
[INFO] This project has been banned from the build due to previous failures.
[INFO] ------------------------------------------------------------------------
[INFO]
[INFO] ------------------------------------------------------------------------
[INFO] Skipping Brooklyn REST JavaScript Web GUI
[INFO] This project has been banned from the build due to previous failures.
[INFO] ------------------------------------------------------------------------
[INFO]
[INFO] ------------------------------------------------------------------------
[INFO] Skipping Brooklyn Launcher
[INFO] This project has been banned from the build due to previous failures.
[INFO] ------------------------------------------------------------------------
[INFO]
[INFO] ------------------------------------------------------------------------
[INFO] Skipping Brooklyn Command Line Interface
[INFO] This project has been banned from the build due to previous failures.
[INFO] ------------------------------------------------------------------------
[INFO]
[INFO] ------------------------------------------------------------------------
[INFO] Skipping Brooklyn All Things
[INFO] This project has been banned from the build due to previous failures.
[INFO] ------------------------------------------------------------------------
[INFO]
[INFO] ------------------------------------------------------------------------
[INFO] Skipping Brooklyn Simple Web Cluster Example
[INFO] This project has been banned from the build due to previous failures.
[INFO] ------------------------------------------------------------------------
[INFO]
[INFO] ------------------------------------------------------------------------
[INFO] Skipping Brooklyn Global Web Fabric Example
[INFO] This project has been banned from the build due to previous failures.
[INFO] ------------------------------------------------------------------------
[INFO]
[INFO] ------------------------------------------------------------------------
[INFO] Skipping Brooklyn Simple Messaging Publish-Subscribe Example
[INFO] This project has been banned from the build due to previous failures.
[INFO] ------------------------------------------------------------------------
[INFO]
[INFO] ------------------------------------------------------------------------
[INFO] Skipping Brooklyn NoSQL Cluster Examples
[INFO] This project has been banned from the build due to previous failures.
[INFO] ------------------------------------------------------------------------
[INFO]
[INFO] ------------------------------------------------------------------------
[INFO] Skipping Brooklyn Distribution
[INFO] This project has been banned from the build due to previous failures.
[INFO] ------------------------------------------------------------------------
[INFO]
[INFO] ------------------------------------------------------------------------
[INFO] Skipping Brooklyn QA
[INFO] This project has been banned from the build due to previous failures.
[INFO] ------------------------------------------------------------------------
[INFO]
[INFO] ------------------------------------------------------------------------
[INFO] Skipping Brooklyn REST Client
[INFO] This project has been banned from the build due to previous failures.
[INFO] ------------------------------------------------------------------------
[INFO] ------------------------------------------------------------------------
[INFO] Reactor Summary:
[INFO]
[INFO] Brooklyn Root ..................................... SUCCESS [5.101s]
[INFO] Brooklyn Parent Project ........................... SUCCESS [11.149s]
[INFO] Brooklyn Logback Configuration .................... SUCCESS [6.950s]
[INFO] Brooklyn Test Support Utilities ................... SUCCESS [3.964s]
[INFO] Brooklyn Logback Includable Configuration ......... SUCCESS [2.025s]
[INFO] Brooklyn Common Utilities ......................... SUCCESS [30.417s]
[INFO] Brooklyn API ...................................... SUCCESS [6.687s]
[INFO] Brooklyn Test Support ............................. SUCCESS [4.452s]
[INFO] CAMP Server Parent Project ........................ SUCCESS [0.934s]
[INFO] CAMP Base ......................................... SUCCESS [7.444s]
[INFO] Brooklyn Groovy Utilities ......................... SUCCESS [14.186s]
[INFO] Brooklyn Core ..................................... FAILURE [5:08.651s]
[INFO] Brooklyn Policies ................................. SKIPPED
[INFO] Brooklyn WinRM Software Entities .................. SKIPPED
[INFO] Brooklyn Jclouds Location Targets ................. SKIPPED
[INFO] Brooklyn Secure JMXMP Agent ....................... SKIPPED
[INFO] Brooklyn JMX RMI Agent ............................ SUCCESS [3.851s]
[INFO] Brooklyn Software Base ............................ SKIPPED
[INFO] Brooklyn Web App Software Entities ................ SKIPPED
[INFO] Brooklyn Database Software Entities ............... SKIPPED
[INFO] Brooklyn NoSQL Data Store Software Entities ....... SKIPPED
[INFO] Brooklyn CAMP REST API ............................ SKIPPED
[INFO] Brooklyn REST Server .............................. SKIPPED
[INFO] Brooklyn REST JavaScript Web GUI .................. SKIPPED
[INFO] Brooklyn Launcher ................................. SKIPPED
[INFO] Brooklyn Command Line Interface ................... SKIPPED
[INFO] Brooklyn All Things ............................... SKIPPED
[INFO] Brooklyn Simple Web Cluster Example ............... SKIPPED
[INFO] Brooklyn Global Web Fabric Example ................ SKIPPED
[INFO] Brooklyn Simple Messaging Publish-Subscribe Example SKIPPED
[INFO] Brooklyn NoSQL Cluster Examples ................... SKIPPED
[INFO] Brooklyn Distribution ............................. SKIPPED
[INFO] Brooklyn QA ....................................... SKIPPED
[INFO] Brooklyn REST Client .............................. SKIPPED
[INFO] ------------------------------------------------------------------------
[INFO] BUILD FAILURE
[INFO] ------------------------------------------------------------------------
[INFO] Total time: 6:53.328s
[INFO] Finished at: Fri Oct 23 01:26:30 BST 2015
[INFO] Final Memory: 56M/241M
[INFO] ------------------------------------------------------------------------
[JENKINS] Archiving disabled
[JENKINS] Archiving disabled
[JENKINS] Archiving disabled
[JENKINS] Archiving disabled
[JENKINS] Archiving disabled
[JENKINS] Archiving disabled
[JENKINS] Archiving disabled
[JENKINS] Archiving disabled
[JENKINS] Archiving disabled
[JENKINS] Archiving disabled
[JENKINS] Archiving disabled
[JENKINS] Archiving disabled
[JENKINS] Archiving disabled
[JENKINS] Archiving disabled
[JENKINS] Archiving disabled
[JENKINS] Archiving disabled
[JENKINS] Archiving disabled
[JENKINS] Archiving disabled
[JENKINS] Archiving disabled
[JENKINS] Archiving disabled
[JENKINS] Archiving disabled
[JENKINS] Archiving disabled
[JENKINS] Archiving disabled
[JENKINS] Archiving disabled
[JENKINS] Archiving disabled
[JENKINS] Archiving disabled
[JENKINS] Archiving disabled
[JENKINS] Archiving disabled
[JENKINS] Archiving disabled
[JENKINS] Archiving disabled
[JENKINS] Archiving disabled
[JENKINS] Archiving disabled
[JENKINS] Archiving disabled
[JENKINS] Archiving disabled
Waiting for Jenkins to finish collecting data
[ERROR] Failed to execute goal org.apache.maven.plugins:maven-surefire-plugin:2.18.1:test (default-test) on project brooklyn-core: There are test failures.
[ERROR]
[ERROR] Please refer to F:\hudson\hudson-slave\workspace\incubator-brooklyn-master-windows\core\target\surefire-reports for the individual test results.
[ERROR] -> [Help 1]
[ERROR]
[ERROR] To see the full stack trace of the errors, re-run Maven with the -e switch.
[ERROR] Re-run Maven using the -X switch to enable full debug logging.
[ERROR]
[ERROR] For more information about the errors and possible solutions, please read the following articles:
[ERROR] [Help 1] http://cwiki.apache.org/confluence/display/MAVEN/MojoFailureException
[ERROR]
[ERROR] After correcting the problems, you can resume the build with the command
[ERROR] mvn <goals> -rf :brooklyn-core
channel stopped
Build failed in Jenkins: incubator-brooklyn-master-windows #330
Posted by Apache Jenkins Server <je...@builds.apache.org>.
See <https://builds.apache.org/job/incubator-brooklyn-master-windows/330/changes>
Changes:
[aled.sage] Improves logging in JcloudsLocation
[aled.sage] Fixes SetHostnameCustomizer for machines with no addresses
------------------------------------------
[...truncated 31128 lines...]
2015-10-22 14:39:55,008 INFO TESTNG INVOKING: "Surefire test" - org.apache.brooklyn.camp.brooklyn.catalog.CatalogYamlVersioningTest.testUnversionedReference()
SUREFIRE-859: [GC 712999K->499121K(763008K), 0.0161973 secs]
2015-10-22 14:39:55,169 INFO CAMP created 'BasicApplicationImpl{id=EEStg8id}'
2015-10-22 14:39:55,171 INFO Test - created org.apache.brooklyn.camp.spi.Assembly@33faadae[id=EEStg8id; type=Assembly]
2015-10-22 14:39:55,171 INFO App - BasicApplicationImpl{id=EEStg8id}
2015-10-22 14:39:55,181 INFO Started application BasicApplicationImpl{id=EEStg8id}
2015-10-22 14:39:55,182 INFO TESTNG PASSED: "Surefire test" - org.apache.brooklyn.camp.brooklyn.catalog.CatalogYamlVersioningTest.testUnversionedReference() finished in 175 ms
2015-10-22 14:39:55,183 INFO TESTNG INVOKING CONFIGURATION: "Surefire test" - @AfterMethod org.apache.brooklyn.camp.brooklyn.AbstractYamlTest.tearDown()
2015-10-22 14:39:55,185 INFO Stopping application BasicApplicationImpl{id=EEStg8id}
2015-10-22 14:39:55,186 INFO Stopped application BasicApplicationImpl{id=EEStg8id}
2015-10-22 14:39:55,504 INFO TESTNG PASSED CONFIGURATION: "Surefire test" - @AfterMethod org.apache.brooklyn.camp.brooklyn.AbstractYamlTest.tearDown() finished in 321 ms
2015-10-22 14:39:55,505 INFO TESTNG INVOKING CONFIGURATION: "Surefire test" - @BeforeMethod org.apache.brooklyn.camp.brooklyn.catalog.CatalogYamlVersioningTest.setUp()
SUREFIRE-859: [GC 715377K->503259K(766464K), 0.1030477 secs]
2015-10-22 14:39:56,494 INFO TESTNG PASSED CONFIGURATION: "Surefire test" - @BeforeMethod org.apache.brooklyn.camp.brooklyn.catalog.CatalogYamlVersioningTest.setUp() finished in 990 ms
2015-10-22 14:39:56,494 INFO TESTNG INVOKING: "Surefire test" - org.apache.brooklyn.camp.brooklyn.catalog.CatalogYamlVersioningTest.testVersionedReference()
2015-10-22 14:39:56,666 INFO CAMP created 'BasicApplicationImpl{id=WcUCFKmI}'
2015-10-22 14:39:56,667 INFO Test - created org.apache.brooklyn.camp.spi.Assembly@34a1d298[id=WcUCFKmI; type=Assembly]
2015-10-22 14:39:56,667 INFO App - BasicApplicationImpl{id=WcUCFKmI}
2015-10-22 14:39:56,677 INFO Started application BasicApplicationImpl{id=WcUCFKmI}
2015-10-22 14:39:56,679 INFO TESTNG PASSED: "Surefire test" - org.apache.brooklyn.camp.brooklyn.catalog.CatalogYamlVersioningTest.testVersionedReference() finished in 185 ms
2015-10-22 14:39:56,680 INFO TESTNG INVOKING CONFIGURATION: "Surefire test" - @AfterMethod org.apache.brooklyn.camp.brooklyn.AbstractYamlTest.tearDown()
2015-10-22 14:39:56,699 INFO Stopping application BasicApplicationImpl{id=WcUCFKmI}
2015-10-22 14:39:56,706 INFO Stopped application BasicApplicationImpl{id=WcUCFKmI}
2015-10-22 14:39:57,053 INFO TESTNG PASSED CONFIGURATION: "Surefire test" - @AfterMethod org.apache.brooklyn.camp.brooklyn.AbstractYamlTest.tearDown() finished in 373 ms
2015-10-22 14:39:57,054 INFO TESTNG INVOKING CONFIGURATION: "Surefire test" - @BeforeMethod org.apache.brooklyn.camp.brooklyn.catalog.CatalogYamlVersioningTest.setUp()
SUREFIRE-859: [GC 724187K->501408K(765184K), 0.0204931 secs]
2015-10-22 14:39:58,040 INFO TESTNG PASSED CONFIGURATION: "Surefire test" - @BeforeMethod org.apache.brooklyn.camp.brooklyn.catalog.CatalogYamlVersioningTest.setUp() finished in 986 ms
2015-10-22 14:39:58,041 INFO TESTNG INVOKING: "Surefire test" - org.apache.brooklyn.camp.brooklyn.catalog.CatalogYamlVersioningTest.testVersionedReferenceJustAddedExplicitVersion()
SUREFIRE-859: [GC 722336K->503766K(768384K), 0.0464179 secs]
2015-10-22 14:39:58,311 INFO CAMP created 'BasicApplicationImpl{id=PfbA5nIf}'
2015-10-22 14:39:58,312 INFO Test - created org.apache.brooklyn.camp.spi.Assembly@32e9c4d8[id=PfbA5nIf; type=Assembly]
2015-10-22 14:39:58,312 INFO App - BasicApplicationImpl{id=PfbA5nIf}
2015-10-22 14:39:58,351 INFO Started application BasicApplicationImpl{id=PfbA5nIf}
2015-10-22 14:39:58,353 INFO TESTNG PASSED: "Surefire test" - org.apache.brooklyn.camp.brooklyn.catalog.CatalogYamlVersioningTest.testVersionedReferenceJustAddedExplicitVersion() finished in 312 ms
2015-10-22 14:39:58,354 INFO TESTNG INVOKING CONFIGURATION: "Surefire test" - @AfterMethod org.apache.brooklyn.camp.brooklyn.AbstractYamlTest.tearDown()
2015-10-22 14:39:58,356 INFO Stopping application BasicApplicationImpl{id=PfbA5nIf}
2015-10-22 14:39:58,370 INFO Stopped application BasicApplicationImpl{id=PfbA5nIf}
2015-10-22 14:39:58,877 INFO TESTNG PASSED CONFIGURATION: "Surefire test" - @AfterMethod org.apache.brooklyn.camp.brooklyn.AbstractYamlTest.tearDown() finished in 523 ms
2015-10-22 14:39:58,878 INFO TESTNG INVOKING CONFIGURATION: "Surefire test" - @BeforeMethod org.apache.brooklyn.camp.brooklyn.catalog.CatalogYamlVersioningTest.setUp()
SUREFIRE-859: [GC 728790K->507965K(767360K), 0.0396386 secs]
2015-10-22 14:39:59,754 INFO TESTNG PASSED CONFIGURATION: "Surefire test" - @BeforeMethod org.apache.brooklyn.camp.brooklyn.catalog.CatalogYamlVersioningTest.setUp() finished in 877 ms
2015-10-22 14:39:59,755 INFO TESTNG INVOKING: "Surefire test" - org.apache.brooklyn.camp.brooklyn.catalog.CatalogYamlVersioningTest.testVersionedReferenceJustAddedImplicitVersionSyntax()
2015-10-22 14:39:59,964 INFO CAMP created 'BasicApplicationImpl{id=k4Mn3Q9f}'
2015-10-22 14:39:59,965 INFO Test - created org.apache.brooklyn.camp.spi.Assembly@72d2a563[id=k4Mn3Q9f; type=Assembly]
2015-10-22 14:39:59,965 INFO App - BasicApplicationImpl{id=k4Mn3Q9f}
2015-10-22 14:39:59,973 INFO Started application BasicApplicationImpl{id=k4Mn3Q9f}
2015-10-22 14:40:00,005 INFO TESTNG PASSED: "Surefire test" - org.apache.brooklyn.camp.brooklyn.catalog.CatalogYamlVersioningTest.testVersionedReferenceJustAddedImplicitVersionSyntax() finished in 251 ms
2015-10-22 14:40:00,006 INFO TESTNG INVOKING CONFIGURATION: "Surefire test" - @AfterMethod org.apache.brooklyn.camp.brooklyn.AbstractYamlTest.tearDown()
2015-10-22 14:40:00,007 INFO Stopping application BasicApplicationImpl{id=k4Mn3Q9f}
2015-10-22 14:40:00,010 INFO Stopped application BasicApplicationImpl{id=k4Mn3Q9f}
2015-10-22 14:40:00,411 INFO TESTNG PASSED CONFIGURATION: "Surefire test" - @AfterMethod org.apache.brooklyn.camp.brooklyn.AbstractYamlTest.tearDown() finished in 405 ms
2015-10-22 14:40:00,411 INFO TESTNG INVOKING CONFIGURATION: "Surefire test" - @BeforeMethod org.apache.brooklyn.camp.brooklyn.AbstractYamlTest.setUp()
SUREFIRE-859: [GC 732989K->506520K(770368K), 0.0212940 secs]
2015-10-22 14:40:01,877 INFO TESTNG PASSED CONFIGURATION: "Surefire test" - @BeforeMethod org.apache.brooklyn.camp.brooklyn.AbstractYamlTest.setUp() finished in 1466 ms
2015-10-22 14:40:01,878 INFO TESTNG INVOKING: "Surefire test" - org.apache.brooklyn.camp.brooklyn.spi.creation.service.ServiceTypeResolverTest.testAddCatalogItemVerySimple()
2015-10-22 14:40:01,900 INFO TESTNG PASSED: "Surefire test" - org.apache.brooklyn.camp.brooklyn.spi.creation.service.ServiceTypeResolverTest.testAddCatalogItemVerySimple() finished in 23 ms
2015-10-22 14:40:01,901 INFO TESTNG INVOKING CONFIGURATION: "Surefire test" - @AfterMethod org.apache.brooklyn.camp.brooklyn.AbstractYamlTest.tearDown()
2015-10-22 14:40:02,395 INFO TESTNG PASSED CONFIGURATION: "Surefire test" - @AfterMethod org.apache.brooklyn.camp.brooklyn.AbstractYamlTest.tearDown() finished in 495 ms
2015-10-22 14:40:02,518 INFO TESTNG
===============================================
Surefire test
Tests run: 227, Failures: 1, Skips: 0
===============================================
2015-10-22 14:40:02,519 INFO BrooklynLeakListener.onFinish attempting to terminate all extant ManagementContexts: name=Surefire test; includedGroups=[]; excludedGroups=[Integration, Acceptance, Live, WIP]; suiteName=Surefire suite; outDir=F:\hudson\hudson-slave\workspace\incubator-brooklyn-master-windows\usage\camp\target\surefire-reports\Surefire suite: no org.apache.brooklyn.core.management.internal.LocalManagementContext available, so skipped
SUREFIRE-859: [GC 735704K->504175K(769536K), 0.0091302 secs]
Tests run: 227, Failures: 1, Errors: 0, Skipped: 0, Time elapsed: 406.854 sec <<< FAILURE! - in TestSuite
testRebindWithCatalogPropertiesForDeprecationAndEnablementAbsent(org.apache.brooklyn.camp.brooklyn.catalog.CatalogYamlRebindTest) Time elapsed: 0.385 sec <<< FAILURE!
java.nio.file.InvalidPathException: Illegal char <:> at index 73: C:\Windows\TEMP\CatalogYamlRebindTest-OhNs\catalog\my.catalog.app.id.load:0.1.0.vWfmp4fW.tmp
at sun.nio.fs.WindowsPathParser.normalize(WindowsPathParser.java:176)
at sun.nio.fs.WindowsPathParser.parse(WindowsPathParser.java:147)
at sun.nio.fs.WindowsPathParser.parse(WindowsPathParser.java:77)
at sun.nio.fs.WindowsPath.parse(WindowsPath.java:94)
at sun.nio.fs.WindowsFileSystem.getPath(WindowsFileSystem.java:255)
at java.io.File.toPath(File.java:2069)
at org.apache.brooklyn.util.io.FilePermissions.apply(FilePermissions.java:61)
at org.apache.brooklyn.util.io.FileUtil.setFilePermissionsTo600(FileUtil.java:72)
at org.apache.brooklyn.core.mgmt.persist.FileBasedStoreObjectAccessor.put(FileBasedStoreObjectAccessor.java:82)
at org.apache.brooklyn.camp.brooklyn.catalog.CatalogYamlRebindTest$1.apply(CatalogYamlRebindTest.java:216)
at org.apache.brooklyn.camp.brooklyn.catalog.CatalogYamlRebindTest$1.apply(CatalogYamlRebindTest.java:209)
at org.apache.brooklyn.core.mgmt.rebind.RebindTestUtils.rebindAll(RebindTestUtils.java:433)
at org.apache.brooklyn.core.mgmt.rebind.RebindTestUtils.rebind(RebindTestUtils.java:318)
at org.apache.brooklyn.core.mgmt.rebind.RebindTestFixture.rebind(RebindTestFixture.java:258)
at org.apache.brooklyn.camp.brooklyn.AbstractYamlRebindTest.rebind(AbstractYamlRebindTest.java:86)
at org.apache.brooklyn.camp.brooklyn.catalog.CatalogYamlRebindTest.runRebindWithCatalogAndApp(CatalogYamlRebindTest.java:208)
at org.apache.brooklyn.camp.brooklyn.catalog.CatalogYamlRebindTest.testRebindWithCatalogPropertiesForDeprecationAndEnablementAbsent(CatalogYamlRebindTest.java:123)
Results :
Failed tests:
CatalogYamlRebindTest.testRebindWithCatalogPropertiesForDeprecationAndEnablementAbsent:123->runRebindWithCatalogAndApp:208->AbstractYamlRebindTest.rebind:86->RebindTestFixture.rebind:258 ยป InvalidPath
Tests run: 227, Failures: 1, Errors: 0, Skipped: 0
[JENKINS] Recording test results
[JENKINS] Archiving disabled
[INFO]
[INFO] ------------------------------------------------------------------------
[INFO] Skipping Brooklyn REST Server
[INFO] This project has been banned from the build due to previous failures.
[INFO] ------------------------------------------------------------------------
[INFO]
[INFO] ------------------------------------------------------------------------
[INFO] Skipping Brooklyn REST JavaScript Web GUI
[INFO] This project has been banned from the build due to previous failures.
[INFO] ------------------------------------------------------------------------
[INFO]
[INFO] ------------------------------------------------------------------------
[INFO] Skipping Brooklyn Launcher
[INFO] This project has been banned from the build due to previous failures.
[INFO] ------------------------------------------------------------------------
[INFO]
[INFO] ------------------------------------------------------------------------
[INFO] Skipping Brooklyn Command Line Interface
[INFO] This project has been banned from the build due to previous failures.
[INFO] ------------------------------------------------------------------------
[INFO]
[INFO] ------------------------------------------------------------------------
[INFO] Skipping Brooklyn All Things
[INFO] This project has been banned from the build due to previous failures.
[INFO] ------------------------------------------------------------------------
[INFO]
[INFO] ------------------------------------------------------------------------
[INFO] Skipping Brooklyn Simple Web Cluster Example
[INFO] This project has been banned from the build due to previous failures.
[INFO] ------------------------------------------------------------------------
[INFO]
[INFO] ------------------------------------------------------------------------
[INFO] Skipping Brooklyn Global Web Fabric Example
[INFO] This project has been banned from the build due to previous failures.
[INFO] ------------------------------------------------------------------------
[INFO]
[INFO] ------------------------------------------------------------------------
[INFO] Skipping Brooklyn Simple Messaging Publish-Subscribe Example
[INFO] This project has been banned from the build due to previous failures.
[INFO] ------------------------------------------------------------------------
[INFO]
[INFO] ------------------------------------------------------------------------
[INFO] Skipping Brooklyn NoSQL Cluster Examples
[INFO] This project has been banned from the build due to previous failures.
[INFO] ------------------------------------------------------------------------
[INFO]
[INFO] ------------------------------------------------------------------------
[INFO] Skipping Brooklyn Distribution
[INFO] This project has been banned from the build due to previous failures.
[INFO] ------------------------------------------------------------------------
[INFO]
[INFO] ------------------------------------------------------------------------
[INFO] Skipping Brooklyn QA
[INFO] This project has been banned from the build due to previous failures.
[INFO] ------------------------------------------------------------------------
[INFO]
[INFO] ------------------------------------------------------------------------
[INFO] Skipping Brooklyn REST Client
[INFO] This project has been banned from the build due to previous failures.
[INFO] ------------------------------------------------------------------------
[INFO] ------------------------------------------------------------------------
[INFO] Reactor Summary:
[INFO]
[INFO] Brooklyn Root ..................................... SUCCESS [5.772s]
[INFO] Brooklyn Parent Project ........................... SUCCESS [21.928s]
[INFO] Brooklyn Logback Configuration .................... SUCCESS [23.723s]
[INFO] Brooklyn Test Support Utilities ................... SUCCESS [20.375s]
[INFO] Brooklyn Logback Includable Configuration ......... SUCCESS [1.950s]
[INFO] Brooklyn Common Utilities ......................... SUCCESS [45.970s]
[INFO] Brooklyn API ...................................... SUCCESS [8.831s]
[INFO] Brooklyn Test Support ............................. SUCCESS [22.505s]
[INFO] CAMP Server Parent Project ........................ SUCCESS [1.419s]
[INFO] CAMP Base ......................................... SUCCESS [43.845s]
[INFO] Brooklyn Groovy Utilities ......................... SUCCESS [39.670s]
[INFO] Brooklyn Core ..................................... SUCCESS [10:18.653s]
[INFO] Brooklyn Policies ................................. SUCCESS [4:06.973s]
[INFO] Brooklyn WinRM Software Entities .................. SUCCESS [28.222s]
[INFO] Brooklyn Jclouds Location Targets ................. SUCCESS [1:41.783s]
[INFO] Brooklyn Secure JMXMP Agent ....................... SUCCESS [27.284s]
[INFO] Brooklyn JMX RMI Agent ............................ SUCCESS [7.704s]
[INFO] Brooklyn Software Base ............................ SUCCESS [2:23.690s]
[INFO] Brooklyn Web App Software Entities ................ SUCCESS [3:00.709s]
[INFO] Brooklyn Database Software Entities ............... SUCCESS [21.822s]
[INFO] Brooklyn NoSQL Data Store Software Entities ....... SUCCESS [1:01.125s]
[INFO] Brooklyn CAMP REST API ............................ FAILURE [7:16.654s]
[INFO] Brooklyn REST Server .............................. SKIPPED
[INFO] Brooklyn REST JavaScript Web GUI .................. SKIPPED
[INFO] Brooklyn Launcher ................................. SKIPPED
[INFO] Brooklyn Command Line Interface ................... SKIPPED
[INFO] Brooklyn All Things ............................... SKIPPED
[INFO] Brooklyn Simple Web Cluster Example ............... SKIPPED
[INFO] Brooklyn Global Web Fabric Example ................ SKIPPED
[INFO] Brooklyn Simple Messaging Publish-Subscribe Example SKIPPED
[INFO] Brooklyn NoSQL Cluster Examples ................... SKIPPED
[INFO] Brooklyn Distribution ............................. SKIPPED
[INFO] Brooklyn QA ....................................... SKIPPED
[INFO] Brooklyn REST Client .............................. SKIPPED
[INFO] ------------------------------------------------------------------------
[INFO] BUILD FAILURE
[INFO] ------------------------------------------------------------------------
[INFO] Total time: 35:28.648s
[INFO] Finished at: Thu Oct 22 14:40:06 BST 2015
[INFO] Final Memory: 63M/241M
[INFO] ------------------------------------------------------------------------
[JENKINS] Archiving disabled
[JENKINS] Archiving disabled
[JENKINS] Archiving disabled
[JENKINS] Archiving disabled
[JENKINS] Archiving disabled
[JENKINS] Archiving disabled
[JENKINS] Archiving disabled
[JENKINS] Archiving disabled
[JENKINS] Archiving disabled
[JENKINS] Archiving disabled
[JENKINS] Archiving disabled
[JENKINS] Archiving disabled
[JENKINS] Archiving disabled
[JENKINS] Archiving disabled
[JENKINS] Archiving disabled
[JENKINS] Archiving disabled
[JENKINS] Archiving disabled
[JENKINS] Archiving disabled
[JENKINS] Archiving disabled
[JENKINS] Archiving disabled
[JENKINS] Archiving disabled
[JENKINS] Archiving disabled
[JENKINS] Archiving disabled
[JENKINS] Archiving disabled
[JENKINS] Archiving disabled
[JENKINS] Archiving disabled
[JENKINS] Archiving disabled
[JENKINS] Archiving disabled
[JENKINS] Archiving disabled
[JENKINS] Archiving disabled
[JENKINS] Archiving disabled
[JENKINS] Archiving disabled
[JENKINS] Archiving disabled
[JENKINS] Archiving disabled
Waiting for Jenkins to finish collecting data
[ERROR] Failed to execute goal org.apache.maven.plugins:maven-surefire-plugin:2.18.1:test (default-test) on project brooklyn-camp: There are test failures.
[ERROR]
[ERROR] Please refer to F:\hudson\hudson-slave\workspace\incubator-brooklyn-master-windows\usage\camp\target\surefire-reports for the individual test results.
[ERROR] -> [Help 1]
[ERROR]
[ERROR] To see the full stack trace of the errors, re-run Maven with the -e switch.
[ERROR] Re-run Maven using the -X switch to enable full debug logging.
[ERROR]
[ERROR] For more information about the errors and possible solutions, please read the following articles:
[ERROR] [Help 1] http://cwiki.apache.org/confluence/display/MAVEN/MojoFailureException
[ERROR]
[ERROR] After correcting the problems, you can resume the build with the command
[ERROR] mvn <goals> -rf :brooklyn-camp
channel stopped
Build failed in Jenkins: incubator-brooklyn-master-windows #329
Posted by Apache Jenkins Server <je...@builds.apache.org>.
See <https://builds.apache.org/job/incubator-brooklyn-master-windows/329/changes>
Changes:
[yavor] Fix NPE if loginUser is not present and useJcloudsSshInit is false
------------------------------------------
[...truncated 31938 lines...]
[INFO] --- maven-enforcer-plugin:1.4:enforce (brooklyn-build-req) @ brooklyn-storage-hazelcast ---
[INFO]
[INFO] --- maven-remote-resources-plugin:1.5:process (default) @ brooklyn-storage-hazelcast ---
[INFO]
[INFO] --- maven-resources-plugin:2.7:resources (default-resources) @ brooklyn-storage-hazelcast ---
[INFO] Using 'UTF-8' encoding to copy filtered resources.
[INFO] skip non existing resourceDirectory F:\hudson\hudson-slave\workspace\incubator-brooklyn-master-windows\storage\hazelcast\src\main\resources
[INFO] Copying 4 resources
[INFO]
[INFO] --- maven-compiler-plugin:3.3:compile (default-compile) @ brooklyn-storage-hazelcast ---
[INFO] Changes detected - recompiling the module!
[INFO] Compiling 4 source files to F:\hudson\hudson-slave\workspace\incubator-brooklyn-master-windows\storage\hazelcast\target\classes
[INFO]
[INFO] --- maven-checkstyle-plugin:2.13:check (verify-style) @ brooklyn-storage-hazelcast ---
[INFO]
[INFO]
[INFO] --- buildnumber-maven-plugin:1.3:create (default) @ brooklyn-storage-hazelcast ---
[INFO]
[INFO] --- maven-enforcer-plugin:1.4:enforce (brooklyn-build-req) @ brooklyn-storage-hazelcast ---
[INFO]
[INFO] --- maven-remote-resources-plugin:1.5:process (default) @ brooklyn-storage-hazelcast ---
[INFO]
[INFO] --- maven-resources-plugin:2.7:resources (default-resources) @ brooklyn-storage-hazelcast ---
[INFO] Using 'UTF-8' encoding to copy filtered resources.
[INFO] skip non existing resourceDirectory F:\hudson\hudson-slave\workspace\incubator-brooklyn-master-windows\storage\hazelcast\src\main\resources
[INFO] Copying 4 resources
[INFO] Copying 4 resources
[INFO]
[INFO] --- maven-compiler-plugin:3.3:compile (default-compile) @ brooklyn-storage-hazelcast ---
[INFO] Nothing to compile - all classes are up to date
[INFO]
[INFO] --- maven-checkstyle-plugin:2.13:check (verify-style) @ brooklyn-storage-hazelcast ---
[INFO]
[WARNING] Failed to getClass for org.apache.felix.bundleplugin.ManifestPlugin
[INFO]
[INFO] --- maven-bundle-plugin:2.5.4:manifest (bundle-manifest) @ brooklyn-storage-hazelcast ---
[WARNING] Manifest org.apache.brooklyn:brooklyn-storage-hazelcast:jar:0.9.0-SNAPSHOT : Unused Export-Package instructions: [brooklyn.*]
[INFO]
[INFO] --- maven-resources-plugin:2.7:testResources (default-testResources) @ brooklyn-storage-hazelcast ---
[INFO] Using 'UTF-8' encoding to copy filtered resources.
[INFO] skip non existing resourceDirectory F:\hudson\hudson-slave\workspace\incubator-brooklyn-master-windows\storage\hazelcast\src\test\resources
[INFO] Copying 4 resources
[INFO]
[INFO] --- maven-compiler-plugin:3.3:testCompile (default-testCompile) @ brooklyn-storage-hazelcast ---
[INFO] Changes detected - recompiling the module!
[INFO] Compiling 1 source file to F:\hudson\hudson-slave\workspace\incubator-brooklyn-master-windows\storage\hazelcast\target\test-classes
[INFO]
[INFO] --- maven-surefire-plugin:2.18.1:test (default-test) @ brooklyn-storage-hazelcast ---
[INFO] Surefire report directory: F:\hudson\hudson-slave\workspace\incubator-brooklyn-master-windows\storage\hazelcast\target\surefire-reports
-------------------------------------------------------
T E S T S
-------------------------------------------------------
Running org.apache.brooklyn.storage.impl.hazelcast.HazelcastStorageTest
Configuring TestNG with: TestNG652Configurator
2015-10-22 00:05:54,171 INFO TESTNG RUNNING: Suite: "Surefire test" containing "0" Tests (config: null)
2015-10-22 00:05:54,180 INFO BrooklynLeakListener.onStart attempting to terminate all extant ManagementContexts: name=Surefire test; includedGroups=[]; excludedGroups=[Integration, Acceptance, Live, WIP]; suiteName=Surefire suite; outDir=F:\hudson\hudson-slave\workspace\incubator-brooklyn-master-windows\storage\hazelcast\target\surefire-reports\Surefire suite: no org.apache.brooklyn.core.management.internal.LocalManagementContext available, so skipped
2015-10-22 00:05:54,206 INFO TESTNG
===============================================
Surefire test
Tests run: 0, Failures: 0, Skips: 0
===============================================
2015-10-22 00:05:54,274 INFO BrooklynLeakListener.onFinish attempting to terminate all extant ManagementContexts: name=Surefire test; includedGroups=[]; excludedGroups=[Integration, Acceptance, Live, WIP]; suiteName=Surefire suite; outDir=F:\hudson\hudson-slave\workspace\incubator-brooklyn-master-windows\storage\hazelcast\target\surefire-reports\Surefire suite: no org.apache.brooklyn.core.management.internal.LocalManagementContext available, so skipped
Tests run: 0, Failures: 0, Errors: 0, Skipped: 0, Time elapsed: 1.543 sec - in org.apache.brooklyn.storage.impl.hazelcast.HazelcastStorageTest
Results :
Tests run: 0, Failures: 0, Errors: 0, Skipped: 0
[JENKINS] Recording test results
[INFO]
[INFO] --- maven-jar-plugin:2.6:jar (default-jar) @ brooklyn-storage-hazelcast ---
[INFO] Building jar: F:\hudson\hudson-slave\workspace\incubator-brooklyn-master-windows\storage\hazelcast\target\brooklyn-storage-hazelcast-0.9.0-SNAPSHOT.jar
[INFO]
[INFO] --- maven-site-plugin:3.4:attach-descriptor (attach-descriptor) @ brooklyn-storage-hazelcast ---
[INFO]
[INFO] --- maven-jar-plugin:2.6:test-jar (test-jar-creation) @ brooklyn-storage-hazelcast ---
[INFO] Building jar: F:\hudson\hudson-slave\workspace\incubator-brooklyn-master-windows\storage\hazelcast\target\brooklyn-storage-hazelcast-0.9.0-SNAPSHOT-tests.jar
[INFO]
[INFO] --- apache-rat-plugin:0.10:check (default) @ brooklyn-storage-hazelcast ---
[INFO] 51 implicit excludes (use -debug for more details).
[INFO] Exclude: sandbox/**
[INFO] Exclude: release/**
[INFO] Exclude: **/nbactions.xml
[INFO] Exclude: **/nb-configuration.xml
[INFO] Exclude: **/.git/**
[INFO] Exclude: **/.gitignore
[INFO] Exclude: **/.repository/**
[INFO] Exclude: **/.idea/**
[INFO] Exclude: **/*.iml
[INFO] Exclude: **/.classpath/**
[INFO] Exclude: **/.project
[INFO] Exclude: **/.settings/**
[INFO] Exclude: **/*.log
[INFO] Exclude: **/brooklyn*.log.*
[INFO] Exclude: **/target/**
[INFO] Exclude: ignored/**
[INFO] Exclude: LICENSE.md
[INFO] Exclude: **/src/main/license/**
[INFO] Exclude: **/src/test/license/**
[INFO] Exclude: **/MANIFEST.MF
[INFO] Exclude: **/test-output/**
[INFO] Exclude: **/*.pem.pub
[INFO] Exclude: **/*.pem
[INFO] Exclude: **/*_rsa.pub
[INFO] Exclude: **/*_rsa
[INFO] Exclude: **/*.svg
[INFO] Exclude: **/*.crt
[INFO] Exclude: **/*.csr
[INFO] Exclude: **/*.key
[INFO] Exclude: **/*.key.org
[INFO] Exclude: **/*.psd
[INFO] Exclude: **/*.json
[INFO] Exclude: **/*.plxarc
[INFO] Exclude: **/src/test/resources/org/apache/brooklyn/entity/software/base/template_with_extra_substitutions.txt
[INFO] Exclude: **/src/main/resources/banner.txt
[INFO] Exclude: **/src/test/resources/ssl/certs/localhost/info.txt
[INFO] Exclude: **/sandbox/examples/src/main/scripts/amis.txt
[INFO] Exclude: docs/**
[INFO] 6 resources included (use -debug for more details)
[INFO] Rat check: Summary of files. Unapproved: 0 unknown: 0 generated: 0 approved: 6 licence.
[INFO]
[INFO] --- maven-source-plugin:2.4:jar-no-fork (attach-sources) @ brooklyn-storage-hazelcast ---
[INFO] Building jar: F:\hudson\hudson-slave\workspace\incubator-brooklyn-master-windows\storage\hazelcast\target\brooklyn-storage-hazelcast-0.9.0-SNAPSHOT-sources.jar
[INFO]
[INFO] --- maven-install-plugin:2.5.2:install (default-install) @ brooklyn-storage-hazelcast ---
[INFO] Installing F:\hudson\hudson-slave\workspace\incubator-brooklyn-master-windows\storage\hazelcast\target\brooklyn-storage-hazelcast-0.9.0-SNAPSHOT.jar to f:\hudson\hudson-slave\maven-repositories\0\org\apache\brooklyn\brooklyn-storage-hazelcast\0.9.0-SNAPSHOT\brooklyn-storage-hazelcast-0.9.0-SNAPSHOT.jar
[INFO] Installing F:\hudson\hudson-slave\workspace\incubator-brooklyn-master-windows\storage\hazelcast\pom.xml to f:\hudson\hudson-slave\maven-repositories\0\org\apache\brooklyn\brooklyn-storage-hazelcast\0.9.0-SNAPSHOT\brooklyn-storage-hazelcast-0.9.0-SNAPSHOT.pom
[INFO] Installing F:\hudson\hudson-slave\workspace\incubator-brooklyn-master-windows\storage\hazelcast\target\brooklyn-storage-hazelcast-0.9.0-SNAPSHOT-tests.jar to f:\hudson\hudson-slave\maven-repositories\0\org\apache\brooklyn\brooklyn-storage-hazelcast\0.9.0-SNAPSHOT\brooklyn-storage-hazelcast-0.9.0-SNAPSHOT-tests.jar
[INFO] Installing F:\hudson\hudson-slave\workspace\incubator-brooklyn-master-windows\storage\hazelcast\target\brooklyn-storage-hazelcast-0.9.0-SNAPSHOT-sources.jar to f:\hudson\hudson-slave\maven-repositories\0\org\apache\brooklyn\brooklyn-storage-hazelcast\0.9.0-SNAPSHOT\brooklyn-storage-hazelcast-0.9.0-SNAPSHOT-sources.jar
[JENKINS] Archiving disabled
[INFO]
[INFO] ------------------------------------------------------------------------
[INFO] Skipping Brooklyn Distribution
[INFO] This project has been banned from the build due to previous failures.
[INFO] ------------------------------------------------------------------------
[INFO]
[INFO] ------------------------------------------------------------------------
[INFO] Skipping Brooklyn QA
[INFO] This project has been banned from the build due to previous failures.
[INFO] ------------------------------------------------------------------------
[INFO]
[INFO] ------------------------------------------------------------------------
[INFO] Skipping Brooklyn REST Client
[INFO] This project has been banned from the build due to previous failures.
[INFO] ------------------------------------------------------------------------
[INFO] ------------------------------------------------------------------------
[INFO] Reactor Summary:
[INFO]
[INFO] Brooklyn Root ..................................... SUCCESS [4.628s]
[INFO] Brooklyn Parent Project ........................... SUCCESS [11.050s]
[INFO] Brooklyn Logback Configuration .................... SUCCESS [9.239s]
[INFO] Brooklyn Test Support Utilities ................... SUCCESS [6.521s]
[INFO] Brooklyn Logback Includable Configuration ......... SUCCESS [3.162s]
[INFO] Brooklyn Common Utilities ......................... SUCCESS [43.619s]
[INFO] Brooklyn API ...................................... SUCCESS [9.586s]
[INFO] Brooklyn Test Support ............................. SUCCESS [4.673s]
[INFO] CAMP Server Parent Project ........................ SUCCESS [0.972s]
[INFO] CAMP Base ......................................... SUCCESS [10.114s]
[INFO] Brooklyn Groovy Utilities ......................... SUCCESS [18.153s]
[INFO] Brooklyn Core ..................................... SUCCESS [6:33.927s]
[INFO] Brooklyn Policies ................................. SUCCESS [2:17.779s]
[INFO] Brooklyn WinRM Software Entities .................. SUCCESS [20.305s]
[INFO] Brooklyn Jclouds Location Targets ................. SUCCESS [1:14.670s]
[INFO] Brooklyn Secure JMXMP Agent ....................... SUCCESS [18.502s]
[INFO] Brooklyn JMX RMI Agent ............................ SUCCESS [3.588s]
[INFO] Brooklyn Software Base ............................ SUCCESS [2:20.886s]
[INFO] Brooklyn Web App Software Entities ................ SUCCESS [2:32.185s]
[INFO] Brooklyn Messaging Software Entities .............. SUCCESS [21.944s]
[INFO] Brooklyn Database Software Entities ............... SUCCESS [14.933s]
[INFO] Brooklyn Monitoring Software Entities ............. SUCCESS [11.310s]
[INFO] Brooklyn OSGi Software Entities ................... SUCCESS [10.495s]
[INFO] Brooklyn NoSQL Data Store Software Entities ....... SUCCESS [47.837s]
[INFO] Brooklyn Network Software Entities ................ SUCCESS [12.993s]
[INFO] Brooklyn CAMP REST API ............................ FAILURE [6:05.097s]
[INFO] Brooklyn REST Server .............................. SKIPPED
[INFO] Brooklyn REST JavaScript Web GUI .................. SKIPPED
[INFO] Brooklyn Launcher ................................. SKIPPED
[INFO] Brooklyn Command Line Interface ................... SKIPPED
[INFO] Brooklyn All Things ............................... SKIPPED
[INFO] Brooklyn Simple Web Cluster Example ............... SKIPPED
[INFO] Brooklyn Global Web Fabric Example ................ SKIPPED
[INFO] Brooklyn Simple Messaging Publish-Subscribe Example SKIPPED
[INFO] Brooklyn NoSQL Cluster Examples ................... SKIPPED
[INFO] Brooklyn Hazelcast Storage ........................ SUCCESS [10.256s]
[INFO] Brooklyn Distribution ............................. SKIPPED
[INFO] Brooklyn QA ....................................... SKIPPED
[INFO] Brooklyn REST Client .............................. SKIPPED
[INFO] ------------------------------------------------------------------------
[INFO] BUILD FAILURE
[INFO] ------------------------------------------------------------------------
[INFO] Total time: 26:21.919s
[INFO] Finished at: Thu Oct 22 00:05:55 BST 2015
[INFO] Final Memory: 67M/226M
[INFO] ------------------------------------------------------------------------
[JENKINS] Archiving disabled
[JENKINS] Archiving disabled
[JENKINS] Archiving disabled
[JENKINS] Archiving disabled
[JENKINS] Archiving disabled
[JENKINS] Archiving disabled
[JENKINS] Archiving disabled
[JENKINS] Archiving disabled
[JENKINS] Archiving disabled
[JENKINS] Archiving disabled
[JENKINS] Archiving disabled
[JENKINS] Archiving disabled
[JENKINS] Archiving disabled
[JENKINS] Archiving disabled
[JENKINS] Archiving disabled
[JENKINS] Archiving disabled
[JENKINS] Archiving disabled
[JENKINS] Archiving disabled
[JENKINS] Archiving disabled
[JENKINS] Archiving disabled
[JENKINS] Archiving disabled
[JENKINS] Archiving disabled
[JENKINS] Archiving disabled
[JENKINS] Archiving disabled
[JENKINS] Archiving disabled
[JENKINS] Archiving disabled
[JENKINS] Archiving disabled
[JENKINS] Archiving disabled
[JENKINS] Archiving disabled
[JENKINS] Archiving disabled
[JENKINS] Archiving disabled
[JENKINS] Archiving disabled
[JENKINS] Archiving disabled
[JENKINS] Archiving disabled
[JENKINS] Archiving disabled
[JENKINS] Archiving disabled
[JENKINS] Archiving disabled
[JENKINS] Archiving disabled
[JENKINS] Archiving disabled
Waiting for Jenkins to finish collecting data
[ERROR] Failed to execute goal org.apache.maven.plugins:maven-surefire-plugin:2.18.1:test (default-test) on project brooklyn-camp: There are test failures.
[ERROR]
[ERROR] Please refer to F:\hudson\hudson-slave\workspace\incubator-brooklyn-master-windows\usage\camp\target\surefire-reports for the individual test results.
[ERROR] -> [Help 1]
[ERROR]
[ERROR] To see the full stack trace of the errors, re-run Maven with the -e switch.
[ERROR] Re-run Maven using the -X switch to enable full debug logging.
[ERROR]
[ERROR] For more information about the errors and possible solutions, please read the following articles:
[ERROR] [Help 1] http://cwiki.apache.org/confluence/display/MAVEN/MojoFailureException
[ERROR]
[ERROR] After correcting the problems, you can resume the build with the command
[ERROR] mvn <goals> -rf :brooklyn-camp
channel stopped