You are viewing a plain text version of this content. The canonical link for it is here.
Posted to ci@buildr.apache.org by Apache Hudson Server <hu...@hudson.zones.apache.org> on 2010/06/29 22:52:35 UTC
Build failed in Hudson: Buildr-ci-build #40
See <http://hudson.zones.apache.org/hudson/job/Buildr-ci-build/40/changes>
Changes:
[toulmean] make sure to only require runtime dependencies in spec_helpers
------------------------------------------
[...truncated 684 lines...]
/home/toulmean/buildr-gems/gems/Antwrap-0.7.0-java/lib/ant_project.rb:108:in `method_missing'
<http://hudson.zones.apache.org/hudson/job/Buildr-ci-build/ws/lib/buildr/java/tests.rb>:171:in `generate'
<http://hudson.zones.apache.org/hudson/job/Buildr-ci-build/ws/lib/buildr/java/ant.rb>:77:in `ant'
<http://hudson.zones.apache.org/hudson/job/Buildr-ci-build/ws/lib/buildr/java/ant.rb>:73:in `tap'
<http://hudson.zones.apache.org/hudson/job/Buildr-ci-build/ws/lib/buildr/java/ant.rb>:73:in `ant'
<http://hudson.zones.apache.org/hudson/job/Buildr-ci-build/ws/lib/buildr/java/tests.rb>:168:in `generate'
<http://hudson.zones.apache.org/hudson/job/Buildr-ci-build/ws/lib/buildr/java/tests.rb>:280:
/home/toulmean/buildr-gems/gems/rake-0.8.7/lib/rake.rb:634:in `call'
/home/toulmean/buildr-gems/gems/rake-0.8.7/lib/rake.rb:634:in `execute_without_a_record'
/home/toulmean/buildr-gems/gems/rake-0.8.7/lib/rake.rb:631:in `each'
/home/toulmean/buildr-gems/gems/rake-0.8.7/lib/rake.rb:631:in `execute_without_a_record'
./spec/groovy/../spec_helpers.rb:144:in `execute'
<http://hudson.zones.apache.org/hudson/job/Buildr-ci-build/ws/lib/buildr/core/application.rb>:636:in `invoke_with_call_chain'
/usr/lib/ruby/1.8/monitor.rb:242:in `synchronize'
<http://hudson.zones.apache.org/hudson/job/Buildr-ci-build/ws/lib/buildr/core/application.rb>:622:in `invoke_with_call_chain'
<http://hudson.zones.apache.org/hudson/job/Buildr-ci-build/ws/lib/buildr/core/application.rb>:617:in `invoke'
./spec/java/tests_spec.rb:344:
/home/toulmean/buildr-gems/gems/rspec-1.2.9/lib/spec/example/example_methods.rb:40:in `instance_eval'
/home/toulmean/buildr-gems/gems/rspec-1.2.9/lib/spec/example/example_methods.rb:40:in `execute'
/usr/lib/ruby/1.8/timeout.rb:53:in `timeout'
/home/toulmean/buildr-gems/gems/rspec-1.2.9/lib/spec/example/example_methods.rb:37:in `execute'
/home/toulmean/buildr-gems/gems/rspec-1.2.9/lib/spec/example/example_group_methods.rb:214:in `run_examples'
/home/toulmean/buildr-gems/gems/rspec-1.2.9/lib/spec/example/example_group_methods.rb:212:in `each'
/home/toulmean/buildr-gems/gems/rspec-1.2.9/lib/spec/example/example_group_methods.rb:212:in `run_examples'
/home/toulmean/buildr-gems/gems/rspec-1.2.9/lib/spec/example/example_group_methods.rb:103:in `run'
/home/toulmean/buildr-gems/gems/rspec-1.2.9/lib/spec/runner/example_group_runner.rb:23:in `run'
/home/toulmean/buildr-gems/gems/rspec-1.2.9/lib/spec/runner/example_group_runner.rb:22:in `each'
/home/toulmean/buildr-gems/gems/rspec-1.2.9/lib/spec/runner/example_group_runner.rb:22:in `run'
/home/toulmean/buildr-gems/gems/rspec-1.2.9/lib/spec/runner/options.rb:151:in `run_examples'
/home/toulmean/buildr-gems/gems/rspec-1.2.9/lib/spec/runner/command_line.rb:9:in `run'
/home/toulmean/buildr-gems/gems/rspec-1.2.9/bin/spec:5:
7)
'javac compiler should identify itself from source directories' FAILED
expected :javac
got :externaljavac
(compared using eql?)
/home/toulmean/buildr-gems/gems/rspec-1.2.9/lib/spec/expectations/fail_with.rb:41:in `fail_with'
/home/toulmean/buildr-gems/gems/rspec-1.2.9/lib/spec/expectations/handler.rb:21:in `handle_matcher'
/home/toulmean/buildr-gems/gems/rspec-1.2.9/lib/spec/expectations/extensions/kernel.rb:27:in `should'
./spec/java/compiler_spec.rb:23:
/home/toulmean/buildr-gems/gems/rspec-1.2.9/lib/spec/example/example_methods.rb:40:in `instance_eval'
/home/toulmean/buildr-gems/gems/rspec-1.2.9/lib/spec/example/example_methods.rb:40:in `execute'
/usr/lib/ruby/1.8/timeout.rb:53:in `timeout'
/home/toulmean/buildr-gems/gems/rspec-1.2.9/lib/spec/example/example_methods.rb:37:in `execute'
/home/toulmean/buildr-gems/gems/rspec-1.2.9/lib/spec/example/example_group_methods.rb:214:in `run_examples'
/home/toulmean/buildr-gems/gems/rspec-1.2.9/lib/spec/example/example_group_methods.rb:212:in `each'
/home/toulmean/buildr-gems/gems/rspec-1.2.9/lib/spec/example/example_group_methods.rb:212:in `run_examples'
/home/toulmean/buildr-gems/gems/rspec-1.2.9/lib/spec/example/example_group_methods.rb:103:in `run'
/home/toulmean/buildr-gems/gems/rspec-1.2.9/lib/spec/runner/example_group_runner.rb:23:in `run'
/home/toulmean/buildr-gems/gems/rspec-1.2.9/lib/spec/runner/example_group_runner.rb:22:in `each'
/home/toulmean/buildr-gems/gems/rspec-1.2.9/lib/spec/runner/example_group_runner.rb:22:in `run'
/home/toulmean/buildr-gems/gems/rspec-1.2.9/lib/spec/runner/options.rb:151:in `run_examples'
/home/toulmean/buildr-gems/gems/rspec-1.2.9/lib/spec/runner/command_line.rb:9:in `run'
/home/toulmean/buildr-gems/gems/rspec-1.2.9/bin/spec:5:
8)
'javac compiler should identify from source directories using custom layout' FAILED
expected :javac
got :externaljavac
(compared using eql?)
/home/toulmean/buildr-gems/gems/rspec-1.2.9/lib/spec/expectations/fail_with.rb:41:in `fail_with'
/home/toulmean/buildr-gems/gems/rspec-1.2.9/lib/spec/expectations/handler.rb:21:in `handle_matcher'
/home/toulmean/buildr-gems/gems/rspec-1.2.9/lib/spec/expectations/extensions/kernel.rb:27:in `should'
./spec/java/compiler_spec.rb:33:
<http://hudson.zones.apache.org/hudson/job/Buildr-ci-build/ws/lib/buildr/core/project.rb>:225:in `instance_exec'
<http://hudson.zones.apache.org/hudson/job/Buildr-ci-build/ws/lib/buildr/core/project.rb>:225:in `define'
/home/toulmean/buildr-gems/gems/rake-0.8.7/lib/rake.rb:636:in `call'
/home/toulmean/buildr-gems/gems/rake-0.8.7/lib/rake.rb:636:in `execute_without_a_record'
/home/toulmean/buildr-gems/gems/rake-0.8.7/lib/rake.rb:631:in `each'
/home/toulmean/buildr-gems/gems/rake-0.8.7/lib/rake.rb:631:in `execute_without_a_record'
./spec/groovy/../spec_helpers.rb:144:in `execute'
<http://hudson.zones.apache.org/hudson/job/Buildr-ci-build/ws/lib/buildr/core/project.rb>:636:in `execute'
<http://hudson.zones.apache.org/hudson/job/Buildr-ci-build/ws/lib/buildr/core/application.rb>:146:in `switch_to_namespace'
<http://hudson.zones.apache.org/hudson/job/Buildr-ci-build/ws/lib/buildr/core/project.rb>:635:in `execute'
<http://hudson.zones.apache.org/hudson/job/Buildr-ci-build/ws/lib/buildr/core/application.rb>:636:in `invoke_with_call_chain'
/usr/lib/ruby/1.8/monitor.rb:242:in `synchronize'
<http://hudson.zones.apache.org/hudson/job/Buildr-ci-build/ws/lib/buildr/core/application.rb>:622:in `invoke_with_call_chain'
<http://hudson.zones.apache.org/hudson/job/Buildr-ci-build/ws/lib/buildr/core/application.rb>:617:in `invoke'
./spec/groovy/../spec_helpers.rb:338:in `define'
./spec/groovy/../spec_helpers.rb:338:in `tap'
./spec/groovy/../spec_helpers.rb:338:in `define'
./spec/java/compiler_spec.rb:32:
/home/toulmean/buildr-gems/gems/rspec-1.2.9/lib/spec/example/example_methods.rb:40:in `instance_eval'
/home/toulmean/buildr-gems/gems/rspec-1.2.9/lib/spec/example/example_methods.rb:40:in `execute'
/usr/lib/ruby/1.8/timeout.rb:53:in `timeout'
/home/toulmean/buildr-gems/gems/rspec-1.2.9/lib/spec/example/example_methods.rb:37:in `execute'
/home/toulmean/buildr-gems/gems/rspec-1.2.9/lib/spec/example/example_group_methods.rb:214:in `run_examples'
/home/toulmean/buildr-gems/gems/rspec-1.2.9/lib/spec/example/example_group_methods.rb:212:in `each'
/home/toulmean/buildr-gems/gems/rspec-1.2.9/lib/spec/example/example_group_methods.rb:212:in `run_examples'
/home/toulmean/buildr-gems/gems/rspec-1.2.9/lib/spec/example/example_group_methods.rb:103:in `run'
/home/toulmean/buildr-gems/gems/rspec-1.2.9/lib/spec/runner/example_group_runner.rb:23:in `run'
/home/toulmean/buildr-gems/gems/rspec-1.2.9/lib/spec/runner/example_group_runner.rb:22:in `each'
/home/toulmean/buildr-gems/gems/rspec-1.2.9/lib/spec/runner/example_group_runner.rb:22:in `run'
/home/toulmean/buildr-gems/gems/rspec-1.2.9/lib/spec/runner/options.rb:151:in `run_examples'
/home/toulmean/buildr-gems/gems/rspec-1.2.9/lib/spec/runner/command_line.rb:9:in `run'
/home/toulmean/buildr-gems/gems/rspec-1.2.9/bin/spec:5:
9)
'javac compiler should identify from compile source directories' FAILED
result should have been changed to :javac, but is now :externaljavac
/home/toulmean/buildr-gems/gems/rspec-1.2.9/lib/spec/expectations/fail_with.rb:41:in `fail_with'
/home/toulmean/buildr-gems/gems/rspec-1.2.9/lib/spec/expectations/handler.rb:21:in `handle_matcher'
/home/toulmean/buildr-gems/gems/rspec-1.2.9/lib/spec/expectations/extensions/kernel.rb:27:in `should'
./spec/java/compiler_spec.rb:42:
<http://hudson.zones.apache.org/hudson/job/Buildr-ci-build/ws/lib/buildr/core/project.rb>:225:in `instance_exec'
<http://hudson.zones.apache.org/hudson/job/Buildr-ci-build/ws/lib/buildr/core/project.rb>:225:in `define'
/home/toulmean/buildr-gems/gems/rake-0.8.7/lib/rake.rb:636:in `call'
/home/toulmean/buildr-gems/gems/rake-0.8.7/lib/rake.rb:636:in `execute_without_a_record'
/home/toulmean/buildr-gems/gems/rake-0.8.7/lib/rake.rb:631:in `each'
/home/toulmean/buildr-gems/gems/rake-0.8.7/lib/rake.rb:631:in `execute_without_a_record'
./spec/groovy/../spec_helpers.rb:144:in `execute'
<http://hudson.zones.apache.org/hudson/job/Buildr-ci-build/ws/lib/buildr/core/project.rb>:636:in `execute'
<http://hudson.zones.apache.org/hudson/job/Buildr-ci-build/ws/lib/buildr/core/application.rb>:146:in `switch_to_namespace'
<http://hudson.zones.apache.org/hudson/job/Buildr-ci-build/ws/lib/buildr/core/project.rb>:635:in `execute'
<http://hudson.zones.apache.org/hudson/job/Buildr-ci-build/ws/lib/buildr/core/application.rb>:636:in `invoke_with_call_chain'
/usr/lib/ruby/1.8/monitor.rb:242:in `synchronize'
<http://hudson.zones.apache.org/hudson/job/Buildr-ci-build/ws/lib/buildr/core/application.rb>:622:in `invoke_with_call_chain'
<http://hudson.zones.apache.org/hudson/job/Buildr-ci-build/ws/lib/buildr/core/application.rb>:617:in `invoke'
./spec/groovy/../spec_helpers.rb:338:in `define'
./spec/groovy/../spec_helpers.rb:338:in `tap'
./spec/groovy/../spec_helpers.rb:338:in `define'
./spec/java/compiler_spec.rb:41:
/home/toulmean/buildr-gems/gems/rspec-1.2.9/lib/spec/example/example_methods.rb:40:in `instance_eval'
/home/toulmean/buildr-gems/gems/rspec-1.2.9/lib/spec/example/example_methods.rb:40:in `execute'
/usr/lib/ruby/1.8/timeout.rb:53:in `timeout'
/home/toulmean/buildr-gems/gems/rspec-1.2.9/lib/spec/example/example_methods.rb:37:in `execute'
/home/toulmean/buildr-gems/gems/rspec-1.2.9/lib/spec/example/example_group_methods.rb:214:in `run_examples'
/home/toulmean/buildr-gems/gems/rspec-1.2.9/lib/spec/example/example_group_methods.rb:212:in `each'
/home/toulmean/buildr-gems/gems/rspec-1.2.9/lib/spec/example/example_group_methods.rb:212:in `run_examples'
/home/toulmean/buildr-gems/gems/rspec-1.2.9/lib/spec/example/example_group_methods.rb:103:in `run'
/home/toulmean/buildr-gems/gems/rspec-1.2.9/lib/spec/runner/example_group_runner.rb:23:in `run'
/home/toulmean/buildr-gems/gems/rspec-1.2.9/lib/spec/runner/example_group_runner.rb:22:in `each'
/home/toulmean/buildr-gems/gems/rspec-1.2.9/lib/spec/runner/example_group_runner.rb:22:in `run'
/home/toulmean/buildr-gems/gems/rspec-1.2.9/lib/spec/runner/options.rb:151:in `run_examples'
/home/toulmean/buildr-gems/gems/rspec-1.2.9/lib/spec/runner/command_line.rb:9:in `run'
/home/toulmean/buildr-gems/gems/rspec-1.2.9/bin/spec:5:
10)
RuntimeError in 'javac compiler should include tools.jar dependency'
Failed to compile, see errors above
<http://hudson.zones.apache.org/hudson/job/Buildr-ci-build/ws/lib/buildr/java/external.rb>:43:in `compile'
<http://hudson.zones.apache.org/hudson/job/Buildr-ci-build/ws/lib/buildr/core/compile.rb>:247:in `initialize'
/home/toulmean/buildr-gems/gems/rake-0.8.7/lib/rake.rb:634:in `call'
/home/toulmean/buildr-gems/gems/rake-0.8.7/lib/rake.rb:634:in `execute_without_a_record'
/home/toulmean/buildr-gems/gems/rake-0.8.7/lib/rake.rb:631:in `each'
/home/toulmean/buildr-gems/gems/rake-0.8.7/lib/rake.rb:631:in `execute_without_a_record'
./spec/groovy/../spec_helpers.rb:144:in `execute'
<http://hudson.zones.apache.org/hudson/job/Buildr-ci-build/ws/lib/buildr/core/application.rb>:636:in `invoke_with_call_chain'
/usr/lib/ruby/1.8/monitor.rb:242:in `synchronize'
<http://hudson.zones.apache.org/hudson/job/Buildr-ci-build/ws/lib/buildr/core/application.rb>:622:in `invoke_with_call_chain'
<http://hudson.zones.apache.org/hudson/job/Buildr-ci-build/ws/lib/buildr/core/application.rb>:617:in `invoke'
./spec/java/compiler_spec.rb:87:
/home/toulmean/buildr-gems/gems/rspec-1.2.9/lib/spec/example/example_methods.rb:40:in `instance_eval'
/home/toulmean/buildr-gems/gems/rspec-1.2.9/lib/spec/example/example_methods.rb:40:in `execute'
/usr/lib/ruby/1.8/timeout.rb:53:in `timeout'
/home/toulmean/buildr-gems/gems/rspec-1.2.9/lib/spec/example/example_methods.rb:37:in `execute'
/home/toulmean/buildr-gems/gems/rspec-1.2.9/lib/spec/example/example_group_methods.rb:214:in `run_examples'
/home/toulmean/buildr-gems/gems/rspec-1.2.9/lib/spec/example/example_group_methods.rb:212:in `each'
/home/toulmean/buildr-gems/gems/rspec-1.2.9/lib/spec/example/example_group_methods.rb:212:in `run_examples'
/home/toulmean/buildr-gems/gems/rspec-1.2.9/lib/spec/example/example_group_methods.rb:103:in `run'
/home/toulmean/buildr-gems/gems/rspec-1.2.9/lib/spec/runner/example_group_runner.rb:23:in `run'
/home/toulmean/buildr-gems/gems/rspec-1.2.9/lib/spec/runner/example_group_runner.rb:22:in `each'
/home/toulmean/buildr-gems/gems/rspec-1.2.9/lib/spec/runner/example_group_runner.rb:22:in `run'
/home/toulmean/buildr-gems/gems/rspec-1.2.9/lib/spec/runner/options.rb:151:in `run_examples'
/home/toulmean/buildr-gems/gems/rspec-1.2.9/lib/spec/runner/command_line.rb:9:in `run'
/home/toulmean/buildr-gems/gems/rspec-1.2.9/bin/spec:5:
11)
'Buildr::CompileTask should allow overriding the guessed compiler' FAILED
expected: :javac,
got: :externaljavac (using ==)
/home/toulmean/buildr-gems/gems/rspec-1.2.9/lib/spec/expectations/fail_with.rb:41:in `fail_with'
/home/toulmean/buildr-gems/gems/rspec-1.2.9/lib/spec/matchers/operator_matcher.rb:39:in `fail_with_message'
/home/toulmean/buildr-gems/gems/rspec-1.2.9/lib/spec/matchers/operator_matcher.rb:61:in `__delegate_operator'
/home/toulmean/buildr-gems/gems/rspec-1.2.9/lib/spec/matchers/operator_matcher.rb:51:in `eval_match'
/home/toulmean/buildr-gems/gems/rspec-1.2.9/lib/spec/matchers/operator_matcher.rb:29:in `=='
./spec/core/compile_spec.rb:114:
/home/toulmean/buildr-gems/gems/rspec-1.2.9/lib/spec/example/example_methods.rb:40:in `instance_eval'
/home/toulmean/buildr-gems/gems/rspec-1.2.9/lib/spec/example/example_methods.rb:40:in `execute'
/usr/lib/ruby/1.8/timeout.rb:53:in `timeout'
/home/toulmean/buildr-gems/gems/rspec-1.2.9/lib/spec/example/example_methods.rb:37:in `execute'
/home/toulmean/buildr-gems/gems/rspec-1.2.9/lib/spec/example/example_group_methods.rb:214:in `run_examples'
/home/toulmean/buildr-gems/gems/rspec-1.2.9/lib/spec/example/example_group_methods.rb:212:in `each'
/home/toulmean/buildr-gems/gems/rspec-1.2.9/lib/spec/example/example_group_methods.rb:212:in `run_examples'
/home/toulmean/buildr-gems/gems/rspec-1.2.9/lib/spec/example/example_group_methods.rb:103:in `run'
/home/toulmean/buildr-gems/gems/rspec-1.2.9/lib/spec/runner/example_group_runner.rb:23:in `run'
/home/toulmean/buildr-gems/gems/rspec-1.2.9/lib/spec/runner/example_group_runner.rb:22:in `each'
/home/toulmean/buildr-gems/gems/rspec-1.2.9/lib/spec/runner/example_group_runner.rb:22:in `run'
/home/toulmean/buildr-gems/gems/rspec-1.2.9/lib/spec/runner/options.rb:151:in `run_examples'
/home/toulmean/buildr-gems/gems/rspec-1.2.9/lib/spec/runner/command_line.rb:9:in `run'
/home/toulmean/buildr-gems/gems/rspec-1.2.9/bin/spec:5:
12)
'Buildr::Project#test.compile should identify compiler from project' FAILED
expected :javac
got :externaljavac
(compared using eql?)
/home/toulmean/buildr-gems/gems/rspec-1.2.9/lib/spec/expectations/fail_with.rb:41:in `fail_with'
/home/toulmean/buildr-gems/gems/rspec-1.2.9/lib/spec/expectations/handler.rb:21:in `handle_matcher'
/home/toulmean/buildr-gems/gems/rspec-1.2.9/lib/spec/expectations/extensions/kernel.rb:27:in `should'
./spec/core/test_spec.rb:546:
<http://hudson.zones.apache.org/hudson/job/Buildr-ci-build/ws/lib/buildr/core/project.rb>:225:in `instance_exec'
<http://hudson.zones.apache.org/hudson/job/Buildr-ci-build/ws/lib/buildr/core/project.rb>:225:in `define'
/home/toulmean/buildr-gems/gems/rake-0.8.7/lib/rake.rb:636:in `call'
/home/toulmean/buildr-gems/gems/rake-0.8.7/lib/rake.rb:636:in `execute_without_a_record'
/home/toulmean/buildr-gems/gems/rake-0.8.7/lib/rake.rb:631:in `each'
/home/toulmean/buildr-gems/gems/rake-0.8.7/lib/rake.rb:631:in `execute_without_a_record'
./spec/groovy/../spec_helpers.rb:144:in `execute'
<http://hudson.zones.apache.org/hudson/job/Buildr-ci-build/ws/lib/buildr/core/project.rb>:636:in `execute'
<http://hudson.zones.apache.org/hudson/job/Buildr-ci-build/ws/lib/buildr/core/application.rb>:146:in `switch_to_namespace'
<http://hudson.zones.apache.org/hudson/job/Buildr-ci-build/ws/lib/buildr/core/project.rb>:635:in `execute'
<http://hudson.zones.apache.org/hudson/job/Buildr-ci-build/ws/lib/buildr/core/application.rb>:636:in `invoke_with_call_chain'
/usr/lib/ruby/1.8/monitor.rb:242:in `synchronize'
<http://hudson.zones.apache.org/hudson/job/Buildr-ci-build/ws/lib/buildr/core/application.rb>:622:in `invoke_with_call_chain'
<http://hudson.zones.apache.org/hudson/job/Buildr-ci-build/ws/lib/buildr/core/application.rb>:617:in `invoke'
./spec/groovy/../spec_helpers.rb:338:in `define'
./spec/groovy/../spec_helpers.rb:338:in `tap'
./spec/groovy/../spec_helpers.rb:338:in `define'
./spec/core/test_spec.rb:545:
/home/toulmean/buildr-gems/gems/rspec-1.2.9/lib/spec/example/example_methods.rb:40:in `instance_eval'
/home/toulmean/buildr-gems/gems/rspec-1.2.9/lib/spec/example/example_methods.rb:40:in `execute'
/usr/lib/ruby/1.8/timeout.rb:53:in `timeout'
/home/toulmean/buildr-gems/gems/rspec-1.2.9/lib/spec/example/example_methods.rb:37:in `execute'
/home/toulmean/buildr-gems/gems/rspec-1.2.9/lib/spec/example/example_group_methods.rb:214:in `run_examples'
/home/toulmean/buildr-gems/gems/rspec-1.2.9/lib/spec/example/example_group_methods.rb:212:in `each'
/home/toulmean/buildr-gems/gems/rspec-1.2.9/lib/spec/example/example_group_methods.rb:212:in `run_examples'
/home/toulmean/buildr-gems/gems/rspec-1.2.9/lib/spec/example/example_group_methods.rb:103:in `run'
/home/toulmean/buildr-gems/gems/rspec-1.2.9/lib/spec/runner/example_group_runner.rb:23:in `run'
/home/toulmean/buildr-gems/gems/rspec-1.2.9/lib/spec/runner/example_group_runner.rb:22:in `each'
/home/toulmean/buildr-gems/gems/rspec-1.2.9/lib/spec/runner/example_group_runner.rb:22:in `run'
/home/toulmean/buildr-gems/gems/rspec-1.2.9/lib/spec/runner/options.rb:151:in `run_examples'
/home/toulmean/buildr-gems/gems/rspec-1.2.9/lib/spec/runner/command_line.rb:9:in `run'
/home/toulmean/buildr-gems/gems/rspec-1.2.9/bin/spec:5:
Finished in 331.651418 seconds
1971 examples, 12 failures
rake aborted!
Command /usr/bin/ruby1.8 -I"lib" "/home/toulmean/buildr-gems/gems/rspec-1.2.9/bin/spec" "spec/groovy/bdd_spec.rb" "spec/groovy/compiler_spec.rb" "spec/addon/drb_spec.rb" "spec/java/commands_spec.rb" "spec/java/external_spec.rb" "spec/java/packaging_spec.rb" "spec/java/tests_spec.rb" "spec/java/bdd_spec.rb" "spec/java/emma_spec.rb" "spec/java/ant_spec.rb" "spec/java/cobertura_spec.rb" "spec/java/compiler_spec.rb" "spec/java/java_spec.rb" "spec/core/compile_spec.rb" "spec/core/common_spec.rb" "spec/core/cc_spec.rb" "spec/core/project_spec.rb" "spec/core/generate_spec.rb" "spec/core/checks_spec.rb" "spec/core/application_spec.rb" "spec/core/util_spec.rb" "spec/core/extension_spec.rb" "spec/core/transport_spec.rb" "spec/core/test_spec.rb" "spec/core/build_spec.rb" "spec/ide/idea7x_spec.rb" "spec/ide/eclipse_spec.rb" "spec/packaging/artifact_spec.rb" "spec/packaging/artifact_namespace_spec.rb" "spec/packaging/packaging_spec.rb" "spec/packaging/archive_spec.rb" "spec/version_requirement_spec.rb" "spec/scala/tests_spec.rb" "spec/scala/bdd_spec.rb" "spec/scala/compiler_spec.rb" --format failing_examples:failed --format html:_reports/specs.html --backtrace --require "/home/toulmean/buildr-gems/gems/ci_reporter-1.6.2/lib/ci/reporter/rake/rspec_loader.rb" --format CI::Reporter::RSpec failed
(See full trace by running task with --trace)
Recording test results
Hudson build is back to normal : Buildr-ci-build #46
Posted by Apache Hudson Server <hu...@hudson.zones.apache.org>.
See <http://hudson.zones.apache.org/hudson/job/Buildr-ci-build/46/changes>
Build failed in Hudson: Buildr-ci-build #45
Posted by Apache Hudson Server <hu...@hudson.zones.apache.org>.
See <http://hudson.zones.apache.org/hudson/job/Buildr-ci-build/45/changes>
Changes:
[toulmean] fix the compiler manipulations we make in the specs to avoid messing up the whole specs
------------------------------------------
[...truncated 272 lines...]
[31m at org.scalatest.Suite$class.withFixture(Suite.scala:1509)[0m
[31m at FailingSuite.withFixture(FailingSuite.scala:1)[0m
[31m at org.scalatest.FunSuite$class.runTest(FunSuite.scala:1155)[0m
[31m at FailingSuite.runTest(FailingSuite.scala:1)[0m
[31m at org.scalatest.FunSuite$$anonfun$runTests$1.apply(FunSuite.scala:1264)[0m
[31m at org.scalatest.FunSuite$$anonfun$runTests$1.apply(FunSuite.scala:1255)[0m
[31m at scala.List.foreach(List.scala:841)[0m
[31m at org.scalatest.FunSuite$class.runTests(FunSuite.scala:1255)[0m
[31m at FailingSuite.runTests(FailingSuite.scala:1)[0m
[31m at org.scalatest.Suite$class.run(Suite.scala:1804)[0m
[31m at FailingSuite.org$scalatest$FunSuite$$super$run(FailingSuite.scala:1)[0m
[31m at org.scalatest.FunSuite$class.run(FunSuite.scala:1304)[0m
[31m at FailingSuite.run(FailingSuite.scala:1)[0m
[31m at org.scalatest.tools.SuiteRunner.run(SuiteRunner.scala:59)[0m
[31m at org.scalatest.tools.Runner$$anonfun$doRunRunRunADoRunRun$3.apply(Runner.scala:1523)[0m
[31m at org.scalatest.tools.Runner$$anonfun$doRunRunRunADoRunRun$3.apply(Runner.scala:1520)[0m
[31m at scala.List.foreach(List.scala:841)[0m
[31m at org.scalatest.tools.Runner$.doRunRunRunADoRunRun(Runner.scala:1520)[0m
[31m at org.scalatest.tools.Runner$$anonfun$runOptionallyWithPassFailReporter$2.apply(Runner.scala:616)[0m
[31m at org.scalatest.tools.Runner$$anonfun$runOptionallyWithPassFailReporter$2.apply(Runner.scala:615)[0m
[31m at org.scalatest.tools.Runner$.withClassLoaderAndDispatchReporter(Runner.scala:1564)[0m
[31m at org.scalatest.tools.Runner$.runOptionallyWithPassFailReporter(Runner.scala:614)[0m
[31m at org.scalatest.tools.Runner$.run(Runner.scala:517)[0m
[31m at org.scalatest.tools.ScalaTestAntTask.execute(ScalaTestAntTask.scala:267)[0m
[31m at org.apache.tools.ant.UnknownElement.execute(UnknownElement.java:291)[0m
[32mSuite Completed - FailingSuite[0m
[36mRun completed in 167 milliseconds.[0m
[36mTotal number of tests run: 1[0m
[36mSuites: completed 1, aborted 0[0m
[36mTests: succeeded 0, failed 1, ignored 0, pending 0[0m
[31m*** 1 TEST FAILED ***[0m
.[36mRun starting. Expected test count is: 1[0m
[32mSuite Starting - FailingSuite[0m
[32mTest Starting - FailingSuite: failing[0m
[31mTEST FAILED - FailingSuite: failing (FailingSuite.scala:3)[0m
[31m org.scalatest.TestFailedException[0m
[31m at org.scalatest.Assertions$class.newAssertionFailedException(Assertions.scala:276)[0m
[31m at FailingSuite.newAssertionFailedException(FailingSuite.scala:1)[0m
[31m at org.scalatest.Assertions$class.assert(Assertions.scala:271)[0m
[31m at FailingSuite.assert(FailingSuite.scala:1)[0m
[31m at FailingSuite$$anonfun$1.apply(FailingSuite.scala:3)[0m
[31m at FailingSuite$$anonfun$1.apply(FailingSuite.scala:3)[0m
[31m at org.scalatest.FunSuite$$anon$2.apply(FunSuite.scala:1158)[0m
[31m at org.scalatest.Suite$class.withFixture(Suite.scala:1509)[0m
[31m at FailingSuite.withFixture(FailingSuite.scala:1)[0m
[31m at org.scalatest.FunSuite$class.runTest(FunSuite.scala:1155)[0m
[31m at FailingSuite.runTest(FailingSuite.scala:1)[0m
[31m at org.scalatest.FunSuite$$anonfun$runTests$1.apply(FunSuite.scala:1264)[0m
[31m at org.scalatest.FunSuite$$anonfun$runTests$1.apply(FunSuite.scala:1255)[0m
[31m at scala.List.foreach(List.scala:841)[0m
[31m at org.scalatest.FunSuite$class.runTests(FunSuite.scala:1255)[0m
[31m at FailingSuite.runTests(FailingSuite.scala:1)[0m
[31m at org.scalatest.Suite$class.run(Suite.scala:1804)[0m
[31m at FailingSuite.org$scalatest$FunSuite$$super$run(FailingSuite.scala:1)[0m
[31m at org.scalatest.FunSuite$class.run(FunSuite.scala:1304)[0m
[31m at FailingSuite.run(FailingSuite.scala:1)[0m
[31m at org.scalatest.tools.SuiteRunner.run(SuiteRunner.scala:59)[0m
[31m at org.scalatest.tools.Runner$$anonfun$doRunRunRunADoRunRun$3.apply(Runner.scala:1523)[0m
[31m at org.scalatest.tools.Runner$$anonfun$doRunRunRunADoRunRun$3.apply(Runner.scala:1520)[0m
[31m at scala.List.foreach(List.scala:841)[0m
[31m at org.scalatest.tools.Runner$.doRunRunRunADoRunRun(Runner.scala:1520)[0m
[31m at org.scalatest.tools.Runner$$anonfun$runOptionallyWithPassFailReporter$2.apply(Runner.scala:616)[0m
[31m at org.scalatest.tools.Runner$$anonfun$runOptionallyWithPassFailReporter$2.apply(Runner.scala:615)[0m
[31m at org.scalatest.tools.Runner$.withClassLoaderAndDispatchReporter(Runner.scala:1564)[0m
[31m at org.scalatest.tools.Runner$.runOptionallyWithPassFailReporter(Runner.scala:614)[0m
[31m at org.scalatest.tools.Runner$.run(Runner.scala:517)[0m
[31m at org.scalatest.tools.ScalaTestAntTask.execute(ScalaTestAntTask.scala:267)[0m
[31m at org.apache.tools.ant.UnknownElement.execute(UnknownElement.java:291)[0m
[32mSuite Completed - FailingSuite[0m
[36mRun completed in 133 milliseconds.[0m
[36mTotal number of tests run: 1[0m
[36mSuites: completed 1, aborted 0[0m
[36mTests: succeeded 0, failed 1, ignored 0, pending 0[0m
[31m*** 1 TEST FAILED ***[0m
.[36mRun starting. Expected test count is: 1[0m
[32mSuite Starting - PassingSuite[0m
[32mTest Starting - PassingSuite: passing[0m
[32mTest Succeeded - PassingSuite: passing[0m
[32mSuite Completed - PassingSuite[0m
[36mRun completed in 130 milliseconds.[0m
[36mTotal number of tests run: 1[0m
[36mSuites: completed 1, aborted 0[0m
[36mTests: succeeded 1, failed 0, ignored 0, pending 0[0m
[32mAll tests passed.[0m
.[36mRun starting. Expected test count is: 1[0m
[32mSuite Starting - PassingSuite[0m
[32mTest Starting - PassingSuite: passing[0m
[32mTest Succeeded - PassingSuite: passing[0m
[32mSuite Completed - PassingSuite[0m
[36mRun completed in 128 milliseconds.[0m
[36mTotal number of tests run: 1[0m
[36mSuites: completed 1, aborted 0[0m
[36mTests: succeeded 1, failed 0, ignored 0, pending 0[0m
[32mAll tests passed.[0m
.[36mRun starting. Expected test count is: 1[0m
[32mSuite Starting - PropertyTestSuite[0m
[32mTest Starting - PropertyTestSuite: testProperty[0m
[32mTest Succeeded - PropertyTestSuite: testProperty[0m
[32mSuite Completed - PropertyTestSuite[0m
[36mRun completed in 129 milliseconds.[0m
[36mTotal number of tests run: 1[0m
[36mSuites: completed 1, aborted 0[0m
[36mTests: succeeded 1, failed 0, ignored 0, pending 0[0m
[32mAll tests passed.[0m
.[36mRun starting. Expected test count is: 2[0m
[32mSuite Starting - MySuite[0m
[32mTest Starting - MySuite: list concatenation[0m
[32mTest Succeeded - MySuite: list concatenation[0m
[32mTest Starting - MySuite: list concatenation using a test method[0m
[32mTest Succeeded - MySuite: list concatenation using a test method[0m
[32mSuite Completed - MySuite[0m
[36mRun completed in 497 milliseconds.[0m
[36mTotal number of tests run: 2[0m
[36mSuites: completed 1, aborted 0[0m
[36mTests: succeeded 2, failed 0, ignored 0, pending 0[0m
[32mAll tests passed.[0m
.[36mRun starting. Expected test count is: 5[0m
[32mSuite Starting - StringSuite[0m
[32mTest Starting - StringSuite: startsWith[0m
[32mTest Succeeded - StringSuite: startsWith[0m
[32mTest Starting - StringSuite: endsWith[0m
[32mTest Succeeded - StringSuite: endsWith[0m
[32mTest Starting - StringSuite: concat[0m
[31mTEST FAILED - StringSuite: concat (Checkers.scala:241)[0m
[31m Falsified after 0 passed tests:
> ARG_0 = ""
> ARG_1 = ""[0m
[31m org.scalatest.prop.PropertyTestFailedException: Falsified after 0 passed tests:
> ARG_0 = ""
> ARG_1 = ""[0m
[31m at org.scalatest.prop.Checkers$class.check(Checkers.scala:241)[0m
[31m at StringSuite.check(StringSuite.scala:6)[0m
[31m at org.scalatest.prop.Checkers$class.check(Checkers.scala:304)[0m
[31m at StringSuite.check(StringSuite.scala:6)[0m
[31m at org.scalatest.prop.Checkers$class.check(Checkers.scala:115)[0m
[31m at StringSuite.check(StringSuite.scala:6)[0m
[31m at StringSuite$$anonfun$3.apply(StringSuite.scala:17)[0m
[31m at StringSuite$$anonfun$3.apply(StringSuite.scala:17)[0m
[31m at org.scalatest.FunSuite$$anon$2.apply(FunSuite.scala:1158)[0m
[31m at org.scalatest.Suite$class.withFixture(Suite.scala:1509)[0m
[31m at StringSuite.withFixture(StringSuite.scala:6)[0m
[31m at org.scalatest.FunSuite$class.runTest(FunSuite.scala:1155)[0m
[31m at StringSuite.runTest(StringSuite.scala:6)[0m
[31m at org.scalatest.FunSuite$$anonfun$runTests$1.apply(FunSuite.scala:1264)[0m
[31m at org.scalatest.FunSuite$$anonfun$runTests$1.apply(FunSuite.scala:1255)[0m
[31m at scala.List.foreach(List.scala:841)[0m
[31m at org.scalatest.FunSuite$class.runTests(FunSuite.scala:1255)[0m
[31m at StringSuite.runTests(StringSuite.scala:6)[0m
[31m at org.scalatest.Suite$class.run(Suite.scala:1804)[0m
[31m at StringSuite.org$scalatest$FunSuite$$super$run(StringSuite.scala:6)[0m
[31m at org.scalatest.FunSuite$class.run(FunSuite.scala:1304)[0m
[31m at StringSuite.run(StringSuite.scala:6)[0m
[31m at org.scalatest.tools.SuiteRunner.run(SuiteRunner.scala:59)[0m
[31m at org.scalatest.tools.Runner$$anonfun$doRunRunRunADoRunRun$3.apply(Runner.scala:1523)[0m
[31m at org.scalatest.tools.Runner$$anonfun$doRunRunRunADoRunRun$3.apply(Runner.scala:1520)[0m
[31m at scala.List.foreach(List.scala:841)[0m
[31m at org.scalatest.tools.Runner$.doRunRunRunADoRunRun(Runner.scala:1520)[0m
[31m at org.scalatest.tools.Runner$$anonfun$runOptionallyWithPassFailReporter$2.apply(Runner.scala:616)[0m
[31m at org.scalatest.tools.Runner$$anonfun$runOptionallyWithPassFailReporter$2.apply(Runner.scala:615)[0m
[31m at org.scalatest.tools.Runner$.withClassLoaderAndDispatchReporter(Runner.scala:1564)[0m
[31m at org.scalatest.tools.Runner$.runOptionallyWithPassFailReporter(Runner.scala:614)[0m
[31m at org.scalatest.tools.Runner$.run(Runner.scala:517)[0m
[31m at org.scalatest.tools.ScalaTestAntTask.execute(ScalaTestAntTask.scala:267)[0m
[31m at org.apache.tools.ant.UnknownElement.execute(UnknownElement.java:291)[0m
[32mTest Starting - StringSuite: substring2[0m
[32mTest Succeeded - StringSuite: substring2[0m
[32mTest Starting - StringSuite: substring3[0m
[32mTest Succeeded - StringSuite: substring3[0m
[32mSuite Completed - StringSuite[0m
[36mRun completed in 444 milliseconds.[0m
[36mTotal number of tests run: 5[0m
[36mSuites: completed 1, aborted 0[0m
[36mTests: succeeded 4, failed 1, ignored 0, pending 0[0m
[31m*** 1 TEST FAILED ***[0m
.....Specification "MySpecs"
it should
[32m+[0m add
Total for specification "MySpecs":
Finished in 0 second, 93 ms
1 example, 1 expectation, 0 failure, 0 error
.Specification "MySpecs"
it should
[32m+[0m add
Total for specification "MySpecs":
Finished in 0 second, 56 ms
1 example, 1 expectation, 0 failure, 0 error
.Specification "PassingSpecs"
it should
[32m+[0m add
Total for specification "PassingSpecs":
Finished in 0 second, 56 ms
1 example, 1 expectation, 0 failure, 0 error
.Specification "StringSpecs"
empty string should
[31mx[0m have a zero length
'0' is not equal to '1' (StringSpecs.scala:7)
Total for specification "StringSpecs":
Finished in 0 second, 59 ms
1 example, 1 expectation, [31m1 failure[0m, 0 error
........................mkdir -p <http://hudson.zones.apache.org/hudson/job/Buildr-ci-build/ws/tmp/home>
.mkdir -p <http://hudson.zones.apache.org/hudson/job/Buildr-ci-build/ws/tmp/home/.buildr>
.......................
1)
RuntimeError in 'Buildr::Compiler::ExternalJavac should compile a Java project just in the same way javac does externaljavac compiler should include tools.jar dependency'
Failed to compile, see errors above
<http://hudson.zones.apache.org/hudson/job/Buildr-ci-build/ws/lib/buildr/java/external.rb>:43:in `compile'
<http://hudson.zones.apache.org/hudson/job/Buildr-ci-build/ws/lib/buildr/core/compile.rb>:253:in `initialize'
/home/toulmean/buildr-gems/gems/rake-0.8.7/lib/rake.rb:634:in `call'
/home/toulmean/buildr-gems/gems/rake-0.8.7/lib/rake.rb:634:in `execute_without_a_record'
/home/toulmean/buildr-gems/gems/rake-0.8.7/lib/rake.rb:631:in `each'
/home/toulmean/buildr-gems/gems/rake-0.8.7/lib/rake.rb:631:in `execute_without_a_record'
./spec/groovy/../spec_helpers.rb:144:in `execute'
<http://hudson.zones.apache.org/hudson/job/Buildr-ci-build/ws/lib/buildr/core/application.rb>:636:in `invoke_with_call_chain'
/usr/lib/ruby/1.8/monitor.rb:242:in `synchronize'
<http://hudson.zones.apache.org/hudson/job/Buildr-ci-build/ws/lib/buildr/core/application.rb>:622:in `invoke_with_call_chain'
<http://hudson.zones.apache.org/hudson/job/Buildr-ci-build/ws/lib/buildr/core/application.rb>:617:in `invoke'
(eval):70:
/home/toulmean/buildr-gems/gems/rspec-1.2.9/lib/spec/example/example_methods.rb:40:in `instance_eval'
/home/toulmean/buildr-gems/gems/rspec-1.2.9/lib/spec/example/example_methods.rb:40:in `execute'
/usr/lib/ruby/1.8/timeout.rb:53:in `timeout'
/home/toulmean/buildr-gems/gems/rspec-1.2.9/lib/spec/example/example_methods.rb:37:in `execute'
/home/toulmean/buildr-gems/gems/rspec-1.2.9/lib/spec/example/example_group_methods.rb:214:in `run_examples'
/home/toulmean/buildr-gems/gems/rspec-1.2.9/lib/spec/example/example_group_methods.rb:212:in `each'
/home/toulmean/buildr-gems/gems/rspec-1.2.9/lib/spec/example/example_group_methods.rb:212:in `run_examples'
/home/toulmean/buildr-gems/gems/rspec-1.2.9/lib/spec/example/example_group_methods.rb:103:in `run'
/home/toulmean/buildr-gems/gems/rspec-1.2.9/lib/spec/runner/example_group_runner.rb:23:in `run'
/home/toulmean/buildr-gems/gems/rspec-1.2.9/lib/spec/runner/example_group_runner.rb:22:in `each'
/home/toulmean/buildr-gems/gems/rspec-1.2.9/lib/spec/runner/example_group_runner.rb:22:in `run'
/home/toulmean/buildr-gems/gems/rspec-1.2.9/lib/spec/runner/options.rb:151:in `run_examples'
/home/toulmean/buildr-gems/gems/rspec-1.2.9/lib/spec/runner/command_line.rb:9:in `run'
/home/toulmean/buildr-gems/gems/rspec-1.2.9/bin/spec:5:
Finished in 250.093452 seconds
1971 examples, 1 failure
rake aborted!
Command /usr/bin/ruby1.8 -I"lib" "/home/toulmean/buildr-gems/gems/rspec-1.2.9/bin/spec" "spec/groovy/bdd_spec.rb" "spec/groovy/compiler_spec.rb" "spec/addon/drb_spec.rb" "spec/java/commands_spec.rb" "spec/java/external_spec.rb" "spec/java/packaging_spec.rb" "spec/java/tests_spec.rb" "spec/java/bdd_spec.rb" "spec/java/emma_spec.rb" "spec/java/ant_spec.rb" "spec/java/cobertura_spec.rb" "spec/java/compiler_spec.rb" "spec/java/java_spec.rb" "spec/core/compile_spec.rb" "spec/core/common_spec.rb" "spec/core/cc_spec.rb" "spec/core/project_spec.rb" "spec/core/generate_spec.rb" "spec/core/checks_spec.rb" "spec/core/application_spec.rb" "spec/core/util_spec.rb" "spec/core/extension_spec.rb" "spec/core/transport_spec.rb" "spec/core/test_spec.rb" "spec/core/build_spec.rb" "spec/ide/idea7x_spec.rb" "spec/ide/eclipse_spec.rb" "spec/packaging/artifact_spec.rb" "spec/packaging/artifact_namespace_spec.rb" "spec/packaging/packaging_spec.rb" "spec/packaging/archive_spec.rb" "spec/version_requirement_spec.rb" "spec/scala/tests_spec.rb" "spec/scala/bdd_spec.rb" "spec/scala/compiler_spec.rb" --format failing_examples:failed --format html:_reports/specs.html --backtrace --require "/home/toulmean/buildr-gems/gems/ci_reporter-1.6.2/lib/ci/reporter/rake/rspec_loader.rb" --format CI::Reporter::RSpec failed
(See full trace by running task with --trace)
Recording test results
Build failed in Hudson: Buildr-ci-build #44
Posted by Apache Hudson Server <hu...@hudson.zones.apache.org>.
See <http://hudson.zones.apache.org/hudson/job/Buildr-ci-build/44/>
------------------------------------------
[...truncated 522 lines...]
2)
NoMethodError in 'Buildr::CompileTask should attempt to identify compiler'
undefined method `applies_to?' for Buildr::Compiler::ExternalJavac:Class
/home/toulmean/buildr-gems/gems/rspec-1.2.9/lib/spec/mocks/proxy.rb:117:in `__send__'
/home/toulmean/buildr-gems/gems/rspec-1.2.9/lib/spec/mocks/proxy.rb:117:in `message_received'
/home/toulmean/buildr-gems/gems/rspec-1.2.9/lib/spec/mocks/proxy.rb:157:in `applies_to?'
<http://hudson.zones.apache.org/hudson/job/Buildr-ci-build/ws/lib/buildr/core/compile.rb>:388:in `guess_compiler'
/home/toulmean/buildr-gems/gems/rspec-1.2.9/lib/spec/mocks/proxy.rb:156:in `detect'
<http://hudson.zones.apache.org/hudson/job/Buildr-ci-build/ws/lib/buildr/core/compile.rb>:388:in `each'
<http://hudson.zones.apache.org/hudson/job/Buildr-ci-build/ws/lib/buildr/core/compile.rb>:388:in `detect'
<http://hudson.zones.apache.org/hudson/job/Buildr-ci-build/ws/lib/buildr/core/compile.rb>:388:in `guess_compiler'
<http://hudson.zones.apache.org/hudson/job/Buildr-ci-build/ws/lib/buildr/core/compile.rb>:383:in `associate_with'
<http://hudson.zones.apache.org/hudson/job/Buildr-ci-build/ws/lib/buildr/core/compile.rb>:505:in `send'
<http://hudson.zones.apache.org/hudson/job/Buildr-ci-build/ws/lib/buildr/core/compile.rb>:505:
<http://hudson.zones.apache.org/hudson/job/Buildr-ci-build/ws/lib/buildr/core/project.rb>:652:in `call'
<http://hudson.zones.apache.org/hudson/job/Buildr-ci-build/ws/lib/buildr/core/project.rb>:652:in `call_callbacks'
<http://hudson.zones.apache.org/hudson/job/Buildr-ci-build/ws/lib/buildr/core/project.rb>:652:in `each'
<http://hudson.zones.apache.org/hudson/job/Buildr-ci-build/ws/lib/buildr/core/project.rb>:652:in `call_callbacks'
<http://hudson.zones.apache.org/hudson/job/Buildr-ci-build/ws/lib/buildr/core/project.rb>:216:in `send'
<http://hudson.zones.apache.org/hudson/job/Buildr-ci-build/ws/lib/buildr/core/project.rb>:216:in `define'
/home/toulmean/buildr-gems/gems/rake-0.8.7/lib/rake.rb:634:in `call'
/home/toulmean/buildr-gems/gems/rake-0.8.7/lib/rake.rb:634:in `execute_without_a_record'
/home/toulmean/buildr-gems/gems/rake-0.8.7/lib/rake.rb:631:in `each'
/home/toulmean/buildr-gems/gems/rake-0.8.7/lib/rake.rb:631:in `execute_without_a_record'
./spec/groovy/../spec_helpers.rb:144:in `execute'
<http://hudson.zones.apache.org/hudson/job/Buildr-ci-build/ws/lib/buildr/core/project.rb>:636:in `execute'
<http://hudson.zones.apache.org/hudson/job/Buildr-ci-build/ws/lib/buildr/core/application.rb>:146:in `switch_to_namespace'
<http://hudson.zones.apache.org/hudson/job/Buildr-ci-build/ws/lib/buildr/core/project.rb>:635:in `execute'
<http://hudson.zones.apache.org/hudson/job/Buildr-ci-build/ws/lib/buildr/core/application.rb>:636:in `invoke_with_call_chain'
/usr/lib/ruby/1.8/monitor.rb:242:in `synchronize'
<http://hudson.zones.apache.org/hudson/job/Buildr-ci-build/ws/lib/buildr/core/application.rb>:622:in `invoke_with_call_chain'
<http://hudson.zones.apache.org/hudson/job/Buildr-ci-build/ws/lib/buildr/core/application.rb>:617:in `invoke'
./spec/groovy/../spec_helpers.rb:338:in `define'
./spec/groovy/../spec_helpers.rb:338:in `tap'
./spec/groovy/../spec_helpers.rb:338:in `define'
./spec/core/compile_spec.rb:98:
/home/toulmean/buildr-gems/gems/rspec-1.2.9/lib/spec/example/example_methods.rb:40:in `instance_eval'
/home/toulmean/buildr-gems/gems/rspec-1.2.9/lib/spec/example/example_methods.rb:40:in `execute'
/usr/lib/ruby/1.8/timeout.rb:53:in `timeout'
/home/toulmean/buildr-gems/gems/rspec-1.2.9/lib/spec/example/example_methods.rb:37:in `execute'
/home/toulmean/buildr-gems/gems/rspec-1.2.9/lib/spec/example/example_group_methods.rb:214:in `run_examples'
/home/toulmean/buildr-gems/gems/rspec-1.2.9/lib/spec/example/example_group_methods.rb:212:in `each'
/home/toulmean/buildr-gems/gems/rspec-1.2.9/lib/spec/example/example_group_methods.rb:212:in `run_examples'
/home/toulmean/buildr-gems/gems/rspec-1.2.9/lib/spec/example/example_group_methods.rb:103:in `run'
/home/toulmean/buildr-gems/gems/rspec-1.2.9/lib/spec/runner/example_group_runner.rb:23:in `run'
/home/toulmean/buildr-gems/gems/rspec-1.2.9/lib/spec/runner/example_group_runner.rb:22:in `each'
/home/toulmean/buildr-gems/gems/rspec-1.2.9/lib/spec/runner/example_group_runner.rb:22:in `run'
/home/toulmean/buildr-gems/gems/rspec-1.2.9/lib/spec/runner/options.rb:151:in `run_examples'
/home/toulmean/buildr-gems/gems/rspec-1.2.9/lib/spec/runner/command_line.rb:9:in `run'
/home/toulmean/buildr-gems/gems/rspec-1.2.9/bin/spec:5:
3)
NoMethodError in 'Buildr::CompileTask#compiler should attempt to identify compiler if sources are specified'
undefined method `applies_to?' for Buildr::Compiler::ExternalJavac:Class
/home/toulmean/buildr-gems/gems/rspec-1.2.9/lib/spec/mocks/proxy.rb:117:in `__send__'
/home/toulmean/buildr-gems/gems/rspec-1.2.9/lib/spec/mocks/proxy.rb:117:in `message_received'
/home/toulmean/buildr-gems/gems/rspec-1.2.9/lib/spec/mocks/proxy.rb:157:in `applies_to?'
<http://hudson.zones.apache.org/hudson/job/Buildr-ci-build/ws/lib/buildr/core/compile.rb>:388:in `guess_compiler'
/home/toulmean/buildr-gems/gems/rspec-1.2.9/lib/spec/mocks/proxy.rb:156:in `detect'
<http://hudson.zones.apache.org/hudson/job/Buildr-ci-build/ws/lib/buildr/core/compile.rb>:388:in `each'
<http://hudson.zones.apache.org/hudson/job/Buildr-ci-build/ws/lib/buildr/core/compile.rb>:388:in `detect'
<http://hudson.zones.apache.org/hudson/job/Buildr-ci-build/ws/lib/buildr/core/compile.rb>:388:in `guess_compiler'
<http://hudson.zones.apache.org/hudson/job/Buildr-ci-build/ws/lib/buildr/core/compile.rb>:340:in `compiler'
./spec/core/compile_spec.rb:133:
<http://hudson.zones.apache.org/hudson/job/Buildr-ci-build/ws/lib/buildr/core/project.rb>:225:in `instance_exec'
<http://hudson.zones.apache.org/hudson/job/Buildr-ci-build/ws/lib/buildr/core/project.rb>:225:in `define'
/home/toulmean/buildr-gems/gems/rake-0.8.7/lib/rake.rb:636:in `call'
/home/toulmean/buildr-gems/gems/rake-0.8.7/lib/rake.rb:636:in `execute_without_a_record'
/home/toulmean/buildr-gems/gems/rake-0.8.7/lib/rake.rb:631:in `each'
/home/toulmean/buildr-gems/gems/rake-0.8.7/lib/rake.rb:631:in `execute_without_a_record'
./spec/groovy/../spec_helpers.rb:144:in `execute'
<http://hudson.zones.apache.org/hudson/job/Buildr-ci-build/ws/lib/buildr/core/project.rb>:636:in `execute'
<http://hudson.zones.apache.org/hudson/job/Buildr-ci-build/ws/lib/buildr/core/application.rb>:146:in `switch_to_namespace'
<http://hudson.zones.apache.org/hudson/job/Buildr-ci-build/ws/lib/buildr/core/project.rb>:635:in `execute'
<http://hudson.zones.apache.org/hudson/job/Buildr-ci-build/ws/lib/buildr/core/application.rb>:636:in `invoke_with_call_chain'
/usr/lib/ruby/1.8/monitor.rb:242:in `synchronize'
<http://hudson.zones.apache.org/hudson/job/Buildr-ci-build/ws/lib/buildr/core/application.rb>:622:in `invoke_with_call_chain'
<http://hudson.zones.apache.org/hudson/job/Buildr-ci-build/ws/lib/buildr/core/application.rb>:617:in `invoke'
./spec/groovy/../spec_helpers.rb:338:in `define'
./spec/groovy/../spec_helpers.rb:338:in `tap'
./spec/groovy/../spec_helpers.rb:338:in `define'
./spec/core/compile_spec.rb:131:
/home/toulmean/buildr-gems/gems/rspec-1.2.9/lib/spec/example/example_methods.rb:40:in `instance_eval'
/home/toulmean/buildr-gems/gems/rspec-1.2.9/lib/spec/example/example_methods.rb:40:in `execute'
/usr/lib/ruby/1.8/timeout.rb:53:in `timeout'
/home/toulmean/buildr-gems/gems/rspec-1.2.9/lib/spec/example/example_methods.rb:37:in `execute'
/home/toulmean/buildr-gems/gems/rspec-1.2.9/lib/spec/example/example_group_methods.rb:214:in `run_examples'
/home/toulmean/buildr-gems/gems/rspec-1.2.9/lib/spec/example/example_group_methods.rb:212:in `each'
/home/toulmean/buildr-gems/gems/rspec-1.2.9/lib/spec/example/example_group_methods.rb:212:in `run_examples'
/home/toulmean/buildr-gems/gems/rspec-1.2.9/lib/spec/example/example_group_methods.rb:103:in `run'
/home/toulmean/buildr-gems/gems/rspec-1.2.9/lib/spec/runner/example_group_runner.rb:23:in `run'
/home/toulmean/buildr-gems/gems/rspec-1.2.9/lib/spec/runner/example_group_runner.rb:22:in `each'
/home/toulmean/buildr-gems/gems/rspec-1.2.9/lib/spec/runner/example_group_runner.rb:22:in `run'
/home/toulmean/buildr-gems/gems/rspec-1.2.9/lib/spec/runner/options.rb:151:in `run_examples'
/home/toulmean/buildr-gems/gems/rspec-1.2.9/lib/spec/runner/command_line.rb:9:in `run'
/home/toulmean/buildr-gems/gems/rspec-1.2.9/bin/spec:5:
4)
'scala compiler (installed in SCALA_HOME) should compile scala class depending on java class in same project' FAILED
expected true, got false
/home/toulmean/buildr-gems/gems/rspec-1.2.9/lib/spec/expectations/fail_with.rb:41:in `fail_with'
/home/toulmean/buildr-gems/gems/rspec-1.2.9/lib/spec/expectations/handler.rb:21:in `handle_matcher'
/home/toulmean/buildr-gems/gems/rspec-1.2.9/lib/spec/expectations/extensions/kernel.rb:27:in `should'
./spec/scala/compiler_spec.rb:99:
/home/toulmean/buildr-gems/gems/rubyzip-0.9.1/lib/zip/zip.rb:1382:in `open'
./spec/scala/compiler_spec.rb:97:
/home/toulmean/buildr-gems/gems/rspec-1.2.9/lib/spec/example/example_methods.rb:40:in `instance_eval'
/home/toulmean/buildr-gems/gems/rspec-1.2.9/lib/spec/example/example_methods.rb:40:in `execute'
/usr/lib/ruby/1.8/timeout.rb:53:in `timeout'
/home/toulmean/buildr-gems/gems/rspec-1.2.9/lib/spec/example/example_methods.rb:37:in `execute'
/home/toulmean/buildr-gems/gems/rspec-1.2.9/lib/spec/example/example_group_methods.rb:214:in `run_examples'
/home/toulmean/buildr-gems/gems/rspec-1.2.9/lib/spec/example/example_group_methods.rb:212:in `each'
/home/toulmean/buildr-gems/gems/rspec-1.2.9/lib/spec/example/example_group_methods.rb:212:in `run_examples'
/home/toulmean/buildr-gems/gems/rspec-1.2.9/lib/spec/example/example_group_methods.rb:103:in `run'
/home/toulmean/buildr-gems/gems/rspec-1.2.9/lib/spec/runner/example_group_runner.rb:23:in `run'
/home/toulmean/buildr-gems/gems/rspec-1.2.9/lib/spec/runner/example_group_runner.rb:22:in `each'
/home/toulmean/buildr-gems/gems/rspec-1.2.9/lib/spec/runner/example_group_runner.rb:22:in `run'
/home/toulmean/buildr-gems/gems/rspec-1.2.9/lib/spec/runner/options.rb:151:in `run_examples'
/home/toulmean/buildr-gems/gems/rspec-1.2.9/lib/spec/runner/command_line.rb:9:in `run'
/home/toulmean/buildr-gems/gems/rspec-1.2.9/bin/spec:5:
5)
RuntimeError in 'scala compiler (installed in SCALA_HOME) should compile java class depending on scala class in same project'
Failed to compile, see errors above
<http://hudson.zones.apache.org/hudson/job/Buildr-ci-build/ws/lib/buildr/java/compiler.rb>:70:in `compile'
<http://hudson.zones.apache.org/hudson/job/Buildr-ci-build/ws/lib/buildr/core/compile.rb>:247:in `initialize'
/home/toulmean/buildr-gems/gems/rake-0.8.7/lib/rake.rb:634:in `call'
/home/toulmean/buildr-gems/gems/rake-0.8.7/lib/rake.rb:634:in `execute_without_a_record'
/home/toulmean/buildr-gems/gems/rake-0.8.7/lib/rake.rb:631:in `each'
/home/toulmean/buildr-gems/gems/rake-0.8.7/lib/rake.rb:631:in `execute_without_a_record'
./spec/groovy/../spec_helpers.rb:144:in `execute'
<http://hudson.zones.apache.org/hudson/job/Buildr-ci-build/ws/lib/buildr/core/application.rb>:636:in `invoke_with_call_chain'
/usr/lib/ruby/1.8/monitor.rb:242:in `synchronize'
<http://hudson.zones.apache.org/hudson/job/Buildr-ci-build/ws/lib/buildr/core/application.rb>:622:in `invoke_with_call_chain'
/home/toulmean/buildr-gems/gems/rake-0.8.7/lib/rake.rb:607:in `invoke_prerequisites'
/home/toulmean/buildr-gems/gems/rake-0.8.7/lib/rake.rb:604:in `each'
/home/toulmean/buildr-gems/gems/rake-0.8.7/lib/rake.rb:604:in `invoke_prerequisites'
<http://hudson.zones.apache.org/hudson/job/Buildr-ci-build/ws/lib/buildr/core/application.rb>:629:in `invoke_with_call_chain'
/usr/lib/ruby/1.8/monitor.rb:242:in `synchronize'
<http://hudson.zones.apache.org/hudson/job/Buildr-ci-build/ws/lib/buildr/core/application.rb>:622:in `invoke_with_call_chain'
/home/toulmean/buildr-gems/gems/rake-0.8.7/lib/rake.rb:607:in `invoke_prerequisites'
/home/toulmean/buildr-gems/gems/rake-0.8.7/lib/rake.rb:604:in `each'
/home/toulmean/buildr-gems/gems/rake-0.8.7/lib/rake.rb:604:in `invoke_prerequisites'
<http://hudson.zones.apache.org/hudson/job/Buildr-ci-build/ws/lib/buildr/core/application.rb>:629:in `invoke_with_call_chain'
/usr/lib/ruby/1.8/monitor.rb:242:in `synchronize'
<http://hudson.zones.apache.org/hudson/job/Buildr-ci-build/ws/lib/buildr/core/application.rb>:622:in `invoke_with_call_chain'
/home/toulmean/buildr-gems/gems/rake-0.8.7/lib/rake.rb:607:in `invoke_prerequisites'
/home/toulmean/buildr-gems/gems/rake-0.8.7/lib/rake.rb:604:in `each'
/home/toulmean/buildr-gems/gems/rake-0.8.7/lib/rake.rb:604:in `invoke_prerequisites'
<http://hudson.zones.apache.org/hudson/job/Buildr-ci-build/ws/lib/buildr/core/application.rb>:629:in `invoke_with_call_chain'
/usr/lib/ruby/1.8/monitor.rb:242:in `synchronize'
<http://hudson.zones.apache.org/hudson/job/Buildr-ci-build/ws/lib/buildr/core/application.rb>:622:in `invoke_with_call_chain'
<http://hudson.zones.apache.org/hudson/job/Buildr-ci-build/ws/lib/buildr/core/application.rb>:617:in `invoke'
./spec/scala/compiler_spec.rb:109:
/home/toulmean/buildr-gems/gems/rspec-1.2.9/lib/spec/example/example_methods.rb:40:in `instance_eval'
/home/toulmean/buildr-gems/gems/rspec-1.2.9/lib/spec/example/example_methods.rb:40:in `execute'
/usr/lib/ruby/1.8/timeout.rb:53:in `timeout'
/home/toulmean/buildr-gems/gems/rspec-1.2.9/lib/spec/example/example_methods.rb:37:in `execute'
/home/toulmean/buildr-gems/gems/rspec-1.2.9/lib/spec/example/example_group_methods.rb:214:in `run_examples'
/home/toulmean/buildr-gems/gems/rspec-1.2.9/lib/spec/example/example_group_methods.rb:212:in `each'
/home/toulmean/buildr-gems/gems/rspec-1.2.9/lib/spec/example/example_group_methods.rb:212:in `run_examples'
/home/toulmean/buildr-gems/gems/rspec-1.2.9/lib/spec/example/example_group_methods.rb:103:in `run'
/home/toulmean/buildr-gems/gems/rspec-1.2.9/lib/spec/runner/example_group_runner.rb:23:in `run'
/home/toulmean/buildr-gems/gems/rspec-1.2.9/lib/spec/runner/example_group_runner.rb:22:in `each'
/home/toulmean/buildr-gems/gems/rspec-1.2.9/lib/spec/runner/example_group_runner.rb:22:in `run'
/home/toulmean/buildr-gems/gems/rspec-1.2.9/lib/spec/runner/options.rb:151:in `run_examples'
/home/toulmean/buildr-gems/gems/rspec-1.2.9/lib/spec/runner/command_line.rb:9:in `run'
/home/toulmean/buildr-gems/gems/rspec-1.2.9/bin/spec:5:
6)
'scala compiler (downloaded from repository) should compile scala class depending on java class in same project' FAILED
expected true, got false
/home/toulmean/buildr-gems/gems/rspec-1.2.9/lib/spec/expectations/fail_with.rb:41:in `fail_with'
/home/toulmean/buildr-gems/gems/rspec-1.2.9/lib/spec/expectations/handler.rb:21:in `handle_matcher'
/home/toulmean/buildr-gems/gems/rspec-1.2.9/lib/spec/expectations/extensions/kernel.rb:27:in `should'
./spec/scala/compiler_spec.rb:99:
/home/toulmean/buildr-gems/gems/rubyzip-0.9.1/lib/zip/zip.rb:1382:in `open'
./spec/scala/compiler_spec.rb:97:
/home/toulmean/buildr-gems/gems/rspec-1.2.9/lib/spec/example/example_methods.rb:40:in `instance_eval'
/home/toulmean/buildr-gems/gems/rspec-1.2.9/lib/spec/example/example_methods.rb:40:in `execute'
/usr/lib/ruby/1.8/timeout.rb:53:in `timeout'
/home/toulmean/buildr-gems/gems/rspec-1.2.9/lib/spec/example/example_methods.rb:37:in `execute'
/home/toulmean/buildr-gems/gems/rspec-1.2.9/lib/spec/example/example_group_methods.rb:214:in `run_examples'
/home/toulmean/buildr-gems/gems/rspec-1.2.9/lib/spec/example/example_group_methods.rb:212:in `each'
/home/toulmean/buildr-gems/gems/rspec-1.2.9/lib/spec/example/example_group_methods.rb:212:in `run_examples'
/home/toulmean/buildr-gems/gems/rspec-1.2.9/lib/spec/example/example_group_methods.rb:103:in `run'
/home/toulmean/buildr-gems/gems/rspec-1.2.9/lib/spec/runner/example_group_runner.rb:23:in `run'
/home/toulmean/buildr-gems/gems/rspec-1.2.9/lib/spec/runner/example_group_runner.rb:22:in `each'
/home/toulmean/buildr-gems/gems/rspec-1.2.9/lib/spec/runner/example_group_runner.rb:22:in `run'
/home/toulmean/buildr-gems/gems/rspec-1.2.9/lib/spec/runner/options.rb:151:in `run_examples'
/home/toulmean/buildr-gems/gems/rspec-1.2.9/lib/spec/runner/command_line.rb:9:in `run'
/home/toulmean/buildr-gems/gems/rspec-1.2.9/bin/spec:5:
7)
RuntimeError in 'scala compiler (downloaded from repository) should compile java class depending on scala class in same project'
Failed to compile, see errors above
<http://hudson.zones.apache.org/hudson/job/Buildr-ci-build/ws/lib/buildr/java/compiler.rb>:70:in `compile'
<http://hudson.zones.apache.org/hudson/job/Buildr-ci-build/ws/lib/buildr/core/compile.rb>:247:in `initialize'
/home/toulmean/buildr-gems/gems/rake-0.8.7/lib/rake.rb:634:in `call'
/home/toulmean/buildr-gems/gems/rake-0.8.7/lib/rake.rb:634:in `execute_without_a_record'
/home/toulmean/buildr-gems/gems/rake-0.8.7/lib/rake.rb:631:in `each'
/home/toulmean/buildr-gems/gems/rake-0.8.7/lib/rake.rb:631:in `execute_without_a_record'
./spec/groovy/../spec_helpers.rb:144:in `execute'
<http://hudson.zones.apache.org/hudson/job/Buildr-ci-build/ws/lib/buildr/core/application.rb>:636:in `invoke_with_call_chain'
/usr/lib/ruby/1.8/monitor.rb:242:in `synchronize'
<http://hudson.zones.apache.org/hudson/job/Buildr-ci-build/ws/lib/buildr/core/application.rb>:622:in `invoke_with_call_chain'
/home/toulmean/buildr-gems/gems/rake-0.8.7/lib/rake.rb:607:in `invoke_prerequisites'
/home/toulmean/buildr-gems/gems/rake-0.8.7/lib/rake.rb:604:in `each'
/home/toulmean/buildr-gems/gems/rake-0.8.7/lib/rake.rb:604:in `invoke_prerequisites'
<http://hudson.zones.apache.org/hudson/job/Buildr-ci-build/ws/lib/buildr/core/application.rb>:629:in `invoke_with_call_chain'
/usr/lib/ruby/1.8/monitor.rb:242:in `synchronize'
<http://hudson.zones.apache.org/hudson/job/Buildr-ci-build/ws/lib/buildr/core/application.rb>:622:in `invoke_with_call_chain'
/home/toulmean/buildr-gems/gems/rake-0.8.7/lib/rake.rb:607:in `invoke_prerequisites'
/home/toulmean/buildr-gems/gems/rake-0.8.7/lib/rake.rb:604:in `each'
/home/toulmean/buildr-gems/gems/rake-0.8.7/lib/rake.rb:604:in `invoke_prerequisites'
<http://hudson.zones.apache.org/hudson/job/Buildr-ci-build/ws/lib/buildr/core/application.rb>:629:in `invoke_with_call_chain'
/usr/lib/ruby/1.8/monitor.rb:242:in `synchronize'
<http://hudson.zones.apache.org/hudson/job/Buildr-ci-build/ws/lib/buildr/core/application.rb>:622:in `invoke_with_call_chain'
/home/toulmean/buildr-gems/gems/rake-0.8.7/lib/rake.rb:607:in `invoke_prerequisites'
/home/toulmean/buildr-gems/gems/rake-0.8.7/lib/rake.rb:604:in `each'
/home/toulmean/buildr-gems/gems/rake-0.8.7/lib/rake.rb:604:in `invoke_prerequisites'
<http://hudson.zones.apache.org/hudson/job/Buildr-ci-build/ws/lib/buildr/core/application.rb>:629:in `invoke_with_call_chain'
/usr/lib/ruby/1.8/monitor.rb:242:in `synchronize'
<http://hudson.zones.apache.org/hudson/job/Buildr-ci-build/ws/lib/buildr/core/application.rb>:622:in `invoke_with_call_chain'
<http://hudson.zones.apache.org/hudson/job/Buildr-ci-build/ws/lib/buildr/core/application.rb>:617:in `invoke'
./spec/scala/compiler_spec.rb:109:
/home/toulmean/buildr-gems/gems/rspec-1.2.9/lib/spec/example/example_methods.rb:40:in `instance_eval'
/home/toulmean/buildr-gems/gems/rspec-1.2.9/lib/spec/example/example_methods.rb:40:in `execute'
/usr/lib/ruby/1.8/timeout.rb:53:in `timeout'
/home/toulmean/buildr-gems/gems/rspec-1.2.9/lib/spec/example/example_methods.rb:37:in `execute'
/home/toulmean/buildr-gems/gems/rspec-1.2.9/lib/spec/example/example_group_methods.rb:214:in `run_examples'
/home/toulmean/buildr-gems/gems/rspec-1.2.9/lib/spec/example/example_group_methods.rb:212:in `each'
/home/toulmean/buildr-gems/gems/rspec-1.2.9/lib/spec/example/example_group_methods.rb:212:in `run_examples'
/home/toulmean/buildr-gems/gems/rspec-1.2.9/lib/spec/example/example_group_methods.rb:103:in `run'
/home/toulmean/buildr-gems/gems/rspec-1.2.9/lib/spec/runner/example_group_runner.rb:23:in `run'
/home/toulmean/buildr-gems/gems/rspec-1.2.9/lib/spec/runner/example_group_runner.rb:22:in `each'
/home/toulmean/buildr-gems/gems/rspec-1.2.9/lib/spec/runner/example_group_runner.rb:22:in `run'
/home/toulmean/buildr-gems/gems/rspec-1.2.9/lib/spec/runner/options.rb:151:in `run_examples'
/home/toulmean/buildr-gems/gems/rspec-1.2.9/lib/spec/runner/command_line.rb:9:in `run'
/home/toulmean/buildr-gems/gems/rspec-1.2.9/bin/spec:5:
Finished in 246.962033 seconds
1971 examples, 7 failures
rake aborted!
Command /usr/bin/ruby1.8 -I"lib" "/home/toulmean/buildr-gems/gems/rspec-1.2.9/bin/spec" "spec/groovy/bdd_spec.rb" "spec/groovy/compiler_spec.rb" "spec/addon/drb_spec.rb" "spec/java/commands_spec.rb" "spec/java/external_spec.rb" "spec/java/packaging_spec.rb" "spec/java/tests_spec.rb" "spec/java/bdd_spec.rb" "spec/java/emma_spec.rb" "spec/java/ant_spec.rb" "spec/java/cobertura_spec.rb" "spec/java/compiler_spec.rb" "spec/java/java_spec.rb" "spec/core/compile_spec.rb" "spec/core/common_spec.rb" "spec/core/cc_spec.rb" "spec/core/project_spec.rb" "spec/core/generate_spec.rb" "spec/core/checks_spec.rb" "spec/core/application_spec.rb" "spec/core/util_spec.rb" "spec/core/extension_spec.rb" "spec/core/transport_spec.rb" "spec/core/test_spec.rb" "spec/core/build_spec.rb" "spec/ide/idea7x_spec.rb" "spec/ide/eclipse_spec.rb" "spec/packaging/artifact_spec.rb" "spec/packaging/artifact_namespace_spec.rb" "spec/packaging/packaging_spec.rb" "spec/packaging/archive_spec.rb" "spec/version_requirement_spec.rb" "spec/scala/tests_spec.rb" "spec/scala/bdd_spec.rb" "spec/scala/compiler_spec.rb" --format failing_examples:failed --format html:_reports/specs.html --backtrace --require "/home/toulmean/buildr-gems/gems/ci_reporter-1.6.2/lib/ci/reporter/rake/rspec_loader.rb" --format CI::Reporter::RSpec failed
(See full trace by running task with --trace)
Recording test results
Build failed in Hudson: Buildr-ci-build #43
Posted by Apache Hudson Server <hu...@hudson.zones.apache.org>.
See <http://hudson.zones.apache.org/hudson/job/Buildr-ci-build/43/changes>
Changes:
[toulmean] put back trax
------------------------------------------
[...truncated 522 lines...]
2)
NoMethodError in 'Buildr::CompileTask should attempt to identify compiler'
undefined method `applies_to?' for Buildr::Compiler::ExternalJavac:Class
/home/toulmean/buildr-gems/gems/rspec-1.2.9/lib/spec/mocks/proxy.rb:117:in `__send__'
/home/toulmean/buildr-gems/gems/rspec-1.2.9/lib/spec/mocks/proxy.rb:117:in `message_received'
/home/toulmean/buildr-gems/gems/rspec-1.2.9/lib/spec/mocks/proxy.rb:157:in `applies_to?'
<http://hudson.zones.apache.org/hudson/job/Buildr-ci-build/ws/lib/buildr/core/compile.rb>:388:in `guess_compiler'
/home/toulmean/buildr-gems/gems/rspec-1.2.9/lib/spec/mocks/proxy.rb:156:in `detect'
<http://hudson.zones.apache.org/hudson/job/Buildr-ci-build/ws/lib/buildr/core/compile.rb>:388:in `each'
<http://hudson.zones.apache.org/hudson/job/Buildr-ci-build/ws/lib/buildr/core/compile.rb>:388:in `detect'
<http://hudson.zones.apache.org/hudson/job/Buildr-ci-build/ws/lib/buildr/core/compile.rb>:388:in `guess_compiler'
<http://hudson.zones.apache.org/hudson/job/Buildr-ci-build/ws/lib/buildr/core/compile.rb>:383:in `associate_with'
<http://hudson.zones.apache.org/hudson/job/Buildr-ci-build/ws/lib/buildr/core/compile.rb>:505:in `send'
<http://hudson.zones.apache.org/hudson/job/Buildr-ci-build/ws/lib/buildr/core/compile.rb>:505:
<http://hudson.zones.apache.org/hudson/job/Buildr-ci-build/ws/lib/buildr/core/project.rb>:652:in `call'
<http://hudson.zones.apache.org/hudson/job/Buildr-ci-build/ws/lib/buildr/core/project.rb>:652:in `call_callbacks'
<http://hudson.zones.apache.org/hudson/job/Buildr-ci-build/ws/lib/buildr/core/project.rb>:652:in `each'
<http://hudson.zones.apache.org/hudson/job/Buildr-ci-build/ws/lib/buildr/core/project.rb>:652:in `call_callbacks'
<http://hudson.zones.apache.org/hudson/job/Buildr-ci-build/ws/lib/buildr/core/project.rb>:216:in `send'
<http://hudson.zones.apache.org/hudson/job/Buildr-ci-build/ws/lib/buildr/core/project.rb>:216:in `define'
/home/toulmean/buildr-gems/gems/rake-0.8.7/lib/rake.rb:634:in `call'
/home/toulmean/buildr-gems/gems/rake-0.8.7/lib/rake.rb:634:in `execute_without_a_record'
/home/toulmean/buildr-gems/gems/rake-0.8.7/lib/rake.rb:631:in `each'
/home/toulmean/buildr-gems/gems/rake-0.8.7/lib/rake.rb:631:in `execute_without_a_record'
./spec/groovy/../spec_helpers.rb:144:in `execute'
<http://hudson.zones.apache.org/hudson/job/Buildr-ci-build/ws/lib/buildr/core/project.rb>:636:in `execute'
<http://hudson.zones.apache.org/hudson/job/Buildr-ci-build/ws/lib/buildr/core/application.rb>:146:in `switch_to_namespace'
<http://hudson.zones.apache.org/hudson/job/Buildr-ci-build/ws/lib/buildr/core/project.rb>:635:in `execute'
<http://hudson.zones.apache.org/hudson/job/Buildr-ci-build/ws/lib/buildr/core/application.rb>:636:in `invoke_with_call_chain'
/usr/lib/ruby/1.8/monitor.rb:242:in `synchronize'
<http://hudson.zones.apache.org/hudson/job/Buildr-ci-build/ws/lib/buildr/core/application.rb>:622:in `invoke_with_call_chain'
<http://hudson.zones.apache.org/hudson/job/Buildr-ci-build/ws/lib/buildr/core/application.rb>:617:in `invoke'
./spec/groovy/../spec_helpers.rb:338:in `define'
./spec/groovy/../spec_helpers.rb:338:in `tap'
./spec/groovy/../spec_helpers.rb:338:in `define'
./spec/core/compile_spec.rb:98:
/home/toulmean/buildr-gems/gems/rspec-1.2.9/lib/spec/example/example_methods.rb:40:in `instance_eval'
/home/toulmean/buildr-gems/gems/rspec-1.2.9/lib/spec/example/example_methods.rb:40:in `execute'
/usr/lib/ruby/1.8/timeout.rb:53:in `timeout'
/home/toulmean/buildr-gems/gems/rspec-1.2.9/lib/spec/example/example_methods.rb:37:in `execute'
/home/toulmean/buildr-gems/gems/rspec-1.2.9/lib/spec/example/example_group_methods.rb:214:in `run_examples'
/home/toulmean/buildr-gems/gems/rspec-1.2.9/lib/spec/example/example_group_methods.rb:212:in `each'
/home/toulmean/buildr-gems/gems/rspec-1.2.9/lib/spec/example/example_group_methods.rb:212:in `run_examples'
/home/toulmean/buildr-gems/gems/rspec-1.2.9/lib/spec/example/example_group_methods.rb:103:in `run'
/home/toulmean/buildr-gems/gems/rspec-1.2.9/lib/spec/runner/example_group_runner.rb:23:in `run'
/home/toulmean/buildr-gems/gems/rspec-1.2.9/lib/spec/runner/example_group_runner.rb:22:in `each'
/home/toulmean/buildr-gems/gems/rspec-1.2.9/lib/spec/runner/example_group_runner.rb:22:in `run'
/home/toulmean/buildr-gems/gems/rspec-1.2.9/lib/spec/runner/options.rb:151:in `run_examples'
/home/toulmean/buildr-gems/gems/rspec-1.2.9/lib/spec/runner/command_line.rb:9:in `run'
/home/toulmean/buildr-gems/gems/rspec-1.2.9/bin/spec:5:
3)
NoMethodError in 'Buildr::CompileTask#compiler should attempt to identify compiler if sources are specified'
undefined method `applies_to?' for Buildr::Compiler::ExternalJavac:Class
/home/toulmean/buildr-gems/gems/rspec-1.2.9/lib/spec/mocks/proxy.rb:117:in `__send__'
/home/toulmean/buildr-gems/gems/rspec-1.2.9/lib/spec/mocks/proxy.rb:117:in `message_received'
/home/toulmean/buildr-gems/gems/rspec-1.2.9/lib/spec/mocks/proxy.rb:157:in `applies_to?'
<http://hudson.zones.apache.org/hudson/job/Buildr-ci-build/ws/lib/buildr/core/compile.rb>:388:in `guess_compiler'
/home/toulmean/buildr-gems/gems/rspec-1.2.9/lib/spec/mocks/proxy.rb:156:in `detect'
<http://hudson.zones.apache.org/hudson/job/Buildr-ci-build/ws/lib/buildr/core/compile.rb>:388:in `each'
<http://hudson.zones.apache.org/hudson/job/Buildr-ci-build/ws/lib/buildr/core/compile.rb>:388:in `detect'
<http://hudson.zones.apache.org/hudson/job/Buildr-ci-build/ws/lib/buildr/core/compile.rb>:388:in `guess_compiler'
<http://hudson.zones.apache.org/hudson/job/Buildr-ci-build/ws/lib/buildr/core/compile.rb>:340:in `compiler'
./spec/core/compile_spec.rb:133:
<http://hudson.zones.apache.org/hudson/job/Buildr-ci-build/ws/lib/buildr/core/project.rb>:225:in `instance_exec'
<http://hudson.zones.apache.org/hudson/job/Buildr-ci-build/ws/lib/buildr/core/project.rb>:225:in `define'
/home/toulmean/buildr-gems/gems/rake-0.8.7/lib/rake.rb:636:in `call'
/home/toulmean/buildr-gems/gems/rake-0.8.7/lib/rake.rb:636:in `execute_without_a_record'
/home/toulmean/buildr-gems/gems/rake-0.8.7/lib/rake.rb:631:in `each'
/home/toulmean/buildr-gems/gems/rake-0.8.7/lib/rake.rb:631:in `execute_without_a_record'
./spec/groovy/../spec_helpers.rb:144:in `execute'
<http://hudson.zones.apache.org/hudson/job/Buildr-ci-build/ws/lib/buildr/core/project.rb>:636:in `execute'
<http://hudson.zones.apache.org/hudson/job/Buildr-ci-build/ws/lib/buildr/core/application.rb>:146:in `switch_to_namespace'
<http://hudson.zones.apache.org/hudson/job/Buildr-ci-build/ws/lib/buildr/core/project.rb>:635:in `execute'
<http://hudson.zones.apache.org/hudson/job/Buildr-ci-build/ws/lib/buildr/core/application.rb>:636:in `invoke_with_call_chain'
/usr/lib/ruby/1.8/monitor.rb:242:in `synchronize'
<http://hudson.zones.apache.org/hudson/job/Buildr-ci-build/ws/lib/buildr/core/application.rb>:622:in `invoke_with_call_chain'
<http://hudson.zones.apache.org/hudson/job/Buildr-ci-build/ws/lib/buildr/core/application.rb>:617:in `invoke'
./spec/groovy/../spec_helpers.rb:338:in `define'
./spec/groovy/../spec_helpers.rb:338:in `tap'
./spec/groovy/../spec_helpers.rb:338:in `define'
./spec/core/compile_spec.rb:131:
/home/toulmean/buildr-gems/gems/rspec-1.2.9/lib/spec/example/example_methods.rb:40:in `instance_eval'
/home/toulmean/buildr-gems/gems/rspec-1.2.9/lib/spec/example/example_methods.rb:40:in `execute'
/usr/lib/ruby/1.8/timeout.rb:53:in `timeout'
/home/toulmean/buildr-gems/gems/rspec-1.2.9/lib/spec/example/example_methods.rb:37:in `execute'
/home/toulmean/buildr-gems/gems/rspec-1.2.9/lib/spec/example/example_group_methods.rb:214:in `run_examples'
/home/toulmean/buildr-gems/gems/rspec-1.2.9/lib/spec/example/example_group_methods.rb:212:in `each'
/home/toulmean/buildr-gems/gems/rspec-1.2.9/lib/spec/example/example_group_methods.rb:212:in `run_examples'
/home/toulmean/buildr-gems/gems/rspec-1.2.9/lib/spec/example/example_group_methods.rb:103:in `run'
/home/toulmean/buildr-gems/gems/rspec-1.2.9/lib/spec/runner/example_group_runner.rb:23:in `run'
/home/toulmean/buildr-gems/gems/rspec-1.2.9/lib/spec/runner/example_group_runner.rb:22:in `each'
/home/toulmean/buildr-gems/gems/rspec-1.2.9/lib/spec/runner/example_group_runner.rb:22:in `run'
/home/toulmean/buildr-gems/gems/rspec-1.2.9/lib/spec/runner/options.rb:151:in `run_examples'
/home/toulmean/buildr-gems/gems/rspec-1.2.9/lib/spec/runner/command_line.rb:9:in `run'
/home/toulmean/buildr-gems/gems/rspec-1.2.9/bin/spec:5:
4)
'scala compiler (installed in SCALA_HOME) should compile scala class depending on java class in same project' FAILED
expected true, got false
/home/toulmean/buildr-gems/gems/rspec-1.2.9/lib/spec/expectations/fail_with.rb:41:in `fail_with'
/home/toulmean/buildr-gems/gems/rspec-1.2.9/lib/spec/expectations/handler.rb:21:in `handle_matcher'
/home/toulmean/buildr-gems/gems/rspec-1.2.9/lib/spec/expectations/extensions/kernel.rb:27:in `should'
./spec/scala/compiler_spec.rb:99:
/home/toulmean/buildr-gems/gems/rubyzip-0.9.1/lib/zip/zip.rb:1382:in `open'
./spec/scala/compiler_spec.rb:97:
/home/toulmean/buildr-gems/gems/rspec-1.2.9/lib/spec/example/example_methods.rb:40:in `instance_eval'
/home/toulmean/buildr-gems/gems/rspec-1.2.9/lib/spec/example/example_methods.rb:40:in `execute'
/usr/lib/ruby/1.8/timeout.rb:53:in `timeout'
/home/toulmean/buildr-gems/gems/rspec-1.2.9/lib/spec/example/example_methods.rb:37:in `execute'
/home/toulmean/buildr-gems/gems/rspec-1.2.9/lib/spec/example/example_group_methods.rb:214:in `run_examples'
/home/toulmean/buildr-gems/gems/rspec-1.2.9/lib/spec/example/example_group_methods.rb:212:in `each'
/home/toulmean/buildr-gems/gems/rspec-1.2.9/lib/spec/example/example_group_methods.rb:212:in `run_examples'
/home/toulmean/buildr-gems/gems/rspec-1.2.9/lib/spec/example/example_group_methods.rb:103:in `run'
/home/toulmean/buildr-gems/gems/rspec-1.2.9/lib/spec/runner/example_group_runner.rb:23:in `run'
/home/toulmean/buildr-gems/gems/rspec-1.2.9/lib/spec/runner/example_group_runner.rb:22:in `each'
/home/toulmean/buildr-gems/gems/rspec-1.2.9/lib/spec/runner/example_group_runner.rb:22:in `run'
/home/toulmean/buildr-gems/gems/rspec-1.2.9/lib/spec/runner/options.rb:151:in `run_examples'
/home/toulmean/buildr-gems/gems/rspec-1.2.9/lib/spec/runner/command_line.rb:9:in `run'
/home/toulmean/buildr-gems/gems/rspec-1.2.9/bin/spec:5:
5)
RuntimeError in 'scala compiler (installed in SCALA_HOME) should compile java class depending on scala class in same project'
Failed to compile, see errors above
<http://hudson.zones.apache.org/hudson/job/Buildr-ci-build/ws/lib/buildr/java/compiler.rb>:70:in `compile'
<http://hudson.zones.apache.org/hudson/job/Buildr-ci-build/ws/lib/buildr/core/compile.rb>:247:in `initialize'
/home/toulmean/buildr-gems/gems/rake-0.8.7/lib/rake.rb:634:in `call'
/home/toulmean/buildr-gems/gems/rake-0.8.7/lib/rake.rb:634:in `execute_without_a_record'
/home/toulmean/buildr-gems/gems/rake-0.8.7/lib/rake.rb:631:in `each'
/home/toulmean/buildr-gems/gems/rake-0.8.7/lib/rake.rb:631:in `execute_without_a_record'
./spec/groovy/../spec_helpers.rb:144:in `execute'
<http://hudson.zones.apache.org/hudson/job/Buildr-ci-build/ws/lib/buildr/core/application.rb>:636:in `invoke_with_call_chain'
/usr/lib/ruby/1.8/monitor.rb:242:in `synchronize'
<http://hudson.zones.apache.org/hudson/job/Buildr-ci-build/ws/lib/buildr/core/application.rb>:622:in `invoke_with_call_chain'
/home/toulmean/buildr-gems/gems/rake-0.8.7/lib/rake.rb:607:in `invoke_prerequisites'
/home/toulmean/buildr-gems/gems/rake-0.8.7/lib/rake.rb:604:in `each'
/home/toulmean/buildr-gems/gems/rake-0.8.7/lib/rake.rb:604:in `invoke_prerequisites'
<http://hudson.zones.apache.org/hudson/job/Buildr-ci-build/ws/lib/buildr/core/application.rb>:629:in `invoke_with_call_chain'
/usr/lib/ruby/1.8/monitor.rb:242:in `synchronize'
<http://hudson.zones.apache.org/hudson/job/Buildr-ci-build/ws/lib/buildr/core/application.rb>:622:in `invoke_with_call_chain'
/home/toulmean/buildr-gems/gems/rake-0.8.7/lib/rake.rb:607:in `invoke_prerequisites'
/home/toulmean/buildr-gems/gems/rake-0.8.7/lib/rake.rb:604:in `each'
/home/toulmean/buildr-gems/gems/rake-0.8.7/lib/rake.rb:604:in `invoke_prerequisites'
<http://hudson.zones.apache.org/hudson/job/Buildr-ci-build/ws/lib/buildr/core/application.rb>:629:in `invoke_with_call_chain'
/usr/lib/ruby/1.8/monitor.rb:242:in `synchronize'
<http://hudson.zones.apache.org/hudson/job/Buildr-ci-build/ws/lib/buildr/core/application.rb>:622:in `invoke_with_call_chain'
/home/toulmean/buildr-gems/gems/rake-0.8.7/lib/rake.rb:607:in `invoke_prerequisites'
/home/toulmean/buildr-gems/gems/rake-0.8.7/lib/rake.rb:604:in `each'
/home/toulmean/buildr-gems/gems/rake-0.8.7/lib/rake.rb:604:in `invoke_prerequisites'
<http://hudson.zones.apache.org/hudson/job/Buildr-ci-build/ws/lib/buildr/core/application.rb>:629:in `invoke_with_call_chain'
/usr/lib/ruby/1.8/monitor.rb:242:in `synchronize'
<http://hudson.zones.apache.org/hudson/job/Buildr-ci-build/ws/lib/buildr/core/application.rb>:622:in `invoke_with_call_chain'
<http://hudson.zones.apache.org/hudson/job/Buildr-ci-build/ws/lib/buildr/core/application.rb>:617:in `invoke'
./spec/scala/compiler_spec.rb:109:
/home/toulmean/buildr-gems/gems/rspec-1.2.9/lib/spec/example/example_methods.rb:40:in `instance_eval'
/home/toulmean/buildr-gems/gems/rspec-1.2.9/lib/spec/example/example_methods.rb:40:in `execute'
/usr/lib/ruby/1.8/timeout.rb:53:in `timeout'
/home/toulmean/buildr-gems/gems/rspec-1.2.9/lib/spec/example/example_methods.rb:37:in `execute'
/home/toulmean/buildr-gems/gems/rspec-1.2.9/lib/spec/example/example_group_methods.rb:214:in `run_examples'
/home/toulmean/buildr-gems/gems/rspec-1.2.9/lib/spec/example/example_group_methods.rb:212:in `each'
/home/toulmean/buildr-gems/gems/rspec-1.2.9/lib/spec/example/example_group_methods.rb:212:in `run_examples'
/home/toulmean/buildr-gems/gems/rspec-1.2.9/lib/spec/example/example_group_methods.rb:103:in `run'
/home/toulmean/buildr-gems/gems/rspec-1.2.9/lib/spec/runner/example_group_runner.rb:23:in `run'
/home/toulmean/buildr-gems/gems/rspec-1.2.9/lib/spec/runner/example_group_runner.rb:22:in `each'
/home/toulmean/buildr-gems/gems/rspec-1.2.9/lib/spec/runner/example_group_runner.rb:22:in `run'
/home/toulmean/buildr-gems/gems/rspec-1.2.9/lib/spec/runner/options.rb:151:in `run_examples'
/home/toulmean/buildr-gems/gems/rspec-1.2.9/lib/spec/runner/command_line.rb:9:in `run'
/home/toulmean/buildr-gems/gems/rspec-1.2.9/bin/spec:5:
6)
'scala compiler (downloaded from repository) should compile scala class depending on java class in same project' FAILED
expected true, got false
/home/toulmean/buildr-gems/gems/rspec-1.2.9/lib/spec/expectations/fail_with.rb:41:in `fail_with'
/home/toulmean/buildr-gems/gems/rspec-1.2.9/lib/spec/expectations/handler.rb:21:in `handle_matcher'
/home/toulmean/buildr-gems/gems/rspec-1.2.9/lib/spec/expectations/extensions/kernel.rb:27:in `should'
./spec/scala/compiler_spec.rb:99:
/home/toulmean/buildr-gems/gems/rubyzip-0.9.1/lib/zip/zip.rb:1382:in `open'
./spec/scala/compiler_spec.rb:97:
/home/toulmean/buildr-gems/gems/rspec-1.2.9/lib/spec/example/example_methods.rb:40:in `instance_eval'
/home/toulmean/buildr-gems/gems/rspec-1.2.9/lib/spec/example/example_methods.rb:40:in `execute'
/usr/lib/ruby/1.8/timeout.rb:53:in `timeout'
/home/toulmean/buildr-gems/gems/rspec-1.2.9/lib/spec/example/example_methods.rb:37:in `execute'
/home/toulmean/buildr-gems/gems/rspec-1.2.9/lib/spec/example/example_group_methods.rb:214:in `run_examples'
/home/toulmean/buildr-gems/gems/rspec-1.2.9/lib/spec/example/example_group_methods.rb:212:in `each'
/home/toulmean/buildr-gems/gems/rspec-1.2.9/lib/spec/example/example_group_methods.rb:212:in `run_examples'
/home/toulmean/buildr-gems/gems/rspec-1.2.9/lib/spec/example/example_group_methods.rb:103:in `run'
/home/toulmean/buildr-gems/gems/rspec-1.2.9/lib/spec/runner/example_group_runner.rb:23:in `run'
/home/toulmean/buildr-gems/gems/rspec-1.2.9/lib/spec/runner/example_group_runner.rb:22:in `each'
/home/toulmean/buildr-gems/gems/rspec-1.2.9/lib/spec/runner/example_group_runner.rb:22:in `run'
/home/toulmean/buildr-gems/gems/rspec-1.2.9/lib/spec/runner/options.rb:151:in `run_examples'
/home/toulmean/buildr-gems/gems/rspec-1.2.9/lib/spec/runner/command_line.rb:9:in `run'
/home/toulmean/buildr-gems/gems/rspec-1.2.9/bin/spec:5:
7)
RuntimeError in 'scala compiler (downloaded from repository) should compile java class depending on scala class in same project'
Failed to compile, see errors above
<http://hudson.zones.apache.org/hudson/job/Buildr-ci-build/ws/lib/buildr/java/compiler.rb>:70:in `compile'
<http://hudson.zones.apache.org/hudson/job/Buildr-ci-build/ws/lib/buildr/core/compile.rb>:247:in `initialize'
/home/toulmean/buildr-gems/gems/rake-0.8.7/lib/rake.rb:634:in `call'
/home/toulmean/buildr-gems/gems/rake-0.8.7/lib/rake.rb:634:in `execute_without_a_record'
/home/toulmean/buildr-gems/gems/rake-0.8.7/lib/rake.rb:631:in `each'
/home/toulmean/buildr-gems/gems/rake-0.8.7/lib/rake.rb:631:in `execute_without_a_record'
./spec/groovy/../spec_helpers.rb:144:in `execute'
<http://hudson.zones.apache.org/hudson/job/Buildr-ci-build/ws/lib/buildr/core/application.rb>:636:in `invoke_with_call_chain'
/usr/lib/ruby/1.8/monitor.rb:242:in `synchronize'
<http://hudson.zones.apache.org/hudson/job/Buildr-ci-build/ws/lib/buildr/core/application.rb>:622:in `invoke_with_call_chain'
/home/toulmean/buildr-gems/gems/rake-0.8.7/lib/rake.rb:607:in `invoke_prerequisites'
/home/toulmean/buildr-gems/gems/rake-0.8.7/lib/rake.rb:604:in `each'
/home/toulmean/buildr-gems/gems/rake-0.8.7/lib/rake.rb:604:in `invoke_prerequisites'
<http://hudson.zones.apache.org/hudson/job/Buildr-ci-build/ws/lib/buildr/core/application.rb>:629:in `invoke_with_call_chain'
/usr/lib/ruby/1.8/monitor.rb:242:in `synchronize'
<http://hudson.zones.apache.org/hudson/job/Buildr-ci-build/ws/lib/buildr/core/application.rb>:622:in `invoke_with_call_chain'
/home/toulmean/buildr-gems/gems/rake-0.8.7/lib/rake.rb:607:in `invoke_prerequisites'
/home/toulmean/buildr-gems/gems/rake-0.8.7/lib/rake.rb:604:in `each'
/home/toulmean/buildr-gems/gems/rake-0.8.7/lib/rake.rb:604:in `invoke_prerequisites'
<http://hudson.zones.apache.org/hudson/job/Buildr-ci-build/ws/lib/buildr/core/application.rb>:629:in `invoke_with_call_chain'
/usr/lib/ruby/1.8/monitor.rb:242:in `synchronize'
<http://hudson.zones.apache.org/hudson/job/Buildr-ci-build/ws/lib/buildr/core/application.rb>:622:in `invoke_with_call_chain'
/home/toulmean/buildr-gems/gems/rake-0.8.7/lib/rake.rb:607:in `invoke_prerequisites'
/home/toulmean/buildr-gems/gems/rake-0.8.7/lib/rake.rb:604:in `each'
/home/toulmean/buildr-gems/gems/rake-0.8.7/lib/rake.rb:604:in `invoke_prerequisites'
<http://hudson.zones.apache.org/hudson/job/Buildr-ci-build/ws/lib/buildr/core/application.rb>:629:in `invoke_with_call_chain'
/usr/lib/ruby/1.8/monitor.rb:242:in `synchronize'
<http://hudson.zones.apache.org/hudson/job/Buildr-ci-build/ws/lib/buildr/core/application.rb>:622:in `invoke_with_call_chain'
<http://hudson.zones.apache.org/hudson/job/Buildr-ci-build/ws/lib/buildr/core/application.rb>:617:in `invoke'
./spec/scala/compiler_spec.rb:109:
/home/toulmean/buildr-gems/gems/rspec-1.2.9/lib/spec/example/example_methods.rb:40:in `instance_eval'
/home/toulmean/buildr-gems/gems/rspec-1.2.9/lib/spec/example/example_methods.rb:40:in `execute'
/usr/lib/ruby/1.8/timeout.rb:53:in `timeout'
/home/toulmean/buildr-gems/gems/rspec-1.2.9/lib/spec/example/example_methods.rb:37:in `execute'
/home/toulmean/buildr-gems/gems/rspec-1.2.9/lib/spec/example/example_group_methods.rb:214:in `run_examples'
/home/toulmean/buildr-gems/gems/rspec-1.2.9/lib/spec/example/example_group_methods.rb:212:in `each'
/home/toulmean/buildr-gems/gems/rspec-1.2.9/lib/spec/example/example_group_methods.rb:212:in `run_examples'
/home/toulmean/buildr-gems/gems/rspec-1.2.9/lib/spec/example/example_group_methods.rb:103:in `run'
/home/toulmean/buildr-gems/gems/rspec-1.2.9/lib/spec/runner/example_group_runner.rb:23:in `run'
/home/toulmean/buildr-gems/gems/rspec-1.2.9/lib/spec/runner/example_group_runner.rb:22:in `each'
/home/toulmean/buildr-gems/gems/rspec-1.2.9/lib/spec/runner/example_group_runner.rb:22:in `run'
/home/toulmean/buildr-gems/gems/rspec-1.2.9/lib/spec/runner/options.rb:151:in `run_examples'
/home/toulmean/buildr-gems/gems/rspec-1.2.9/lib/spec/runner/command_line.rb:9:in `run'
/home/toulmean/buildr-gems/gems/rspec-1.2.9/bin/spec:5:
Finished in 236.13211 seconds
1971 examples, 7 failures
rake aborted!
Command /usr/bin/ruby1.8 -I"lib" "/home/toulmean/buildr-gems/gems/rspec-1.2.9/bin/spec" "spec/groovy/bdd_spec.rb" "spec/groovy/compiler_spec.rb" "spec/addon/drb_spec.rb" "spec/java/commands_spec.rb" "spec/java/external_spec.rb" "spec/java/packaging_spec.rb" "spec/java/tests_spec.rb" "spec/java/bdd_spec.rb" "spec/java/emma_spec.rb" "spec/java/ant_spec.rb" "spec/java/cobertura_spec.rb" "spec/java/compiler_spec.rb" "spec/java/java_spec.rb" "spec/core/compile_spec.rb" "spec/core/common_spec.rb" "spec/core/cc_spec.rb" "spec/core/project_spec.rb" "spec/core/generate_spec.rb" "spec/core/checks_spec.rb" "spec/core/application_spec.rb" "spec/core/util_spec.rb" "spec/core/extension_spec.rb" "spec/core/transport_spec.rb" "spec/core/test_spec.rb" "spec/core/build_spec.rb" "spec/ide/idea7x_spec.rb" "spec/ide/eclipse_spec.rb" "spec/packaging/artifact_spec.rb" "spec/packaging/artifact_namespace_spec.rb" "spec/packaging/packaging_spec.rb" "spec/packaging/archive_spec.rb" "spec/version_requirement_spec.rb" "spec/scala/tests_spec.rb" "spec/scala/bdd_spec.rb" "spec/scala/compiler_spec.rb" --format failing_examples:failed --format html:_reports/specs.html --backtrace --require "/home/toulmean/buildr-gems/gems/ci_reporter-1.6.2/lib/ci/reporter/rake/rspec_loader.rb" --format CI::Reporter::RSpec failed
(See full trace by running task with --trace)
Recording test results
Build failed in Hudson: Buildr-ci-build #42
Posted by Apache Hudson Server <hu...@hudson.zones.apache.org>.
See <http://hudson.zones.apache.org/hudson/job/Buildr-ci-build/42/changes>
Changes:
[toulmean] fixing spec env, messed up by the external compiler spec
------------------------------------------
[...truncated 802 lines...]
7)
NoMethodError in 'Buildr::CompileTask should attempt to identify compiler'
undefined method `applies_to?' for Buildr::Compiler::ExternalJavac:Class
/home/toulmean/buildr-gems/gems/rspec-1.2.9/lib/spec/mocks/proxy.rb:117:in `__send__'
/home/toulmean/buildr-gems/gems/rspec-1.2.9/lib/spec/mocks/proxy.rb:117:in `message_received'
/home/toulmean/buildr-gems/gems/rspec-1.2.9/lib/spec/mocks/proxy.rb:157:in `applies_to?'
<http://hudson.zones.apache.org/hudson/job/Buildr-ci-build/ws/lib/buildr/core/compile.rb>:388:in `guess_compiler'
/home/toulmean/buildr-gems/gems/rspec-1.2.9/lib/spec/mocks/proxy.rb:156:in `detect'
<http://hudson.zones.apache.org/hudson/job/Buildr-ci-build/ws/lib/buildr/core/compile.rb>:388:in `each'
<http://hudson.zones.apache.org/hudson/job/Buildr-ci-build/ws/lib/buildr/core/compile.rb>:388:in `detect'
<http://hudson.zones.apache.org/hudson/job/Buildr-ci-build/ws/lib/buildr/core/compile.rb>:388:in `guess_compiler'
<http://hudson.zones.apache.org/hudson/job/Buildr-ci-build/ws/lib/buildr/core/compile.rb>:383:in `associate_with'
<http://hudson.zones.apache.org/hudson/job/Buildr-ci-build/ws/lib/buildr/core/compile.rb>:505:in `send'
<http://hudson.zones.apache.org/hudson/job/Buildr-ci-build/ws/lib/buildr/core/compile.rb>:505:
<http://hudson.zones.apache.org/hudson/job/Buildr-ci-build/ws/lib/buildr/core/project.rb>:652:in `call'
<http://hudson.zones.apache.org/hudson/job/Buildr-ci-build/ws/lib/buildr/core/project.rb>:652:in `call_callbacks'
<http://hudson.zones.apache.org/hudson/job/Buildr-ci-build/ws/lib/buildr/core/project.rb>:652:in `each'
<http://hudson.zones.apache.org/hudson/job/Buildr-ci-build/ws/lib/buildr/core/project.rb>:652:in `call_callbacks'
<http://hudson.zones.apache.org/hudson/job/Buildr-ci-build/ws/lib/buildr/core/project.rb>:216:in `send'
<http://hudson.zones.apache.org/hudson/job/Buildr-ci-build/ws/lib/buildr/core/project.rb>:216:in `define'
/home/toulmean/buildr-gems/gems/rake-0.8.7/lib/rake.rb:634:in `call'
/home/toulmean/buildr-gems/gems/rake-0.8.7/lib/rake.rb:634:in `execute_without_a_record'
/home/toulmean/buildr-gems/gems/rake-0.8.7/lib/rake.rb:631:in `each'
/home/toulmean/buildr-gems/gems/rake-0.8.7/lib/rake.rb:631:in `execute_without_a_record'
./spec/groovy/../spec_helpers.rb:144:in `execute'
<http://hudson.zones.apache.org/hudson/job/Buildr-ci-build/ws/lib/buildr/core/project.rb>:636:in `execute'
<http://hudson.zones.apache.org/hudson/job/Buildr-ci-build/ws/lib/buildr/core/application.rb>:146:in `switch_to_namespace'
<http://hudson.zones.apache.org/hudson/job/Buildr-ci-build/ws/lib/buildr/core/project.rb>:635:in `execute'
<http://hudson.zones.apache.org/hudson/job/Buildr-ci-build/ws/lib/buildr/core/application.rb>:636:in `invoke_with_call_chain'
/usr/lib/ruby/1.8/monitor.rb:242:in `synchronize'
<http://hudson.zones.apache.org/hudson/job/Buildr-ci-build/ws/lib/buildr/core/application.rb>:622:in `invoke_with_call_chain'
<http://hudson.zones.apache.org/hudson/job/Buildr-ci-build/ws/lib/buildr/core/application.rb>:617:in `invoke'
./spec/groovy/../spec_helpers.rb:338:in `define'
./spec/groovy/../spec_helpers.rb:338:in `tap'
./spec/groovy/../spec_helpers.rb:338:in `define'
./spec/core/compile_spec.rb:98:
/home/toulmean/buildr-gems/gems/rspec-1.2.9/lib/spec/example/example_methods.rb:40:in `instance_eval'
/home/toulmean/buildr-gems/gems/rspec-1.2.9/lib/spec/example/example_methods.rb:40:in `execute'
/usr/lib/ruby/1.8/timeout.rb:53:in `timeout'
/home/toulmean/buildr-gems/gems/rspec-1.2.9/lib/spec/example/example_methods.rb:37:in `execute'
/home/toulmean/buildr-gems/gems/rspec-1.2.9/lib/spec/example/example_group_methods.rb:214:in `run_examples'
/home/toulmean/buildr-gems/gems/rspec-1.2.9/lib/spec/example/example_group_methods.rb:212:in `each'
/home/toulmean/buildr-gems/gems/rspec-1.2.9/lib/spec/example/example_group_methods.rb:212:in `run_examples'
/home/toulmean/buildr-gems/gems/rspec-1.2.9/lib/spec/example/example_group_methods.rb:103:in `run'
/home/toulmean/buildr-gems/gems/rspec-1.2.9/lib/spec/runner/example_group_runner.rb:23:in `run'
/home/toulmean/buildr-gems/gems/rspec-1.2.9/lib/spec/runner/example_group_runner.rb:22:in `each'
/home/toulmean/buildr-gems/gems/rspec-1.2.9/lib/spec/runner/example_group_runner.rb:22:in `run'
/home/toulmean/buildr-gems/gems/rspec-1.2.9/lib/spec/runner/options.rb:151:in `run_examples'
/home/toulmean/buildr-gems/gems/rspec-1.2.9/lib/spec/runner/command_line.rb:9:in `run'
/home/toulmean/buildr-gems/gems/rspec-1.2.9/bin/spec:5:
8)
NoMethodError in 'Buildr::CompileTask#compiler should attempt to identify compiler if sources are specified'
undefined method `applies_to?' for Buildr::Compiler::ExternalJavac:Class
/home/toulmean/buildr-gems/gems/rspec-1.2.9/lib/spec/mocks/proxy.rb:117:in `__send__'
/home/toulmean/buildr-gems/gems/rspec-1.2.9/lib/spec/mocks/proxy.rb:117:in `message_received'
/home/toulmean/buildr-gems/gems/rspec-1.2.9/lib/spec/mocks/proxy.rb:157:in `applies_to?'
<http://hudson.zones.apache.org/hudson/job/Buildr-ci-build/ws/lib/buildr/core/compile.rb>:388:in `guess_compiler'
/home/toulmean/buildr-gems/gems/rspec-1.2.9/lib/spec/mocks/proxy.rb:156:in `detect'
<http://hudson.zones.apache.org/hudson/job/Buildr-ci-build/ws/lib/buildr/core/compile.rb>:388:in `each'
<http://hudson.zones.apache.org/hudson/job/Buildr-ci-build/ws/lib/buildr/core/compile.rb>:388:in `detect'
<http://hudson.zones.apache.org/hudson/job/Buildr-ci-build/ws/lib/buildr/core/compile.rb>:388:in `guess_compiler'
<http://hudson.zones.apache.org/hudson/job/Buildr-ci-build/ws/lib/buildr/core/compile.rb>:340:in `compiler'
./spec/core/compile_spec.rb:133:
<http://hudson.zones.apache.org/hudson/job/Buildr-ci-build/ws/lib/buildr/core/project.rb>:225:in `instance_exec'
<http://hudson.zones.apache.org/hudson/job/Buildr-ci-build/ws/lib/buildr/core/project.rb>:225:in `define'
/home/toulmean/buildr-gems/gems/rake-0.8.7/lib/rake.rb:636:in `call'
/home/toulmean/buildr-gems/gems/rake-0.8.7/lib/rake.rb:636:in `execute_without_a_record'
/home/toulmean/buildr-gems/gems/rake-0.8.7/lib/rake.rb:631:in `each'
/home/toulmean/buildr-gems/gems/rake-0.8.7/lib/rake.rb:631:in `execute_without_a_record'
./spec/groovy/../spec_helpers.rb:144:in `execute'
<http://hudson.zones.apache.org/hudson/job/Buildr-ci-build/ws/lib/buildr/core/project.rb>:636:in `execute'
<http://hudson.zones.apache.org/hudson/job/Buildr-ci-build/ws/lib/buildr/core/application.rb>:146:in `switch_to_namespace'
<http://hudson.zones.apache.org/hudson/job/Buildr-ci-build/ws/lib/buildr/core/project.rb>:635:in `execute'
<http://hudson.zones.apache.org/hudson/job/Buildr-ci-build/ws/lib/buildr/core/application.rb>:636:in `invoke_with_call_chain'
/usr/lib/ruby/1.8/monitor.rb:242:in `synchronize'
<http://hudson.zones.apache.org/hudson/job/Buildr-ci-build/ws/lib/buildr/core/application.rb>:622:in `invoke_with_call_chain'
<http://hudson.zones.apache.org/hudson/job/Buildr-ci-build/ws/lib/buildr/core/application.rb>:617:in `invoke'
./spec/groovy/../spec_helpers.rb:338:in `define'
./spec/groovy/../spec_helpers.rb:338:in `tap'
./spec/groovy/../spec_helpers.rb:338:in `define'
./spec/core/compile_spec.rb:131:
/home/toulmean/buildr-gems/gems/rspec-1.2.9/lib/spec/example/example_methods.rb:40:in `instance_eval'
/home/toulmean/buildr-gems/gems/rspec-1.2.9/lib/spec/example/example_methods.rb:40:in `execute'
/usr/lib/ruby/1.8/timeout.rb:53:in `timeout'
/home/toulmean/buildr-gems/gems/rspec-1.2.9/lib/spec/example/example_methods.rb:37:in `execute'
/home/toulmean/buildr-gems/gems/rspec-1.2.9/lib/spec/example/example_group_methods.rb:214:in `run_examples'
/home/toulmean/buildr-gems/gems/rspec-1.2.9/lib/spec/example/example_group_methods.rb:212:in `each'
/home/toulmean/buildr-gems/gems/rspec-1.2.9/lib/spec/example/example_group_methods.rb:212:in `run_examples'
/home/toulmean/buildr-gems/gems/rspec-1.2.9/lib/spec/example/example_group_methods.rb:103:in `run'
/home/toulmean/buildr-gems/gems/rspec-1.2.9/lib/spec/runner/example_group_runner.rb:23:in `run'
/home/toulmean/buildr-gems/gems/rspec-1.2.9/lib/spec/runner/example_group_runner.rb:22:in `each'
/home/toulmean/buildr-gems/gems/rspec-1.2.9/lib/spec/runner/example_group_runner.rb:22:in `run'
/home/toulmean/buildr-gems/gems/rspec-1.2.9/lib/spec/runner/options.rb:151:in `run_examples'
/home/toulmean/buildr-gems/gems/rspec-1.2.9/lib/spec/runner/command_line.rb:9:in `run'
/home/toulmean/buildr-gems/gems/rspec-1.2.9/bin/spec:5:
9)
'scala compiler (installed in SCALA_HOME) should compile scala class depending on java class in same project' FAILED
expected true, got false
/home/toulmean/buildr-gems/gems/rspec-1.2.9/lib/spec/expectations/fail_with.rb:41:in `fail_with'
/home/toulmean/buildr-gems/gems/rspec-1.2.9/lib/spec/expectations/handler.rb:21:in `handle_matcher'
/home/toulmean/buildr-gems/gems/rspec-1.2.9/lib/spec/expectations/extensions/kernel.rb:27:in `should'
./spec/scala/compiler_spec.rb:99:
/home/toulmean/buildr-gems/gems/rubyzip-0.9.1/lib/zip/zip.rb:1382:in `open'
./spec/scala/compiler_spec.rb:97:
/home/toulmean/buildr-gems/gems/rspec-1.2.9/lib/spec/example/example_methods.rb:40:in `instance_eval'
/home/toulmean/buildr-gems/gems/rspec-1.2.9/lib/spec/example/example_methods.rb:40:in `execute'
/usr/lib/ruby/1.8/timeout.rb:53:in `timeout'
/home/toulmean/buildr-gems/gems/rspec-1.2.9/lib/spec/example/example_methods.rb:37:in `execute'
/home/toulmean/buildr-gems/gems/rspec-1.2.9/lib/spec/example/example_group_methods.rb:214:in `run_examples'
/home/toulmean/buildr-gems/gems/rspec-1.2.9/lib/spec/example/example_group_methods.rb:212:in `each'
/home/toulmean/buildr-gems/gems/rspec-1.2.9/lib/spec/example/example_group_methods.rb:212:in `run_examples'
/home/toulmean/buildr-gems/gems/rspec-1.2.9/lib/spec/example/example_group_methods.rb:103:in `run'
/home/toulmean/buildr-gems/gems/rspec-1.2.9/lib/spec/runner/example_group_runner.rb:23:in `run'
/home/toulmean/buildr-gems/gems/rspec-1.2.9/lib/spec/runner/example_group_runner.rb:22:in `each'
/home/toulmean/buildr-gems/gems/rspec-1.2.9/lib/spec/runner/example_group_runner.rb:22:in `run'
/home/toulmean/buildr-gems/gems/rspec-1.2.9/lib/spec/runner/options.rb:151:in `run_examples'
/home/toulmean/buildr-gems/gems/rspec-1.2.9/lib/spec/runner/command_line.rb:9:in `run'
/home/toulmean/buildr-gems/gems/rspec-1.2.9/bin/spec:5:
10)
RuntimeError in 'scala compiler (installed in SCALA_HOME) should compile java class depending on scala class in same project'
Failed to compile, see errors above
<http://hudson.zones.apache.org/hudson/job/Buildr-ci-build/ws/lib/buildr/java/compiler.rb>:70:in `compile'
<http://hudson.zones.apache.org/hudson/job/Buildr-ci-build/ws/lib/buildr/core/compile.rb>:247:in `initialize'
/home/toulmean/buildr-gems/gems/rake-0.8.7/lib/rake.rb:634:in `call'
/home/toulmean/buildr-gems/gems/rake-0.8.7/lib/rake.rb:634:in `execute_without_a_record'
/home/toulmean/buildr-gems/gems/rake-0.8.7/lib/rake.rb:631:in `each'
/home/toulmean/buildr-gems/gems/rake-0.8.7/lib/rake.rb:631:in `execute_without_a_record'
./spec/groovy/../spec_helpers.rb:144:in `execute'
<http://hudson.zones.apache.org/hudson/job/Buildr-ci-build/ws/lib/buildr/core/application.rb>:636:in `invoke_with_call_chain'
/usr/lib/ruby/1.8/monitor.rb:242:in `synchronize'
<http://hudson.zones.apache.org/hudson/job/Buildr-ci-build/ws/lib/buildr/core/application.rb>:622:in `invoke_with_call_chain'
/home/toulmean/buildr-gems/gems/rake-0.8.7/lib/rake.rb:607:in `invoke_prerequisites'
/home/toulmean/buildr-gems/gems/rake-0.8.7/lib/rake.rb:604:in `each'
/home/toulmean/buildr-gems/gems/rake-0.8.7/lib/rake.rb:604:in `invoke_prerequisites'
<http://hudson.zones.apache.org/hudson/job/Buildr-ci-build/ws/lib/buildr/core/application.rb>:629:in `invoke_with_call_chain'
/usr/lib/ruby/1.8/monitor.rb:242:in `synchronize'
<http://hudson.zones.apache.org/hudson/job/Buildr-ci-build/ws/lib/buildr/core/application.rb>:622:in `invoke_with_call_chain'
/home/toulmean/buildr-gems/gems/rake-0.8.7/lib/rake.rb:607:in `invoke_prerequisites'
/home/toulmean/buildr-gems/gems/rake-0.8.7/lib/rake.rb:604:in `each'
/home/toulmean/buildr-gems/gems/rake-0.8.7/lib/rake.rb:604:in `invoke_prerequisites'
<http://hudson.zones.apache.org/hudson/job/Buildr-ci-build/ws/lib/buildr/core/application.rb>:629:in `invoke_with_call_chain'
/usr/lib/ruby/1.8/monitor.rb:242:in `synchronize'
<http://hudson.zones.apache.org/hudson/job/Buildr-ci-build/ws/lib/buildr/core/application.rb>:622:in `invoke_with_call_chain'
/home/toulmean/buildr-gems/gems/rake-0.8.7/lib/rake.rb:607:in `invoke_prerequisites'
/home/toulmean/buildr-gems/gems/rake-0.8.7/lib/rake.rb:604:in `each'
/home/toulmean/buildr-gems/gems/rake-0.8.7/lib/rake.rb:604:in `invoke_prerequisites'
<http://hudson.zones.apache.org/hudson/job/Buildr-ci-build/ws/lib/buildr/core/application.rb>:629:in `invoke_with_call_chain'
/usr/lib/ruby/1.8/monitor.rb:242:in `synchronize'
<http://hudson.zones.apache.org/hudson/job/Buildr-ci-build/ws/lib/buildr/core/application.rb>:622:in `invoke_with_call_chain'
<http://hudson.zones.apache.org/hudson/job/Buildr-ci-build/ws/lib/buildr/core/application.rb>:617:in `invoke'
./spec/scala/compiler_spec.rb:109:
/home/toulmean/buildr-gems/gems/rspec-1.2.9/lib/spec/example/example_methods.rb:40:in `instance_eval'
/home/toulmean/buildr-gems/gems/rspec-1.2.9/lib/spec/example/example_methods.rb:40:in `execute'
/usr/lib/ruby/1.8/timeout.rb:53:in `timeout'
/home/toulmean/buildr-gems/gems/rspec-1.2.9/lib/spec/example/example_methods.rb:37:in `execute'
/home/toulmean/buildr-gems/gems/rspec-1.2.9/lib/spec/example/example_group_methods.rb:214:in `run_examples'
/home/toulmean/buildr-gems/gems/rspec-1.2.9/lib/spec/example/example_group_methods.rb:212:in `each'
/home/toulmean/buildr-gems/gems/rspec-1.2.9/lib/spec/example/example_group_methods.rb:212:in `run_examples'
/home/toulmean/buildr-gems/gems/rspec-1.2.9/lib/spec/example/example_group_methods.rb:103:in `run'
/home/toulmean/buildr-gems/gems/rspec-1.2.9/lib/spec/runner/example_group_runner.rb:23:in `run'
/home/toulmean/buildr-gems/gems/rspec-1.2.9/lib/spec/runner/example_group_runner.rb:22:in `each'
/home/toulmean/buildr-gems/gems/rspec-1.2.9/lib/spec/runner/example_group_runner.rb:22:in `run'
/home/toulmean/buildr-gems/gems/rspec-1.2.9/lib/spec/runner/options.rb:151:in `run_examples'
/home/toulmean/buildr-gems/gems/rspec-1.2.9/lib/spec/runner/command_line.rb:9:in `run'
/home/toulmean/buildr-gems/gems/rspec-1.2.9/bin/spec:5:
11)
'scala compiler (downloaded from repository) should compile scala class depending on java class in same project' FAILED
expected true, got false
/home/toulmean/buildr-gems/gems/rspec-1.2.9/lib/spec/expectations/fail_with.rb:41:in `fail_with'
/home/toulmean/buildr-gems/gems/rspec-1.2.9/lib/spec/expectations/handler.rb:21:in `handle_matcher'
/home/toulmean/buildr-gems/gems/rspec-1.2.9/lib/spec/expectations/extensions/kernel.rb:27:in `should'
./spec/scala/compiler_spec.rb:99:
/home/toulmean/buildr-gems/gems/rubyzip-0.9.1/lib/zip/zip.rb:1382:in `open'
./spec/scala/compiler_spec.rb:97:
/home/toulmean/buildr-gems/gems/rspec-1.2.9/lib/spec/example/example_methods.rb:40:in `instance_eval'
/home/toulmean/buildr-gems/gems/rspec-1.2.9/lib/spec/example/example_methods.rb:40:in `execute'
/usr/lib/ruby/1.8/timeout.rb:53:in `timeout'
/home/toulmean/buildr-gems/gems/rspec-1.2.9/lib/spec/example/example_methods.rb:37:in `execute'
/home/toulmean/buildr-gems/gems/rspec-1.2.9/lib/spec/example/example_group_methods.rb:214:in `run_examples'
/home/toulmean/buildr-gems/gems/rspec-1.2.9/lib/spec/example/example_group_methods.rb:212:in `each'
/home/toulmean/buildr-gems/gems/rspec-1.2.9/lib/spec/example/example_group_methods.rb:212:in `run_examples'
/home/toulmean/buildr-gems/gems/rspec-1.2.9/lib/spec/example/example_group_methods.rb:103:in `run'
/home/toulmean/buildr-gems/gems/rspec-1.2.9/lib/spec/runner/example_group_runner.rb:23:in `run'
/home/toulmean/buildr-gems/gems/rspec-1.2.9/lib/spec/runner/example_group_runner.rb:22:in `each'
/home/toulmean/buildr-gems/gems/rspec-1.2.9/lib/spec/runner/example_group_runner.rb:22:in `run'
/home/toulmean/buildr-gems/gems/rspec-1.2.9/lib/spec/runner/options.rb:151:in `run_examples'
/home/toulmean/buildr-gems/gems/rspec-1.2.9/lib/spec/runner/command_line.rb:9:in `run'
/home/toulmean/buildr-gems/gems/rspec-1.2.9/bin/spec:5:
12)
RuntimeError in 'scala compiler (downloaded from repository) should compile java class depending on scala class in same project'
Failed to compile, see errors above
<http://hudson.zones.apache.org/hudson/job/Buildr-ci-build/ws/lib/buildr/java/compiler.rb>:70:in `compile'
<http://hudson.zones.apache.org/hudson/job/Buildr-ci-build/ws/lib/buildr/core/compile.rb>:247:in `initialize'
/home/toulmean/buildr-gems/gems/rake-0.8.7/lib/rake.rb:634:in `call'
/home/toulmean/buildr-gems/gems/rake-0.8.7/lib/rake.rb:634:in `execute_without_a_record'
/home/toulmean/buildr-gems/gems/rake-0.8.7/lib/rake.rb:631:in `each'
/home/toulmean/buildr-gems/gems/rake-0.8.7/lib/rake.rb:631:in `execute_without_a_record'
./spec/groovy/../spec_helpers.rb:144:in `execute'
<http://hudson.zones.apache.org/hudson/job/Buildr-ci-build/ws/lib/buildr/core/application.rb>:636:in `invoke_with_call_chain'
/usr/lib/ruby/1.8/monitor.rb:242:in `synchronize'
<http://hudson.zones.apache.org/hudson/job/Buildr-ci-build/ws/lib/buildr/core/application.rb>:622:in `invoke_with_call_chain'
/home/toulmean/buildr-gems/gems/rake-0.8.7/lib/rake.rb:607:in `invoke_prerequisites'
/home/toulmean/buildr-gems/gems/rake-0.8.7/lib/rake.rb:604:in `each'
/home/toulmean/buildr-gems/gems/rake-0.8.7/lib/rake.rb:604:in `invoke_prerequisites'
<http://hudson.zones.apache.org/hudson/job/Buildr-ci-build/ws/lib/buildr/core/application.rb>:629:in `invoke_with_call_chain'
/usr/lib/ruby/1.8/monitor.rb:242:in `synchronize'
<http://hudson.zones.apache.org/hudson/job/Buildr-ci-build/ws/lib/buildr/core/application.rb>:622:in `invoke_with_call_chain'
/home/toulmean/buildr-gems/gems/rake-0.8.7/lib/rake.rb:607:in `invoke_prerequisites'
/home/toulmean/buildr-gems/gems/rake-0.8.7/lib/rake.rb:604:in `each'
/home/toulmean/buildr-gems/gems/rake-0.8.7/lib/rake.rb:604:in `invoke_prerequisites'
<http://hudson.zones.apache.org/hudson/job/Buildr-ci-build/ws/lib/buildr/core/application.rb>:629:in `invoke_with_call_chain'
/usr/lib/ruby/1.8/monitor.rb:242:in `synchronize'
<http://hudson.zones.apache.org/hudson/job/Buildr-ci-build/ws/lib/buildr/core/application.rb>:622:in `invoke_with_call_chain'
/home/toulmean/buildr-gems/gems/rake-0.8.7/lib/rake.rb:607:in `invoke_prerequisites'
/home/toulmean/buildr-gems/gems/rake-0.8.7/lib/rake.rb:604:in `each'
/home/toulmean/buildr-gems/gems/rake-0.8.7/lib/rake.rb:604:in `invoke_prerequisites'
<http://hudson.zones.apache.org/hudson/job/Buildr-ci-build/ws/lib/buildr/core/application.rb>:629:in `invoke_with_call_chain'
/usr/lib/ruby/1.8/monitor.rb:242:in `synchronize'
<http://hudson.zones.apache.org/hudson/job/Buildr-ci-build/ws/lib/buildr/core/application.rb>:622:in `invoke_with_call_chain'
<http://hudson.zones.apache.org/hudson/job/Buildr-ci-build/ws/lib/buildr/core/application.rb>:617:in `invoke'
./spec/scala/compiler_spec.rb:109:
/home/toulmean/buildr-gems/gems/rspec-1.2.9/lib/spec/example/example_methods.rb:40:in `instance_eval'
/home/toulmean/buildr-gems/gems/rspec-1.2.9/lib/spec/example/example_methods.rb:40:in `execute'
/usr/lib/ruby/1.8/timeout.rb:53:in `timeout'
/home/toulmean/buildr-gems/gems/rspec-1.2.9/lib/spec/example/example_methods.rb:37:in `execute'
/home/toulmean/buildr-gems/gems/rspec-1.2.9/lib/spec/example/example_group_methods.rb:214:in `run_examples'
/home/toulmean/buildr-gems/gems/rspec-1.2.9/lib/spec/example/example_group_methods.rb:212:in `each'
/home/toulmean/buildr-gems/gems/rspec-1.2.9/lib/spec/example/example_group_methods.rb:212:in `run_examples'
/home/toulmean/buildr-gems/gems/rspec-1.2.9/lib/spec/example/example_group_methods.rb:103:in `run'
/home/toulmean/buildr-gems/gems/rspec-1.2.9/lib/spec/runner/example_group_runner.rb:23:in `run'
/home/toulmean/buildr-gems/gems/rspec-1.2.9/lib/spec/runner/example_group_runner.rb:22:in `each'
/home/toulmean/buildr-gems/gems/rspec-1.2.9/lib/spec/runner/example_group_runner.rb:22:in `run'
/home/toulmean/buildr-gems/gems/rspec-1.2.9/lib/spec/runner/options.rb:151:in `run_examples'
/home/toulmean/buildr-gems/gems/rspec-1.2.9/lib/spec/runner/command_line.rb:9:in `run'
/home/toulmean/buildr-gems/gems/rspec-1.2.9/bin/spec:5:
Finished in 247.819237 seconds
1971 examples, 12 failures
rake aborted!
Command /usr/bin/ruby1.8 -I"lib" "/home/toulmean/buildr-gems/gems/rspec-1.2.9/bin/spec" "spec/groovy/bdd_spec.rb" "spec/groovy/compiler_spec.rb" "spec/addon/drb_spec.rb" "spec/java/commands_spec.rb" "spec/java/external_spec.rb" "spec/java/packaging_spec.rb" "spec/java/tests_spec.rb" "spec/java/bdd_spec.rb" "spec/java/emma_spec.rb" "spec/java/ant_spec.rb" "spec/java/cobertura_spec.rb" "spec/java/compiler_spec.rb" "spec/java/java_spec.rb" "spec/core/compile_spec.rb" "spec/core/common_spec.rb" "spec/core/cc_spec.rb" "spec/core/project_spec.rb" "spec/core/generate_spec.rb" "spec/core/checks_spec.rb" "spec/core/application_spec.rb" "spec/core/util_spec.rb" "spec/core/extension_spec.rb" "spec/core/transport_spec.rb" "spec/core/test_spec.rb" "spec/core/build_spec.rb" "spec/ide/idea7x_spec.rb" "spec/ide/eclipse_spec.rb" "spec/packaging/artifact_spec.rb" "spec/packaging/artifact_namespace_spec.rb" "spec/packaging/packaging_spec.rb" "spec/packaging/archive_spec.rb" "spec/version_requirement_spec.rb" "spec/scala/tests_spec.rb" "spec/scala/bdd_spec.rb" "spec/scala/compiler_spec.rb" --format failing_examples:failed --format html:_reports/specs.html --backtrace --require "/home/toulmean/buildr-gems/gems/ci_reporter-1.6.2/lib/ci/reporter/rake/rspec_loader.rb" --format CI::Reporter::RSpec failed
(See full trace by running task with --trace)
Recording test results
Build failed in Hudson: Buildr-ci-build #41
Posted by Apache Hudson Server <hu...@hudson.zones.apache.org>.
See <http://hudson.zones.apache.org/hudson/job/Buildr-ci-build/41/changes>
Changes:
[toulmean] moving Ant back to 1.8.0 as changes break with Antwrap 0.7
------------------------------------------
[...truncated 761 lines...]
/home/toulmean/buildr-gems/gems/Antwrap-0.7.0-java/lib/ant_project.rb:108:in `method_missing'
<http://hudson.zones.apache.org/hudson/job/Buildr-ci-build/ws/lib/buildr/java/tests.rb>:171:in `generate'
<http://hudson.zones.apache.org/hudson/job/Buildr-ci-build/ws/lib/buildr/java/ant.rb>:77:in `ant'
<http://hudson.zones.apache.org/hudson/job/Buildr-ci-build/ws/lib/buildr/java/ant.rb>:73:in `tap'
<http://hudson.zones.apache.org/hudson/job/Buildr-ci-build/ws/lib/buildr/java/ant.rb>:73:in `ant'
<http://hudson.zones.apache.org/hudson/job/Buildr-ci-build/ws/lib/buildr/java/tests.rb>:168:in `generate'
<http://hudson.zones.apache.org/hudson/job/Buildr-ci-build/ws/lib/buildr/java/tests.rb>:280:
/home/toulmean/buildr-gems/gems/rake-0.8.7/lib/rake.rb:634:in `call'
/home/toulmean/buildr-gems/gems/rake-0.8.7/lib/rake.rb:634:in `execute_without_a_record'
/home/toulmean/buildr-gems/gems/rake-0.8.7/lib/rake.rb:631:in `each'
/home/toulmean/buildr-gems/gems/rake-0.8.7/lib/rake.rb:631:in `execute_without_a_record'
./spec/groovy/../spec_helpers.rb:144:in `execute'
<http://hudson.zones.apache.org/hudson/job/Buildr-ci-build/ws/lib/buildr/core/application.rb>:636:in `invoke_with_call_chain'
/usr/lib/ruby/1.8/monitor.rb:242:in `synchronize'
<http://hudson.zones.apache.org/hudson/job/Buildr-ci-build/ws/lib/buildr/core/application.rb>:622:in `invoke_with_call_chain'
<http://hudson.zones.apache.org/hudson/job/Buildr-ci-build/ws/lib/buildr/core/application.rb>:617:in `invoke'
./spec/java/tests_spec.rb:344:
/home/toulmean/buildr-gems/gems/rspec-1.2.9/lib/spec/example/example_methods.rb:40:in `instance_eval'
/home/toulmean/buildr-gems/gems/rspec-1.2.9/lib/spec/example/example_methods.rb:40:in `execute'
/usr/lib/ruby/1.8/timeout.rb:53:in `timeout'
/home/toulmean/buildr-gems/gems/rspec-1.2.9/lib/spec/example/example_methods.rb:37:in `execute'
/home/toulmean/buildr-gems/gems/rspec-1.2.9/lib/spec/example/example_group_methods.rb:214:in `run_examples'
/home/toulmean/buildr-gems/gems/rspec-1.2.9/lib/spec/example/example_group_methods.rb:212:in `each'
/home/toulmean/buildr-gems/gems/rspec-1.2.9/lib/spec/example/example_group_methods.rb:212:in `run_examples'
/home/toulmean/buildr-gems/gems/rspec-1.2.9/lib/spec/example/example_group_methods.rb:103:in `run'
/home/toulmean/buildr-gems/gems/rspec-1.2.9/lib/spec/runner/example_group_runner.rb:23:in `run'
/home/toulmean/buildr-gems/gems/rspec-1.2.9/lib/spec/runner/example_group_runner.rb:22:in `each'
/home/toulmean/buildr-gems/gems/rspec-1.2.9/lib/spec/runner/example_group_runner.rb:22:in `run'
/home/toulmean/buildr-gems/gems/rspec-1.2.9/lib/spec/runner/options.rb:151:in `run_examples'
/home/toulmean/buildr-gems/gems/rspec-1.2.9/lib/spec/runner/command_line.rb:9:in `run'
/home/toulmean/buildr-gems/gems/rspec-1.2.9/bin/spec:5:
7)
'javac compiler should identify itself from source directories' FAILED
expected :javac
got :externaljavac
(compared using eql?)
/home/toulmean/buildr-gems/gems/rspec-1.2.9/lib/spec/expectations/fail_with.rb:41:in `fail_with'
/home/toulmean/buildr-gems/gems/rspec-1.2.9/lib/spec/expectations/handler.rb:21:in `handle_matcher'
/home/toulmean/buildr-gems/gems/rspec-1.2.9/lib/spec/expectations/extensions/kernel.rb:27:in `should'
./spec/java/compiler_spec.rb:23:
/home/toulmean/buildr-gems/gems/rspec-1.2.9/lib/spec/example/example_methods.rb:40:in `instance_eval'
/home/toulmean/buildr-gems/gems/rspec-1.2.9/lib/spec/example/example_methods.rb:40:in `execute'
/usr/lib/ruby/1.8/timeout.rb:53:in `timeout'
/home/toulmean/buildr-gems/gems/rspec-1.2.9/lib/spec/example/example_methods.rb:37:in `execute'
/home/toulmean/buildr-gems/gems/rspec-1.2.9/lib/spec/example/example_group_methods.rb:214:in `run_examples'
/home/toulmean/buildr-gems/gems/rspec-1.2.9/lib/spec/example/example_group_methods.rb:212:in `each'
/home/toulmean/buildr-gems/gems/rspec-1.2.9/lib/spec/example/example_group_methods.rb:212:in `run_examples'
/home/toulmean/buildr-gems/gems/rspec-1.2.9/lib/spec/example/example_group_methods.rb:103:in `run'
/home/toulmean/buildr-gems/gems/rspec-1.2.9/lib/spec/runner/example_group_runner.rb:23:in `run'
/home/toulmean/buildr-gems/gems/rspec-1.2.9/lib/spec/runner/example_group_runner.rb:22:in `each'
/home/toulmean/buildr-gems/gems/rspec-1.2.9/lib/spec/runner/example_group_runner.rb:22:in `run'
/home/toulmean/buildr-gems/gems/rspec-1.2.9/lib/spec/runner/options.rb:151:in `run_examples'
/home/toulmean/buildr-gems/gems/rspec-1.2.9/lib/spec/runner/command_line.rb:9:in `run'
/home/toulmean/buildr-gems/gems/rspec-1.2.9/bin/spec:5:
8)
'javac compiler should identify from source directories using custom layout' FAILED
expected :javac
got :externaljavac
(compared using eql?)
/home/toulmean/buildr-gems/gems/rspec-1.2.9/lib/spec/expectations/fail_with.rb:41:in `fail_with'
/home/toulmean/buildr-gems/gems/rspec-1.2.9/lib/spec/expectations/handler.rb:21:in `handle_matcher'
/home/toulmean/buildr-gems/gems/rspec-1.2.9/lib/spec/expectations/extensions/kernel.rb:27:in `should'
./spec/java/compiler_spec.rb:33:
<http://hudson.zones.apache.org/hudson/job/Buildr-ci-build/ws/lib/buildr/core/project.rb>:225:in `instance_exec'
<http://hudson.zones.apache.org/hudson/job/Buildr-ci-build/ws/lib/buildr/core/project.rb>:225:in `define'
/home/toulmean/buildr-gems/gems/rake-0.8.7/lib/rake.rb:636:in `call'
/home/toulmean/buildr-gems/gems/rake-0.8.7/lib/rake.rb:636:in `execute_without_a_record'
/home/toulmean/buildr-gems/gems/rake-0.8.7/lib/rake.rb:631:in `each'
/home/toulmean/buildr-gems/gems/rake-0.8.7/lib/rake.rb:631:in `execute_without_a_record'
./spec/groovy/../spec_helpers.rb:144:in `execute'
<http://hudson.zones.apache.org/hudson/job/Buildr-ci-build/ws/lib/buildr/core/project.rb>:636:in `execute'
<http://hudson.zones.apache.org/hudson/job/Buildr-ci-build/ws/lib/buildr/core/application.rb>:146:in `switch_to_namespace'
<http://hudson.zones.apache.org/hudson/job/Buildr-ci-build/ws/lib/buildr/core/project.rb>:635:in `execute'
<http://hudson.zones.apache.org/hudson/job/Buildr-ci-build/ws/lib/buildr/core/application.rb>:636:in `invoke_with_call_chain'
/usr/lib/ruby/1.8/monitor.rb:242:in `synchronize'
<http://hudson.zones.apache.org/hudson/job/Buildr-ci-build/ws/lib/buildr/core/application.rb>:622:in `invoke_with_call_chain'
<http://hudson.zones.apache.org/hudson/job/Buildr-ci-build/ws/lib/buildr/core/application.rb>:617:in `invoke'
./spec/groovy/../spec_helpers.rb:338:in `define'
./spec/groovy/../spec_helpers.rb:338:in `tap'
./spec/groovy/../spec_helpers.rb:338:in `define'
./spec/java/compiler_spec.rb:32:
/home/toulmean/buildr-gems/gems/rspec-1.2.9/lib/spec/example/example_methods.rb:40:in `instance_eval'
/home/toulmean/buildr-gems/gems/rspec-1.2.9/lib/spec/example/example_methods.rb:40:in `execute'
/usr/lib/ruby/1.8/timeout.rb:53:in `timeout'
/home/toulmean/buildr-gems/gems/rspec-1.2.9/lib/spec/example/example_methods.rb:37:in `execute'
/home/toulmean/buildr-gems/gems/rspec-1.2.9/lib/spec/example/example_group_methods.rb:214:in `run_examples'
/home/toulmean/buildr-gems/gems/rspec-1.2.9/lib/spec/example/example_group_methods.rb:212:in `each'
/home/toulmean/buildr-gems/gems/rspec-1.2.9/lib/spec/example/example_group_methods.rb:212:in `run_examples'
/home/toulmean/buildr-gems/gems/rspec-1.2.9/lib/spec/example/example_group_methods.rb:103:in `run'
/home/toulmean/buildr-gems/gems/rspec-1.2.9/lib/spec/runner/example_group_runner.rb:23:in `run'
/home/toulmean/buildr-gems/gems/rspec-1.2.9/lib/spec/runner/example_group_runner.rb:22:in `each'
/home/toulmean/buildr-gems/gems/rspec-1.2.9/lib/spec/runner/example_group_runner.rb:22:in `run'
/home/toulmean/buildr-gems/gems/rspec-1.2.9/lib/spec/runner/options.rb:151:in `run_examples'
/home/toulmean/buildr-gems/gems/rspec-1.2.9/lib/spec/runner/command_line.rb:9:in `run'
/home/toulmean/buildr-gems/gems/rspec-1.2.9/bin/spec:5:
9)
'javac compiler should identify from compile source directories' FAILED
result should have been changed to :javac, but is now :externaljavac
/home/toulmean/buildr-gems/gems/rspec-1.2.9/lib/spec/expectations/fail_with.rb:41:in `fail_with'
/home/toulmean/buildr-gems/gems/rspec-1.2.9/lib/spec/expectations/handler.rb:21:in `handle_matcher'
/home/toulmean/buildr-gems/gems/rspec-1.2.9/lib/spec/expectations/extensions/kernel.rb:27:in `should'
./spec/java/compiler_spec.rb:42:
<http://hudson.zones.apache.org/hudson/job/Buildr-ci-build/ws/lib/buildr/core/project.rb>:225:in `instance_exec'
<http://hudson.zones.apache.org/hudson/job/Buildr-ci-build/ws/lib/buildr/core/project.rb>:225:in `define'
/home/toulmean/buildr-gems/gems/rake-0.8.7/lib/rake.rb:636:in `call'
/home/toulmean/buildr-gems/gems/rake-0.8.7/lib/rake.rb:636:in `execute_without_a_record'
/home/toulmean/buildr-gems/gems/rake-0.8.7/lib/rake.rb:631:in `each'
/home/toulmean/buildr-gems/gems/rake-0.8.7/lib/rake.rb:631:in `execute_without_a_record'
./spec/groovy/../spec_helpers.rb:144:in `execute'
<http://hudson.zones.apache.org/hudson/job/Buildr-ci-build/ws/lib/buildr/core/project.rb>:636:in `execute'
<http://hudson.zones.apache.org/hudson/job/Buildr-ci-build/ws/lib/buildr/core/application.rb>:146:in `switch_to_namespace'
<http://hudson.zones.apache.org/hudson/job/Buildr-ci-build/ws/lib/buildr/core/project.rb>:635:in `execute'
<http://hudson.zones.apache.org/hudson/job/Buildr-ci-build/ws/lib/buildr/core/application.rb>:636:in `invoke_with_call_chain'
/usr/lib/ruby/1.8/monitor.rb:242:in `synchronize'
<http://hudson.zones.apache.org/hudson/job/Buildr-ci-build/ws/lib/buildr/core/application.rb>:622:in `invoke_with_call_chain'
<http://hudson.zones.apache.org/hudson/job/Buildr-ci-build/ws/lib/buildr/core/application.rb>:617:in `invoke'
./spec/groovy/../spec_helpers.rb:338:in `define'
./spec/groovy/../spec_helpers.rb:338:in `tap'
./spec/groovy/../spec_helpers.rb:338:in `define'
./spec/java/compiler_spec.rb:41:
/home/toulmean/buildr-gems/gems/rspec-1.2.9/lib/spec/example/example_methods.rb:40:in `instance_eval'
/home/toulmean/buildr-gems/gems/rspec-1.2.9/lib/spec/example/example_methods.rb:40:in `execute'
/usr/lib/ruby/1.8/timeout.rb:53:in `timeout'
/home/toulmean/buildr-gems/gems/rspec-1.2.9/lib/spec/example/example_methods.rb:37:in `execute'
/home/toulmean/buildr-gems/gems/rspec-1.2.9/lib/spec/example/example_group_methods.rb:214:in `run_examples'
/home/toulmean/buildr-gems/gems/rspec-1.2.9/lib/spec/example/example_group_methods.rb:212:in `each'
/home/toulmean/buildr-gems/gems/rspec-1.2.9/lib/spec/example/example_group_methods.rb:212:in `run_examples'
/home/toulmean/buildr-gems/gems/rspec-1.2.9/lib/spec/example/example_group_methods.rb:103:in `run'
/home/toulmean/buildr-gems/gems/rspec-1.2.9/lib/spec/runner/example_group_runner.rb:23:in `run'
/home/toulmean/buildr-gems/gems/rspec-1.2.9/lib/spec/runner/example_group_runner.rb:22:in `each'
/home/toulmean/buildr-gems/gems/rspec-1.2.9/lib/spec/runner/example_group_runner.rb:22:in `run'
/home/toulmean/buildr-gems/gems/rspec-1.2.9/lib/spec/runner/options.rb:151:in `run_examples'
/home/toulmean/buildr-gems/gems/rspec-1.2.9/lib/spec/runner/command_line.rb:9:in `run'
/home/toulmean/buildr-gems/gems/rspec-1.2.9/bin/spec:5:
10)
RuntimeError in 'javac compiler should include tools.jar dependency'
Failed to compile, see errors above
<http://hudson.zones.apache.org/hudson/job/Buildr-ci-build/ws/lib/buildr/java/external.rb>:43:in `compile'
<http://hudson.zones.apache.org/hudson/job/Buildr-ci-build/ws/lib/buildr/core/compile.rb>:247:in `initialize'
/home/toulmean/buildr-gems/gems/rake-0.8.7/lib/rake.rb:634:in `call'
/home/toulmean/buildr-gems/gems/rake-0.8.7/lib/rake.rb:634:in `execute_without_a_record'
/home/toulmean/buildr-gems/gems/rake-0.8.7/lib/rake.rb:631:in `each'
/home/toulmean/buildr-gems/gems/rake-0.8.7/lib/rake.rb:631:in `execute_without_a_record'
./spec/groovy/../spec_helpers.rb:144:in `execute'
<http://hudson.zones.apache.org/hudson/job/Buildr-ci-build/ws/lib/buildr/core/application.rb>:636:in `invoke_with_call_chain'
/usr/lib/ruby/1.8/monitor.rb:242:in `synchronize'
<http://hudson.zones.apache.org/hudson/job/Buildr-ci-build/ws/lib/buildr/core/application.rb>:622:in `invoke_with_call_chain'
<http://hudson.zones.apache.org/hudson/job/Buildr-ci-build/ws/lib/buildr/core/application.rb>:617:in `invoke'
./spec/java/compiler_spec.rb:87:
/home/toulmean/buildr-gems/gems/rspec-1.2.9/lib/spec/example/example_methods.rb:40:in `instance_eval'
/home/toulmean/buildr-gems/gems/rspec-1.2.9/lib/spec/example/example_methods.rb:40:in `execute'
/usr/lib/ruby/1.8/timeout.rb:53:in `timeout'
/home/toulmean/buildr-gems/gems/rspec-1.2.9/lib/spec/example/example_methods.rb:37:in `execute'
/home/toulmean/buildr-gems/gems/rspec-1.2.9/lib/spec/example/example_group_methods.rb:214:in `run_examples'
/home/toulmean/buildr-gems/gems/rspec-1.2.9/lib/spec/example/example_group_methods.rb:212:in `each'
/home/toulmean/buildr-gems/gems/rspec-1.2.9/lib/spec/example/example_group_methods.rb:212:in `run_examples'
/home/toulmean/buildr-gems/gems/rspec-1.2.9/lib/spec/example/example_group_methods.rb:103:in `run'
/home/toulmean/buildr-gems/gems/rspec-1.2.9/lib/spec/runner/example_group_runner.rb:23:in `run'
/home/toulmean/buildr-gems/gems/rspec-1.2.9/lib/spec/runner/example_group_runner.rb:22:in `each'
/home/toulmean/buildr-gems/gems/rspec-1.2.9/lib/spec/runner/example_group_runner.rb:22:in `run'
/home/toulmean/buildr-gems/gems/rspec-1.2.9/lib/spec/runner/options.rb:151:in `run_examples'
/home/toulmean/buildr-gems/gems/rspec-1.2.9/lib/spec/runner/command_line.rb:9:in `run'
/home/toulmean/buildr-gems/gems/rspec-1.2.9/bin/spec:5:
11)
'Buildr::CompileTask should allow overriding the guessed compiler' FAILED
expected: :javac,
got: :externaljavac (using ==)
/home/toulmean/buildr-gems/gems/rspec-1.2.9/lib/spec/expectations/fail_with.rb:41:in `fail_with'
/home/toulmean/buildr-gems/gems/rspec-1.2.9/lib/spec/matchers/operator_matcher.rb:39:in `fail_with_message'
/home/toulmean/buildr-gems/gems/rspec-1.2.9/lib/spec/matchers/operator_matcher.rb:61:in `__delegate_operator'
/home/toulmean/buildr-gems/gems/rspec-1.2.9/lib/spec/matchers/operator_matcher.rb:51:in `eval_match'
/home/toulmean/buildr-gems/gems/rspec-1.2.9/lib/spec/matchers/operator_matcher.rb:29:in `=='
./spec/core/compile_spec.rb:114:
/home/toulmean/buildr-gems/gems/rspec-1.2.9/lib/spec/example/example_methods.rb:40:in `instance_eval'
/home/toulmean/buildr-gems/gems/rspec-1.2.9/lib/spec/example/example_methods.rb:40:in `execute'
/usr/lib/ruby/1.8/timeout.rb:53:in `timeout'
/home/toulmean/buildr-gems/gems/rspec-1.2.9/lib/spec/example/example_methods.rb:37:in `execute'
/home/toulmean/buildr-gems/gems/rspec-1.2.9/lib/spec/example/example_group_methods.rb:214:in `run_examples'
/home/toulmean/buildr-gems/gems/rspec-1.2.9/lib/spec/example/example_group_methods.rb:212:in `each'
/home/toulmean/buildr-gems/gems/rspec-1.2.9/lib/spec/example/example_group_methods.rb:212:in `run_examples'
/home/toulmean/buildr-gems/gems/rspec-1.2.9/lib/spec/example/example_group_methods.rb:103:in `run'
/home/toulmean/buildr-gems/gems/rspec-1.2.9/lib/spec/runner/example_group_runner.rb:23:in `run'
/home/toulmean/buildr-gems/gems/rspec-1.2.9/lib/spec/runner/example_group_runner.rb:22:in `each'
/home/toulmean/buildr-gems/gems/rspec-1.2.9/lib/spec/runner/example_group_runner.rb:22:in `run'
/home/toulmean/buildr-gems/gems/rspec-1.2.9/lib/spec/runner/options.rb:151:in `run_examples'
/home/toulmean/buildr-gems/gems/rspec-1.2.9/lib/spec/runner/command_line.rb:9:in `run'
/home/toulmean/buildr-gems/gems/rspec-1.2.9/bin/spec:5:
12)
'Buildr::Project#test.compile should identify compiler from project' FAILED
expected :javac
got :externaljavac
(compared using eql?)
/home/toulmean/buildr-gems/gems/rspec-1.2.9/lib/spec/expectations/fail_with.rb:41:in `fail_with'
/home/toulmean/buildr-gems/gems/rspec-1.2.9/lib/spec/expectations/handler.rb:21:in `handle_matcher'
/home/toulmean/buildr-gems/gems/rspec-1.2.9/lib/spec/expectations/extensions/kernel.rb:27:in `should'
./spec/core/test_spec.rb:546:
<http://hudson.zones.apache.org/hudson/job/Buildr-ci-build/ws/lib/buildr/core/project.rb>:225:in `instance_exec'
<http://hudson.zones.apache.org/hudson/job/Buildr-ci-build/ws/lib/buildr/core/project.rb>:225:in `define'
/home/toulmean/buildr-gems/gems/rake-0.8.7/lib/rake.rb:636:in `call'
/home/toulmean/buildr-gems/gems/rake-0.8.7/lib/rake.rb:636:in `execute_without_a_record'
/home/toulmean/buildr-gems/gems/rake-0.8.7/lib/rake.rb:631:in `each'
/home/toulmean/buildr-gems/gems/rake-0.8.7/lib/rake.rb:631:in `execute_without_a_record'
./spec/groovy/../spec_helpers.rb:144:in `execute'
<http://hudson.zones.apache.org/hudson/job/Buildr-ci-build/ws/lib/buildr/core/project.rb>:636:in `execute'
<http://hudson.zones.apache.org/hudson/job/Buildr-ci-build/ws/lib/buildr/core/application.rb>:146:in `switch_to_namespace'
<http://hudson.zones.apache.org/hudson/job/Buildr-ci-build/ws/lib/buildr/core/project.rb>:635:in `execute'
<http://hudson.zones.apache.org/hudson/job/Buildr-ci-build/ws/lib/buildr/core/application.rb>:636:in `invoke_with_call_chain'
/usr/lib/ruby/1.8/monitor.rb:242:in `synchronize'
<http://hudson.zones.apache.org/hudson/job/Buildr-ci-build/ws/lib/buildr/core/application.rb>:622:in `invoke_with_call_chain'
<http://hudson.zones.apache.org/hudson/job/Buildr-ci-build/ws/lib/buildr/core/application.rb>:617:in `invoke'
./spec/groovy/../spec_helpers.rb:338:in `define'
./spec/groovy/../spec_helpers.rb:338:in `tap'
./spec/groovy/../spec_helpers.rb:338:in `define'
./spec/core/test_spec.rb:545:
/home/toulmean/buildr-gems/gems/rspec-1.2.9/lib/spec/example/example_methods.rb:40:in `instance_eval'
/home/toulmean/buildr-gems/gems/rspec-1.2.9/lib/spec/example/example_methods.rb:40:in `execute'
/usr/lib/ruby/1.8/timeout.rb:53:in `timeout'
/home/toulmean/buildr-gems/gems/rspec-1.2.9/lib/spec/example/example_methods.rb:37:in `execute'
/home/toulmean/buildr-gems/gems/rspec-1.2.9/lib/spec/example/example_group_methods.rb:214:in `run_examples'
/home/toulmean/buildr-gems/gems/rspec-1.2.9/lib/spec/example/example_group_methods.rb:212:in `each'
/home/toulmean/buildr-gems/gems/rspec-1.2.9/lib/spec/example/example_group_methods.rb:212:in `run_examples'
/home/toulmean/buildr-gems/gems/rspec-1.2.9/lib/spec/example/example_group_methods.rb:103:in `run'
/home/toulmean/buildr-gems/gems/rspec-1.2.9/lib/spec/runner/example_group_runner.rb:23:in `run'
/home/toulmean/buildr-gems/gems/rspec-1.2.9/lib/spec/runner/example_group_runner.rb:22:in `each'
/home/toulmean/buildr-gems/gems/rspec-1.2.9/lib/spec/runner/example_group_runner.rb:22:in `run'
/home/toulmean/buildr-gems/gems/rspec-1.2.9/lib/spec/runner/options.rb:151:in `run_examples'
/home/toulmean/buildr-gems/gems/rspec-1.2.9/lib/spec/runner/command_line.rb:9:in `run'
/home/toulmean/buildr-gems/gems/rspec-1.2.9/bin/spec:5:
Finished in 330.917965 seconds
1971 examples, 12 failures
rake aborted!
Command /usr/bin/ruby1.8 -I"lib" "/home/toulmean/buildr-gems/gems/rspec-1.2.9/bin/spec" "spec/groovy/bdd_spec.rb" "spec/groovy/compiler_spec.rb" "spec/addon/drb_spec.rb" "spec/java/commands_spec.rb" "spec/java/external_spec.rb" "spec/java/packaging_spec.rb" "spec/java/tests_spec.rb" "spec/java/bdd_spec.rb" "spec/java/emma_spec.rb" "spec/java/ant_spec.rb" "spec/java/cobertura_spec.rb" "spec/java/compiler_spec.rb" "spec/java/java_spec.rb" "spec/core/compile_spec.rb" "spec/core/common_spec.rb" "spec/core/cc_spec.rb" "spec/core/project_spec.rb" "spec/core/generate_spec.rb" "spec/core/checks_spec.rb" "spec/core/application_spec.rb" "spec/core/util_spec.rb" "spec/core/extension_spec.rb" "spec/core/transport_spec.rb" "spec/core/test_spec.rb" "spec/core/build_spec.rb" "spec/ide/idea7x_spec.rb" "spec/ide/eclipse_spec.rb" "spec/packaging/artifact_spec.rb" "spec/packaging/artifact_namespace_spec.rb" "spec/packaging/packaging_spec.rb" "spec/packaging/archive_spec.rb" "spec/version_requirement_spec.rb" "spec/scala/tests_spec.rb" "spec/scala/bdd_spec.rb" "spec/scala/compiler_spec.rb" --format failing_examples:failed --format html:_reports/specs.html --backtrace --require "/home/toulmean/buildr-gems/gems/ci_reporter-1.6.2/lib/ci/reporter/rake/rspec_loader.rb" --format CI::Reporter::RSpec failed
(See full trace by running task with --trace)
Recording test results