You are viewing a plain text version of this content. The canonical link for it is here.
Posted to notifications@maven.apache.org by Apache Jenkins Server <je...@builds.apache.org> on 2019/04/07 09:11:54 UTC

Build failed in Jenkins: Maven TLP » maven-surefire » release/3.0.0-M5 #1

See https://builds.apache.org/job/maven-box/job/maven-surefire/job/release%252F3.0.0-M5/1/

No changes.

All tests passed

Build log:
[...truncated 29842 lines...]
[2019-04-07T09:05:30.086Z] [INFO] Running org.apache.maven.surefire.its.jiras.Surefire674BuildFailingWhenFailsafeErrorsIT
[2019-04-07T09:05:33.715Z] [INFO] Tests run: 2, Failures: 0, Errors: 0, Skipped: 0, Time elapsed: 23.426 s - in org.apache.maven.surefire.its.jiras.Surefire943ReportContentIT
[2019-04-07T09:05:33.715Z] [INFO] Running org.apache.maven.surefire.its.jiras.Surefire946KillMainProcessInReusableForkIT
[2019-04-07T09:05:36.820Z] [INFO] Tests run: 1, Failures: 0, Errors: 0, Skipped: 0, Time elapsed: 3.558 s - in org.apache.maven.surefire.its.jiras.Surefire674BuildFailingWhenFailsafeErrorsIT
[2019-04-07T09:05:36.820Z] [INFO] Running org.apache.maven.surefire.its.jiras.Surefire685CommaSeparatedIncludesIT
[2019-04-07T09:05:38.297Z] [INFO] Tests run: 1, Failures: 0, Errors: 0, Skipped: 0, Time elapsed: 4.113 s - in org.apache.maven.surefire.its.jiras.Surefire685CommaSeparatedIncludesIT
[2019-04-07T09:05:38.297Z] [INFO] Running org.apache.maven.surefire.its.jiras.Surefire697NiceSummaryIT
[2019-04-07T09:05:42.478Z] [INFO] Tests run: 1, Failures: 0, Errors: 0, Skipped: 0, Time elapsed: 4.531 s - in org.apache.maven.surefire.its.jiras.Surefire697NiceSummaryIT
[2019-04-07T09:05:42.478Z] [INFO] Running org.apache.maven.surefire.its.jiras.Surefire705ParallelForkTimeoutIT
[2019-04-07T09:05:50.347Z] [INFO] Tests run: 1, Failures: 0, Errors: 0, Skipped: 0, Time elapsed: 7.112 s - in org.apache.maven.surefire.its.jiras.Surefire705ParallelForkTimeoutIT
[2019-04-07T09:05:50.347Z] [INFO] Running org.apache.maven.surefire.its.jiras.Surefire733AllOverrridesCapturedIT
[2019-04-07T09:05:54.414Z] [INFO] Tests run: 3, Failures: 0, Errors: 0, Skipped: 0, Time elapsed: 22.025 s - in org.apache.maven.surefire.its.jiras.Surefire946KillMainProcessInReusableForkIT
[2019-04-07T09:05:54.414Z] [INFO] Running org.apache.maven.surefire.its.jiras.Surefire972BizarreNoClassDefIT
[2019-04-07T09:05:54.528Z] [INFO] Tests run: 1, Failures: 0, Errors: 0, Skipped: 0, Time elapsed: 4.665 s - in org.apache.maven.surefire.its.jiras.Surefire733AllOverrridesCapturedIT
[2019-04-07T09:05:54.528Z] [INFO] Running org.apache.maven.surefire.its.jiras.Surefire735ForkFailWithRedirectConsoleOutputIT
[2019-04-07T09:06:01.003Z] [INFO] Tests run: 1, Failures: 0, Errors: 0, Skipped: 0, Time elapsed: 6.947 s - in org.apache.maven.surefire.its.jiras.Surefire972BizarreNoClassDefIT
[2019-04-07T09:06:01.003Z] [INFO] Running org.apache.maven.surefire.its.jiras.Surefire975DefaultVMEncodingIT
[2019-04-07T09:06:02.360Z] [INFO] Tests run: 2, Failures: 0, Errors: 0, Skipped: 0, Time elapsed: 8.195 s - in org.apache.maven.surefire.its.jiras.Surefire735ForkFailWithRedirectConsoleOutputIT
[2019-04-07T09:06:02.360Z] [INFO] Running org.apache.maven.surefire.its.jiras.Surefire740TruncatedCommaIT
[2019-04-07T09:06:05.185Z] [INFO] Tests run: 1, Failures: 0, Errors: 0, Skipped: 0, Time elapsed: 4.762 s - in org.apache.maven.surefire.its.jiras.Surefire975DefaultVMEncodingIT
[2019-04-07T09:06:05.185Z] [INFO] Running org.apache.maven.surefire.its.jiras.Surefire979WrongClassLoaderIT
[2019-04-07T09:06:06.659Z] [INFO] Tests run: 1, Failures: 0, Errors: 0, Skipped: 0, Time elapsed: 3.686 s - in org.apache.maven.surefire.its.jiras.Surefire740TruncatedCommaIT
[2019-04-07T09:06:06.659Z] [INFO] Running org.apache.maven.surefire.its.jiras.Surefire747MethodParallelWithSuiteCountIT
[2019-04-07T09:06:10.449Z] [INFO] Tests run: 1, Failures: 0, Errors: 0, Skipped: 0, Time elapsed: 4.932 s - in org.apache.maven.surefire.its.jiras.Surefire979WrongClassLoaderIT
[2019-04-07T09:06:10.449Z] [INFO] Running org.apache.maven.surefire.its.jiras.Surefire985ParameterizedRunnerAndCategoriesIT
[2019-04-07T09:06:14.631Z] [INFO] Tests run: 1, Failures: 0, Errors: 0, Skipped: 0, Time elapsed: 4.594 s - in org.apache.maven.surefire.its.jiras.Surefire985ParameterizedRunnerAndCategoriesIT
[2019-04-07T09:06:14.632Z] [INFO] Running org.apache.maven.surefire.its.jiras.Surefire995CategoryInheritanceIT
[2019-04-07T09:06:32.616Z] [INFO] Tests run: 2, Failures: 0, Errors: 0, Skipped: 0, Time elapsed: 20.684 s - in org.apache.maven.surefire.its.jiras.Surefire747MethodParallelWithSuiteCountIT
[2019-04-07T09:06:32.616Z] [INFO] Running org.apache.maven.surefire.its.jiras.Surefire772BothReportsIT
[2019-04-07T09:06:35.071Z] [INFO] Tests run: 3, Failures: 0, Errors: 0, Skipped: 0, Time elapsed: 8.066 s - in org.apache.maven.surefire.its.jiras.Surefire772BothReportsIT
[2019-04-07T09:06:35.071Z] [INFO] Running org.apache.maven.surefire.its.jiras.Surefire772NoFailsafeReportsIT
[2019-04-07T09:06:35.529Z] [INFO] Tests run: 5, Failures: 0, Errors: 0, Skipped: 0, Time elapsed: 20.74 s - in org.apache.maven.surefire.its.jiras.Surefire995CategoryInheritanceIT
[2019-04-07T09:06:35.529Z] [INFO] 
[2019-04-07T09:06:35.529Z] [INFO] Results:
[2019-04-07T09:06:35.529Z] [INFO] 
[2019-04-07T09:06:35.529Z] [WARNING] Tests run: 792, Failures: 0, Errors: 0, Skipped: 135
[2019-04-07T09:06:35.529Z] [INFO] 
[2019-04-07T09:06:35.529Z] [INFO] 
[2019-04-07T09:06:35.529Z] [INFO] --- maven-checkstyle-plugin:3.0.0:check (checkstyle-check) @ surefire-its ---
[2019-04-07T09:06:36.243Z] [INFO] 
[2019-04-07T09:06:36.243Z] [INFO] --- maven-failsafe-plugin:3.0.0-M3:verify (default) @ surefire-its ---
[2019-04-07T09:06:36.243Z] [INFO] Failsafe report directory: /home/jenkins/jenkins-slave/workspace/_maven-surefire_release_3.0.0-M5@2/surefire-its/target/failsafe-reports
[2019-04-07T09:06:36.243Z] [INFO] 
[2019-04-07T09:06:36.243Z] [INFO] --- maven-install-plugin:2.5.2:install (default-install) @ surefire-its ---
[2019-04-07T09:06:36.243Z] [INFO] Skipping artifact installation
[2019-04-07T09:06:36.243Z] [INFO] ------------------------------------------------------------------------
[2019-04-07T09:06:36.243Z] [INFO] Reactor Summary for Apache Maven Surefire 3.0.0-SNAPSHOT:
[2019-04-07T09:06:36.243Z] [INFO] 
[2019-04-07T09:06:36.243Z] [INFO] Apache Maven Surefire .............................. SUCCESS [ 16.480 s]
[2019-04-07T09:06:36.243Z] [INFO] SureFire Logger API ................................ SUCCESS [  3.342 s]
[2019-04-07T09:06:36.243Z] [INFO] SureFire API ....................................... SUCCESS [  9.011 s]
[2019-04-07T09:06:36.243Z] [INFO] SureFire Booter .................................... SUCCESS [  9.459 s]
[2019-04-07T09:06:36.243Z] [INFO] Maven Surefire Test-Grouping Support ............... SUCCESS [  4.309 s]
[2019-04-07T09:06:36.554Z] [INFO] SureFire Providers ................................. SUCCESS [  0.781 s]
[2019-04-07T09:06:36.554Z] [INFO] Shared JUnit3 Provider Code ........................ SUCCESS [  2.888 s]
[2019-04-07T09:06:36.554Z] [INFO] Shared Java 5 Provider Base ........................ SUCCESS [  3.591 s]
[2019-04-07T09:06:36.554Z] [INFO] Shared JUnit4 Provider Code ........................ SUCCESS [  4.219 s]
[2019-04-07T09:06:36.554Z] [INFO] Shared JUnit48 Provider Code ....................... SUCCESS [  4.435 s]
[2019-04-07T09:06:36.554Z] [INFO] SureFire JUnit Runner .............................. SUCCESS [  3.075 s]
[2019-04-07T09:06:36.554Z] [INFO] SureFire JUnit4 Runner ............................. SUCCESS [  3.166 s]
[2019-04-07T09:06:36.554Z] [INFO] Maven Surefire Common .............................. SUCCESS [ 23.934 s]
[2019-04-07T09:06:36.554Z] [INFO] SureFire JUnitCore Runner .......................... SUCCESS [02:15 min]
[2019-04-07T09:06:36.554Z] [INFO] SureFire JUnit Platform Runner ..................... SUCCESS [  7.835 s]
[2019-04-07T09:06:36.554Z] [INFO] SureFire TestNG Utils .............................. SUCCESS [  3.684 s]
[2019-04-07T09:06:36.554Z] [INFO] SureFire TestNG Runner ............................. SUCCESS [  4.147 s]
[2019-04-07T09:06:36.554Z] [INFO] ShadeFire JUnit3 Provider .......................... SUCCESS [  1.435 s]
[2019-04-07T09:06:36.554Z] [INFO] Surefire Report Parser ............................. SUCCESS [  4.847 s]
[2019-04-07T09:06:36.554Z] [INFO] Maven Surefire Plugin .............................. SUCCESS [  8.626 s]
[2019-04-07T09:06:36.554Z] [INFO] Maven Failsafe Plugin .............................. SUCCESS [ 50.494 s]
[2019-04-07T09:06:36.554Z] [INFO] Maven Surefire Report Plugin ....................... SUCCESS [ 10.571 s]
[2019-04-07T09:06:36.554Z] [INFO] Maven Surefire Integration Tests ................... SUCCESS [  01:00 h]
[2019-04-07T09:06:36.554Z] [INFO] ------------------------------------------------------------------------
[2019-04-07T09:06:36.554Z] [INFO] BUILD SUCCESS
[2019-04-07T09:06:36.554Z] [INFO] ------------------------------------------------------------------------
[2019-04-07T09:06:36.554Z] [INFO] Total time:  01:05 h
[2019-04-07T09:06:36.554Z] [INFO] Finished at: 2019-04-07T09:06:36Z
[2019-04-07T09:06:36.554Z] [INFO] ------------------------------------------------------------------------
[Pipeline] }
[Pipeline] // withEnv
[Pipeline] }
[Pipeline] // stage
[Pipeline] fileExists
[Pipeline] zip
[2019-04-07T09:06:37.385Z] Writing zip file of /home/jenkins/jenkins-slave/workspace/_maven-surefire_release_3.0.0-M5@2/maven-failsafe-plugin/target/it to /home/jenkins/jenkins-slave/workspace/_maven-surefire_release_3.0.0-M5@2/maven-failsafe-plugin--linux-jdk11-maven3.6.x.zip
[2019-04-07T09:06:37.603Z] Zipped 78 entries.
[2019-04-07T09:06:37.603Z] Archiving /home/jenkins/jenkins-slave/workspace/_maven-surefire_release_3.0.0-M5@2/maven-failsafe-plugin--linux-jdk11-maven3.6.x.zip
[2019-04-07T09:06:37.603Z] [Fast Archiver] No prior successful build to compare, so performing full copy of artifacts
[Pipeline] fileExists
[Pipeline] zip
[2019-04-07T09:06:38.735Z] Writing zip file of /home/jenkins/jenkins-slave/workspace/_maven-surefire_release_3.0.0-M5@2/surefire-its/target to /home/jenkins/jenkins-slave/workspace/_maven-surefire_release_3.0.0-M5@2/surefire-its--linux-jdk11-maven3.6.x.zip
[2019-04-07T09:06:45.569Z] Zipped 16580 entries.
[2019-04-07T09:06:45.569Z] Archiving /home/jenkins/jenkins-slave/workspace/_maven-surefire_release_3.0.0-M5@2/surefire-its--linux-jdk11-maven3.6.x.zip
[2019-04-07T09:06:45.569Z] [Fast Archiver] No prior successful build to compare, so performing full copy of artifacts
[2019-04-07T09:06:46.188Z] [INFO] Tests run: 4, Failures: 0, Errors: 0, Skipped: 0, Time elapsed: 11.357 s - in org.apache.maven.surefire.its.jiras.Surefire772NoFailsafeReportsIT
[2019-04-07T09:06:46.188Z] [INFO] Running org.apache.maven.surefire.its.jiras.Surefire772NoSurefireReportsIT
[Pipeline] archiveArtifacts
[2019-04-07T09:06:48.648Z] Archiving artifacts
[2019-04-07T09:06:48.808Z] [Fast Archiver] No prior successful build to compare, so performing full copy of artifacts
[Pipeline] cleanWs
[2019-04-07T09:06:51.246Z] [WS-CLEANUP] Deleting project workspace...
[2019-04-07T09:06:51.246Z] [WS-CLEANUP] Deferred wipeout is used...
[2019-04-07T09:06:51.590Z] [WS-CLEANUP] done
[Pipeline] }
[Pipeline] // ws
[Pipeline] }
[Pipeline] // timestamps
[Pipeline] }
[Pipeline] // node
[Pipeline] }
[2019-04-07T09:06:59.314Z] [INFO] Tests run: 4, Failures: 0, Errors: 0, Skipped: 0, Time elapsed: 11.319 s - in org.apache.maven.surefire.its.jiras.Surefire772NoSurefireReportsIT
[2019-04-07T09:06:59.314Z] [INFO] Running org.apache.maven.surefire.its.jiras.Surefire772SpecifiedReportsIT
[2019-04-07T09:07:07.184Z] [INFO] Tests run: 3, Failures: 0, Errors: 0, Skipped: 0, Time elapsed: 8.644 s - in org.apache.maven.surefire.its.jiras.Surefire772SpecifiedReportsIT
[2019-04-07T09:07:07.184Z] [INFO] Running org.apache.maven.surefire.its.jiras.Surefire801ForkModeNoneClassLoaderIT
[2019-04-07T09:07:10.383Z] [INFO] Tests run: 1, Failures: 0, Errors: 0, Skipped: 0, Time elapsed: 3.88 s - in org.apache.maven.surefire.its.jiras.Surefire801ForkModeNoneClassLoaderIT
[2019-04-07T09:07:10.383Z] [INFO] Running org.apache.maven.surefire.its.jiras.Surefire803MultiFailsafeExecsIT
[2019-04-07T09:07:30.148Z] [INFO] Tests run: 2, Failures: 0, Errors: 0, Skipped: 0, Time elapsed: 16.179 s - in org.apache.maven.surefire.its.jiras.Surefire803MultiFailsafeExecsIT
[2019-04-07T09:07:30.148Z] [INFO] Running org.apache.maven.surefire.its.jiras.Surefire806SpecifiedTestControlsIT
[2019-04-07T09:07:30.862Z] [WARNING] Tests run: 3, Failures: 0, Errors: 0, Skipped: 2, Time elapsed: 4.263 s - in org.apache.maven.surefire.its.jiras.Surefire806SpecifiedTestControlsIT
[2019-04-07T09:07:30.862Z] [INFO] Running org.apache.maven.surefire.its.jiras.Surefire809GroupExpressionsIT
[2019-04-07T09:08:00.166Z] [INFO] Tests run: 6, Failures: 0, Errors: 0, Skipped: 0, Time elapsed: 29.661 s - in org.apache.maven.surefire.its.jiras.Surefire809GroupExpressionsIT
[2019-04-07T09:08:00.166Z] [INFO] Running org.apache.maven.surefire.its.jiras.Surefire812Log4JClassLoaderIT
[2019-04-07T09:08:05.570Z] [INFO] Tests run: 1, Failures: 0, Errors: 0, Skipped: 0, Time elapsed: 5.336 s - in org.apache.maven.surefire.its.jiras.Surefire812Log4JClassLoaderIT
[2019-04-07T09:08:05.570Z] [INFO] Running org.apache.maven.surefire.its.jiras.Surefire817SystemExitIT
[2019-04-07T09:08:10.833Z] [INFO] Tests run: 1, Failures: 0, Errors: 0, Skipped: 0, Time elapsed: 5.322 s - in org.apache.maven.surefire.its.jiras.Surefire817SystemExitIT
[2019-04-07T09:08:10.833Z] [INFO] Running org.apache.maven.surefire.its.jiras.Surefire818NpeIgnoresTestsIT
[2019-04-07T09:08:16.117Z] [INFO] Tests run: 1, Failures: 0, Errors: 0, Skipped: 0, Time elapsed: 5.387 s - in org.apache.maven.surefire.its.jiras.Surefire818NpeIgnoresTestsIT
[2019-04-07T09:08:16.117Z] [INFO] Running org.apache.maven.surefire.its.jiras.Surefire828EmptyGroupExprIT
[2019-04-07T09:08:37.803Z] [INFO] Tests run: 4, Failures: 0, Errors: 0, Skipped: 0, Time elapsed: 20.708 s - in org.apache.maven.surefire.its.jiras.Surefire828EmptyGroupExprIT
[2019-04-07T09:08:37.803Z] [INFO] Running org.apache.maven.surefire.its.jiras.Surefire832ProviderSelectionIT
[2019-04-07T09:08:43.159Z] [INFO] Tests run: 1, Failures: 0, Errors: 0, Skipped: 0, Time elapsed: 5.442 s - in org.apache.maven.surefire.its.jiras.Surefire832ProviderSelectionIT
[2019-04-07T09:08:43.159Z] [INFO] Running org.apache.maven.surefire.its.jiras.Surefire839TestWithoutCategoriesIT
[2019-04-07T09:08:54.338Z] [INFO] Tests run: 2, Failures: 0, Errors: 0, Skipped: 0, Time elapsed: 10.757 s - in org.apache.maven.surefire.its.jiras.Surefire839TestWithoutCategoriesIT
[2019-04-07T09:08:54.338Z] [INFO] Running org.apache.maven.surefire.its.jiras.Surefire847AdditionalFailureIT
[2019-04-07T09:08:59.604Z] [INFO] Tests run: 1, Failures: 0, Errors: 0, Skipped: 0, Time elapsed: 5.648 s - in org.apache.maven.surefire.its.jiras.Surefire847AdditionalFailureIT
[2019-04-07T09:08:59.604Z] [INFO] Running org.apache.maven.surefire.its.jiras.Surefire855AllowFailsafeUseArtifactFileIT
[2019-04-07T09:09:39.718Z] [INFO] Tests run: 4, Failures: 0, Errors: 0, Skipped: 0, Time elapsed: 37.369 s - in org.apache.maven.surefire.its.jiras.Surefire855AllowFailsafeUseArtifactFileIT
[2019-04-07T09:09:39.718Z] [INFO] Running org.apache.maven.surefire.its.jiras.Surefire901MIssingResultfileWhenNoTestsIT
[2019-04-07T09:09:40.432Z] [INFO] Tests run: 1, Failures: 0, Errors: 0, Skipped: 0, Time elapsed: 3.739 s - in org.apache.maven.surefire.its.jiras.Surefire901MIssingResultfileWhenNoTestsIT
[2019-04-07T09:09:40.432Z] [INFO] Running org.apache.maven.surefire.its.jiras.Surefire907PerThreadWithoutThreadCountIT
[2019-04-07T09:09:43.631Z] [INFO] Tests run: 1, Failures: 0, Errors: 0, Skipped: 0, Time elapsed: 3.483 s - in org.apache.maven.surefire.its.jiras.Surefire907PerThreadWithoutThreadCountIT
[2019-04-07T09:09:43.631Z] [INFO] Running org.apache.maven.surefire.its.jiras.Surefire920TestFailureIgnoreWithTimeoutIT
[2019-04-07T09:09:56.759Z] [INFO] Tests run: 2, Failures: 0, Errors: 0, Skipped: 0, Time elapsed: 12.173 s - in org.apache.maven.surefire.its.jiras.Surefire920TestFailureIgnoreWithTimeoutIT
[2019-04-07T09:09:56.759Z] [INFO] Running org.apache.maven.surefire.its.jiras.Surefire926FailureWith2ProvidersIT
[2019-04-07T09:09:59.060Z] [INFO] Tests run: 1, Failures: 0, Errors: 0, Skipped: 0, Time elapsed: 3.632 s - in org.apache.maven.surefire.its.jiras.Surefire926FailureWith2ProvidersIT
[2019-04-07T09:09:59.060Z] [INFO] Running org.apache.maven.surefire.its.jiras.Surefire930TestNgSuiteXmlIT
[2019-04-07T09:10:05.536Z] [INFO] Tests run: 1, Failures: 0, Errors: 0, Skipped: 0, Time elapsed: 5.562 s - in org.apache.maven.surefire.its.jiras.Surefire930TestNgSuiteXmlIT
[2019-04-07T09:10:05.536Z] [INFO] Running org.apache.maven.surefire.its.jiras.Surefire943ReportContentIT
[2019-04-07T09:10:30.081Z] [INFO] Tests run: 2, Failures: 0, Errors: 0, Skipped: 0, Time elapsed: 23.145 s - in org.apache.maven.surefire.its.jiras.Surefire943ReportContentIT
[2019-04-07T09:10:30.081Z] [INFO] Running org.apache.maven.surefire.its.jiras.Surefire946KillMainProcessInReusableForkIT
[2019-04-07T09:10:51.334Z] [INFO] Tests run: 3, Failures: 0, Errors: 0, Skipped: 0, Time elapsed: 21.872 s - in org.apache.maven.surefire.its.jiras.Surefire946KillMainProcessInReusableForkIT
[2019-04-07T09:10:51.334Z] [INFO] Running org.apache.maven.surefire.its.jiras.Surefire972BizarreNoClassDefIT
[2019-04-07T09:10:56.701Z] [INFO] Tests run: 1, Failures: 0, Errors: 0, Skipped: 0, Time elapsed: 6.759 s - in org.apache.maven.surefire.its.jiras.Surefire972BizarreNoClassDefIT
[2019-04-07T09:10:56.701Z] [INFO] Running org.apache.maven.surefire.its.jiras.Surefire975DefaultVMEncodingIT
[2019-04-07T09:11:01.983Z] [INFO] Tests run: 1, Failures: 0, Errors: 0, Skipped: 0, Time elapsed: 4.754 s - in org.apache.maven.surefire.its.jiras.Surefire975DefaultVMEncodingIT
[2019-04-07T09:11:01.983Z] [INFO] Running org.apache.maven.surefire.its.jiras.Surefire979WrongClassLoaderIT
[2019-04-07T09:11:06.299Z] [INFO] Tests run: 1, Failures: 0, Errors: 0, Skipped: 0, Time elapsed: 4.703 s - in org.apache.maven.surefire.its.jiras.Surefire979WrongClassLoaderIT
[2019-04-07T09:11:06.299Z] [INFO] Running org.apache.maven.surefire.its.jiras.Surefire985ParameterizedRunnerAndCategoriesIT
[2019-04-07T09:11:10.477Z] [INFO] Tests run: 1, Failures: 0, Errors: 0, Skipped: 0, Time elapsed: 4.5 s - in org.apache.maven.surefire.its.jiras.Surefire985ParameterizedRunnerAndCategoriesIT
[2019-04-07T09:11:10.477Z] [INFO] Running org.apache.maven.surefire.its.jiras.Surefire995CategoryInheritanceIT
[2019-04-07T09:11:32.721Z] [INFO] Tests run: 5, Failures: 0, Errors: 0, Skipped: 0, Time elapsed: 20.796 s - in org.apache.maven.surefire.its.jiras.Surefire995CategoryInheritanceIT
[2019-04-07T09:11:32.721Z] [INFO] 
[2019-04-07T09:11:32.721Z] [INFO] Results:
[2019-04-07T09:11:32.721Z] [INFO] 
[2019-04-07T09:11:32.721Z] [WARNING] Tests run: 792, Failures: 0, Errors: 0, Skipped: 135
[2019-04-07T09:11:32.721Z] [INFO] 
[2019-04-07T09:11:32.721Z] [INFO] 
[2019-04-07T09:11:32.721Z] [INFO] --- maven-checkstyle-plugin:3.0.0:check (checkstyle-check) @ surefire-its ---
[2019-04-07T09:11:32.721Z] [INFO] 
[2019-04-07T09:11:32.721Z] [INFO] --- maven-failsafe-plugin:3.0.0-M3:verify (default) @ surefire-its ---
[2019-04-07T09:11:32.721Z] [INFO] Failsafe report directory: /home/jenkins/jenkins-slave/workspace/_maven-surefire_release_3.0.0-M5@2/surefire-its/target/failsafe-reports
[2019-04-07T09:11:32.721Z] [INFO] 
[2019-04-07T09:11:32.721Z] [INFO] --- maven-install-plugin:2.5.2:install (default-install) @ surefire-its ---
[2019-04-07T09:11:32.721Z] [INFO] Skipping artifact installation
[2019-04-07T09:11:32.721Z] [INFO] 
[2019-04-07T09:11:32.721Z] [INFO] --- jacoco-maven-plugin:0.8.3:report (default-cli) @ surefire-its ---
[2019-04-07T09:11:32.721Z] [INFO] Loading execution data file /home/jenkins/jenkins-slave/workspace/_maven-surefire_release_3.0.0-M5@2/surefire-its/target/jacoco.exec
[2019-04-07T09:11:32.721Z] [INFO] Analyzed bundle 'Maven Surefire Integration Tests' with 0 classes
[2019-04-07T09:11:32.721Z] [INFO] ------------------------------------------------------------------------
[2019-04-07T09:11:32.721Z] [INFO] Reactor Summary for Apache Maven Surefire 3.0.0-SNAPSHOT:
[2019-04-07T09:11:32.721Z] [INFO] 
[2019-04-07T09:11:32.721Z] [INFO] Apache Maven Surefire .............................. SUCCESS [ 16.539 s]
[2019-04-07T09:11:32.721Z] [INFO] SureFire Logger API ................................ SUCCESS [  3.457 s]
[2019-04-07T09:11:32.721Z] [INFO] SureFire API ....................................... SUCCESS [ 15.376 s]
[2019-04-07T09:11:32.721Z] [INFO] SureFire Booter .................................... SUCCESS [ 11.917 s]
[2019-04-07T09:11:32.721Z] [INFO] Maven Surefire Test-Grouping Support ............... SUCCESS [  5.345 s]
[2019-04-07T09:11:32.721Z] [INFO] SureFire Providers ................................. SUCCESS [  0.998 s]
[2019-04-07T09:11:32.721Z] [INFO] Shared JUnit3 Provider Code ........................ SUCCESS [  3.562 s]
[2019-04-07T09:11:32.721Z] [INFO] Shared Java 5 Provider Base ........................ SUCCESS [  5.809 s]
[2019-04-07T09:11:32.721Z] [INFO] Shared JUnit4 Provider Code ........................ SUCCESS [  4.337 s]
[2019-04-07T09:11:32.721Z] [INFO] Shared JUnit48 Provider Code ....................... SUCCESS [  5.063 s]
[2019-04-07T09:11:32.721Z] [INFO] SureFire JUnit Runner .............................. SUCCESS [  3.938 s]
[2019-04-07T09:11:32.721Z] [INFO] SureFire JUnit4 Runner ............................. SUCCESS [  3.951 s]
[2019-04-07T09:11:32.721Z] [INFO] Maven Surefire Common .............................. SUCCESS [ 32.774 s]
[2019-04-07T09:11:32.721Z] [INFO] SureFire JUnitCore Runner .......................... SUCCESS [02:13 min]
[2019-04-07T09:11:32.721Z] [INFO] SureFire JUnit Platform Runner ..................... SUCCESS [  8.978 s]
[2019-04-07T09:11:32.721Z] [INFO] SureFire TestNG Utils .............................. SUCCESS [  3.980 s]
[2019-04-07T09:11:32.721Z] [INFO] SureFire TestNG Runner ............................. SUCCESS [  4.761 s]
[2019-04-07T09:11:32.721Z] [INFO] ShadeFire JUnit3 Provider .......................... SUCCESS [  1.483 s]
[2019-04-07T09:11:32.722Z] [INFO] Surefire Report Parser ............................. SUCCESS [  5.381 s]
[2019-04-07T09:11:32.722Z] [INFO] Maven Surefire Plugin .............................. SUCCESS [  8.914 s]
[2019-04-07T09:11:32.722Z] [INFO] Maven Failsafe Plugin .............................. SUCCESS [ 50.451 s]
[2019-04-07T09:11:32.722Z] [INFO] Maven Surefire Report Plugin ....................... SUCCESS [ 13.432 s]
[2019-04-07T09:11:32.722Z] [INFO] Maven Surefire Integration Tests ................... SUCCESS [  01:05 h]
[2019-04-07T09:11:32.722Z] [INFO] ------------------------------------------------------------------------
[2019-04-07T09:11:32.722Z] [INFO] BUILD SUCCESS
[2019-04-07T09:11:32.722Z] [INFO] ------------------------------------------------------------------------
[2019-04-07T09:11:32.722Z] [INFO] Total time:  01:10 h
[2019-04-07T09:11:32.722Z] [INFO] Finished at: 2019-04-07T09:11:32Z
[2019-04-07T09:11:32.722Z] [INFO] ------------------------------------------------------------------------
[Pipeline] }
[Pipeline] // withEnv
[Pipeline] }
[Pipeline] // stage
[Pipeline] openTasks
[2019-04-07T09:11:36.150Z] [TASKS] Skipping publisher since build result is FAILURE
[Pipeline] jacoco
[Pipeline] junit
[2019-04-07T09:11:36.767Z] Recording test results
[Pipeline] fileExists
[Pipeline] zip
[2019-04-07T09:11:39.802Z] Writing zip file of /home/jenkins/jenkins-slave/workspace/_maven-surefire_release_3.0.0-M5@2/maven-failsafe-plugin/target/it to /home/jenkins/jenkins-slave/workspace/_maven-surefire_release_3.0.0-M5@2/maven-failsafe-plugin--linux-jdk12-maven3.6.x.zip
[2019-04-07T09:11:40.004Z] Zipped 78 entries.
[2019-04-07T09:11:40.004Z] Archiving /home/jenkins/jenkins-slave/workspace/_maven-surefire_release_3.0.0-M5@2/maven-failsafe-plugin--linux-jdk12-maven3.6.x.zip
[2019-04-07T09:11:40.005Z] [Fast Archiver] No prior successful build to compare, so performing full copy of artifacts
[Pipeline] fileExists
[Pipeline] zip
[2019-04-07T09:11:40.953Z] Writing zip file of /home/jenkins/jenkins-slave/workspace/_maven-surefire_release_3.0.0-M5@2/surefire-its/target to /home/jenkins/jenkins-slave/workspace/_maven-surefire_release_3.0.0-M5@2/surefire-its--linux-jdk12-maven3.6.x.zip
[2019-04-07T09:11:47.627Z] Zipped 16596 entries.
[2019-04-07T09:11:47.628Z] Archiving /home/jenkins/jenkins-slave/workspace/_maven-surefire_release_3.0.0-M5@2/surefire-its--linux-jdk12-maven3.6.x.zip
[2019-04-07T09:11:47.628Z] [Fast Archiver] No prior successful build to compare, so performing full copy of artifacts
[Pipeline] archiveArtifacts
[2019-04-07T09:11:50.677Z] Archiving artifacts
[2019-04-07T09:11:50.836Z] [Fast Archiver] No prior successful build to compare, so performing full copy of artifacts
[Pipeline] cleanWs
[2019-04-07T09:11:53.304Z] [WS-CLEANUP] Deleting project workspace...
[2019-04-07T09:11:53.304Z] [WS-CLEANUP] Deferred wipeout is used...
[2019-04-07T09:11:53.630Z] [WS-CLEANUP] done
[Pipeline] }
[Pipeline] // ws
[Pipeline] }
[Pipeline] // timestamps
[Pipeline] }
[Pipeline] // node
[Pipeline] }
[Pipeline] // parallel
[Pipeline] echo
Build result: FAILURE
[Pipeline] jiraIssueSelector
[Pipeline] emailext

Build failed in Jenkins: Maven TLP » maven-surefire » release/3.0.0-M5 #8

Posted by Apache Jenkins Server <je...@builds.apache.org>.
See https://builds.apache.org/job/maven-box/job/maven-surefire/job/release%252F3.0.0-M5/8/

No changes.

All tests passed

Build log:
[...truncated 29824 lines...]
[2019-06-22T11:14:08.103Z] 	at org.apache.maven.shadefire.surefire.junit.JUnit3Provider.invoke(JUnit3Provider.java:113)
[2019-06-22T11:14:08.103Z] 	at org.apache.maven.shadefire.surefire.booter.ForkedBooter.invokeProviderInSameClassLoader(ForkedBooter.java:384)
[2019-06-22T11:14:08.103Z] 	at org.apache.maven.shadefire.surefire.booter.ForkedBooter.runSuitesInProcess(ForkedBooter.java:345)
[2019-06-22T11:14:08.103Z] 	at org.apache.maven.shadefire.surefire.booter.ForkedBooter.execute(ForkedBooter.java:126)
[2019-06-22T11:14:08.103Z] 	at org.apache.maven.shadefire.surefire.booter.ForkedBooter.main(ForkedBooter.java:418)
[2019-06-22T11:14:08.103Z] Caused by: java.lang.ClassNotFoundException: org.apache.maven.surefire.booter.CommandReaderTest
[2019-06-22T11:14:08.103Z] 	at java.net.URLClassLoader$1.run(URLClassLoader.java:366)
[2019-06-22T11:14:08.103Z] 	at java.net.URLClassLoader$1.run(URLClassLoader.java:355)
[2019-06-22T11:14:08.103Z] 	at java.security.AccessController.doPrivileged(Native Method)
[2019-06-22T11:14:08.103Z] 	at java.net.URLClassLoader.findClass(URLClassLoader.java:354)
[2019-06-22T11:14:08.103Z] 	at java.lang.ClassLoader.loadClass(ClassLoader.java:425)
[2019-06-22T11:14:08.103Z] 	at java.lang.ClassLoader.loadClass(ClassLoader.java:358)
[2019-06-22T11:14:08.103Z] 	at java.lang.Class.forName0(Native Method)
[2019-06-22T11:14:08.103Z] 	at java.lang.Class.forName(Class.java:274)
[2019-06-22T11:14:08.103Z] 	at org.apache.maven.surefire.booter.NewClassLoaderRunner.getFromTestClassLoader(NewClassLoaderRunner.java:185)
[2019-06-22T11:14:08.103Z] 	... 28 more
[2019-06-22T11:14:08.103Z] Caused by: java.lang.ClassNotFoundException: org.apache.maven.surefire.booter.CommandReaderTest
[2019-06-22T11:14:08.103Z] 	at java.net.URLClassLoader$1.run(URLClassLoader.java:366)
[2019-06-22T11:14:08.103Z] 	at java.net.URLClassLoader$1.run(URLClassLoader.java:355)
[2019-06-22T11:14:08.103Z] 	at java.security.AccessController.doPrivileged(Native Method)
[2019-06-22T11:14:08.103Z] 	at java.net.URLClassLoader.findClass(URLClassLoader.java:354)
[2019-06-22T11:14:08.103Z] 	at java.lang.ClassLoader.loadClass(ClassLoader.java:425)
[2019-06-22T11:14:08.103Z] 	at java.lang.ClassLoader.loadClass(ClassLoader.java:358)
[2019-06-22T11:14:08.103Z] 	at java.lang.Class.forName0(Native Method)
[2019-06-22T11:14:08.104Z] 	at java.lang.Class.forName(Class.java:274)
[2019-06-22T11:14:08.104Z] 	at org.apache.maven.surefire.booter.NewClassLoaderRunner.getFromTestClassLoader(NewClassLoaderRunner.java:185)
[2019-06-22T11:14:08.104Z] 	... 28 more
[2019-06-22T11:14:08.104Z] 
[2019-06-22T11:14:08.104Z] [INFO] 
[2019-06-22T11:14:08.104Z] [INFO] Results:
[2019-06-22T11:14:08.104Z] [INFO] 
[2019-06-22T11:14:08.104Z] [ERROR] Errors: 
[2019-06-22T11:14:08.104Z] [ERROR]   junit.framework.TestSuite#org.apache.maven.surefire.booter.CommandReaderTest IllegalStateException
[2019-06-22T11:14:08.104Z] [INFO] 
[2019-06-22T11:14:08.104Z] [ERROR] Tests run: 52, Failures: 0, Errors: 1, Skipped: 0
[2019-06-22T11:14:08.104Z] [INFO] 
[2019-06-22T11:14:08.104Z] [INFO] ------------------------------------------------------------------------
[2019-06-22T11:14:08.104Z] [INFO] Reactor Summary for Apache Maven Surefire 3.0.0-SNAPSHOT:
[2019-06-22T11:14:08.104Z] [INFO] 
[2019-06-22T11:14:08.104Z] [INFO] Apache Maven Surefire .............................. SUCCESS [  7.411 s]
[2019-06-22T11:14:08.104Z] [INFO] SureFire Logger API ................................ SUCCESS [  4.188 s]
[2019-06-22T11:14:08.104Z] [INFO] SureFire API ....................................... SUCCESS [ 11.521 s]
[2019-06-22T11:14:08.104Z] [INFO] SureFire Booter .................................... FAILURE [ 11.460 s]
[2019-06-22T11:14:08.104Z] [INFO] Maven Surefire Test-Grouping Support ............... SKIPPED
[2019-06-22T11:14:08.104Z] [INFO] SureFire Providers ................................. SKIPPED
[2019-06-22T11:14:08.104Z] [INFO] Shared JUnit3 Provider Code ........................ SKIPPED
[2019-06-22T11:14:08.104Z] [INFO] Shared Java 5 Provider Base ........................ SKIPPED
[2019-06-22T11:14:08.104Z] [INFO] Shared JUnit4 Provider Code ........................ SKIPPED
[2019-06-22T11:14:08.104Z] [INFO] Shared JUnit48 Provider Code ....................... SKIPPED
[2019-06-22T11:14:08.104Z] [INFO] SureFire JUnit Runner .............................. SKIPPED
[2019-06-22T11:14:08.104Z] [INFO] SureFire JUnit4 Runner ............................. SKIPPED
[2019-06-22T11:14:08.104Z] [INFO] Maven Surefire Common .............................. SKIPPED
[2019-06-22T11:14:08.104Z] [INFO] SureFire JUnitCore Runner .......................... SKIPPED
[2019-06-22T11:14:08.104Z] [INFO] SureFire JUnit Platform Runner ..................... SKIPPED
[2019-06-22T11:14:08.104Z] [INFO] SureFire TestNG Utils .............................. SKIPPED
[2019-06-22T11:14:08.104Z] [INFO] SureFire TestNG Runner ............................. SKIPPED
[2019-06-22T11:14:08.104Z] [INFO] ShadeFire JUnit3 Provider .......................... SKIPPED
[2019-06-22T11:14:08.104Z] [INFO] Surefire Report Parser ............................. SKIPPED
[2019-06-22T11:14:08.104Z] [INFO] Maven Surefire Plugin .............................. SKIPPED
[2019-06-22T11:14:08.104Z] [INFO] Maven Failsafe Plugin .............................. SKIPPED
[2019-06-22T11:14:08.104Z] [INFO] Maven Surefire Report Plugin ....................... SKIPPED
[2019-06-22T11:14:08.104Z] [INFO] Maven Surefire Integration Tests ................... SKIPPED
[2019-06-22T11:14:08.104Z] [INFO] ------------------------------------------------------------------------
[2019-06-22T11:14:08.104Z] [INFO] BUILD FAILURE
[2019-06-22T11:14:08.104Z] [INFO] ------------------------------------------------------------------------
[2019-06-22T11:14:08.104Z] [INFO] Total time:  35.399 s
[2019-06-22T11:14:08.104Z] [INFO] Finished at: 2019-06-22T11:14:06Z
[2019-06-22T11:14:08.104Z] [INFO] ------------------------------------------------------------------------
[2019-06-22T11:14:08.104Z] [ERROR] Failed to execute goal org.apache.maven.plugins:maven-surefire-plugin:3.0.0-M3:test (default-test) on project surefire-booter: There are test failures.
[2019-06-22T11:14:08.104Z] [ERROR] 
[2019-06-22T11:14:08.104Z] [ERROR] Please refer to C:\Users\jenkins\AppData\Local\Temp\2\jenkins-maven-box-maven-surefire-release%2F3.0.0-M5-8\surefire-booter\target\surefire-reports for the individual test results.
[2019-06-22T11:14:08.104Z] [ERROR] Please refer to dump files (if any exist) [date].dump, [date]-jvmRun[N].dump and [date].dumpstream.
[2019-06-22T11:14:08.104Z] [ERROR] -> [Help 1]
[2019-06-22T11:14:08.104Z] org.apache.maven.lifecycle.LifecycleExecutionException: Failed to execute goal org.apache.maven.plugins:maven-surefire-plugin:3.0.0-M3:test (default-test) on project surefire-booter: There are test failures.
[2019-06-22T11:14:08.104Z] 
[2019-06-22T11:14:08.104Z] Please refer to C:\Users\jenkins\AppData\Local\Temp\2\jenkins-maven-box-maven-surefire-release%2F3.0.0-M5-8\surefire-booter\target\surefire-reports for the individual test results.
[2019-06-22T11:14:08.104Z] Please refer to dump files (if any exist) [date].dump, [date]-jvmRun[N].dump and [date].dumpstream.
[2019-06-22T11:14:08.104Z]     at org.apache.maven.lifecycle.internal.MojoExecutor.execute (MojoExecutor.java:215)
[2019-06-22T11:14:08.104Z]     at org.apache.maven.lifecycle.internal.MojoExecutor.execute (MojoExecutor.java:156)
[2019-06-22T11:14:08.104Z]     at org.apache.maven.lifecycle.internal.MojoExecutor.execute (MojoExecutor.java:148)
[2019-06-22T11:14:08.104Z]     at org.apache.maven.lifecycle.internal.LifecycleModuleBuilder.buildProject (LifecycleModuleBuilder.java:117)
[2019-06-22T11:14:08.104Z]     at org.apache.maven.lifecycle.internal.LifecycleModuleBuilder.buildProject (LifecycleModuleBuilder.java:81)
[2019-06-22T11:14:08.104Z]     at org.apache.maven.lifecycle.internal.builder.singlethreaded.SingleThreadedBuilder.build (SingleThreadedBuilder.java:56)
[2019-06-22T11:14:08.104Z]     at org.apache.maven.lifecycle.internal.LifecycleStarter.execute (LifecycleStarter.java:128)
[2019-06-22T11:14:08.104Z]     at org.apache.maven.DefaultMaven.doExecute (DefaultMaven.java:305)
[2019-06-22T11:14:08.104Z]     at org.apache.maven.DefaultMaven.doExecute (DefaultMaven.java:192)
[2019-06-22T11:14:08.104Z]     at org.apache.maven.DefaultMaven.execute (DefaultMaven.java:105)
[2019-06-22T11:14:08.104Z]     at org.apache.maven.cli.MavenCli.execute (MavenCli.java:956)
[2019-06-22T11:14:08.104Z]     at org.apache.maven.cli.MavenCli.doMain (MavenCli.java:288)
[2019-06-22T11:14:08.104Z]     at org.apache.maven.cli.MavenCli.main (MavenCli.java:192)
[2019-06-22T11:14:08.104Z]     at sun.reflect.NativeMethodAccessorImpl.invoke0 (Native Method)
[2019-06-22T11:14:08.104Z]     at sun.reflect.NativeMethodAccessorImpl.invoke (NativeMethodAccessorImpl.java:62)
[2019-06-22T11:14:08.104Z]     at sun.reflect.DelegatingMethodAccessorImpl.invoke (DelegatingMethodAccessorImpl.java:43)
[2019-06-22T11:14:08.104Z]     at java.lang.reflect.Method.invoke (Method.java:498)
[2019-06-22T11:14:08.105Z]     at org.codehaus.plexus.classworlds.launcher.Launcher.launchEnhanced (Launcher.java:289)
[2019-06-22T11:14:08.105Z]     at org.codehaus.plexus.classworlds.launcher.Launcher.launch (Launcher.java:229)
[2019-06-22T11:14:08.105Z]     at org.codehaus.plexus.classworlds.launcher.Launcher.mainWithExitCode (Launcher.java:415)
[2019-06-22T11:14:08.105Z]     at org.codehaus.plexus.classworlds.launcher.Launcher.main (Launcher.java:356)
[2019-06-22T11:14:08.105Z] Caused by: org.apache.maven.plugin.MojoFailureException: There are test failures.
[2019-06-22T11:14:08.105Z] 
[2019-06-22T11:14:08.105Z] Please refer to C:\Users\jenkins\AppData\Local\Temp\2\jenkins-maven-box-maven-surefire-release%2F3.0.0-M5-8\surefire-booter\target\surefire-reports for the individual test results.
[2019-06-22T11:14:08.105Z] Please refer to dump files (if any exist) [date].dump, [date]-jvmRun[N].dump and [date].dumpstream.
[2019-06-22T11:14:08.105Z]     at org.apache.maven.plugin.surefire.SurefireHelper.throwException (SurefireHelper.java:271)
[2019-06-22T11:14:08.105Z]     at org.apache.maven.plugin.surefire.SurefireHelper.reportExecution (SurefireHelper.java:159)
[2019-06-22T11:14:08.105Z]     at org.apache.maven.plugin.surefire.SurefirePlugin.handleSummary (SurefirePlugin.java:373)
[2019-06-22T11:14:08.105Z]     at org.apache.maven.plugin.surefire.AbstractSurefireMojo.executeAfterPreconditionsChecked (AbstractSurefireMojo.java:1018)
[2019-06-22T11:14:08.105Z]     at org.apache.maven.plugin.surefire.AbstractSurefireMojo.execute (AbstractSurefireMojo.java:848)
[2019-06-22T11:14:08.105Z]     at org.apache.maven.plugin.DefaultBuildPluginManager.executeMojo (DefaultBuildPluginManager.java:137)
[2019-06-22T11:14:08.105Z]     at org.apache.maven.lifecycle.internal.MojoExecutor.execute (MojoExecutor.java:210)
[2019-06-22T11:14:08.105Z]     at org.apache.maven.lifecycle.internal.MojoExecutor.execute (MojoExecutor.java:156)
[2019-06-22T11:14:08.105Z]     at org.apache.maven.lifecycle.internal.MojoExecutor.execute (MojoExecutor.java:148)
[2019-06-22T11:14:08.105Z]     at org.apache.maven.lifecycle.internal.LifecycleModuleBuilder.buildProject (LifecycleModuleBuilder.java:117)
[2019-06-22T11:14:08.105Z]     at org.apache.maven.lifecycle.internal.LifecycleModuleBuilder.buildProject (LifecycleModuleBuilder.java:81)
[2019-06-22T11:14:08.105Z]     at org.apache.maven.lifecycle.internal.builder.singlethreaded.SingleThreadedBuilder.build (SingleThreadedBuilder.java:56)
[2019-06-22T11:14:08.105Z]     at org.apache.maven.lifecycle.internal.LifecycleStarter.execute (LifecycleStarter.java:128)
[2019-06-22T11:14:08.105Z]     at org.apache.maven.DefaultMaven.doExecute (DefaultMaven.java:305)
[2019-06-22T11:14:08.105Z]     at org.apache.maven.DefaultMaven.doExecute (DefaultMaven.java:192)
[2019-06-22T11:14:08.105Z]     at org.apache.maven.DefaultMaven.execute (DefaultMaven.java:105)
[2019-06-22T11:14:08.105Z]     at org.apache.maven.cli.MavenCli.execute (MavenCli.java:956)
[2019-06-22T11:14:08.105Z]     at org.apache.maven.cli.MavenCli.doMain (MavenCli.java:288)
[2019-06-22T11:14:08.105Z]     at org.apache.maven.cli.MavenCli.main (MavenCli.java:192)
[2019-06-22T11:14:08.105Z]     at sun.reflect.NativeMethodAccessorImpl.invoke0 (Native Method)
[2019-06-22T11:14:08.105Z]     at sun.reflect.NativeMethodAccessorImpl.invoke (NativeMethodAccessorImpl.java:62)
[2019-06-22T11:14:08.105Z]     at sun.reflect.DelegatingMethodAccessorImpl.invoke (DelegatingMethodAccessorImpl.java:43)
[2019-06-22T11:14:08.105Z]     at java.lang.reflect.Method.invoke (Method.java:498)
[2019-06-22T11:14:08.105Z]     at org.codehaus.plexus.classworlds.launcher.Launcher.launchEnhanced (Launcher.java:289)
[2019-06-22T11:14:08.105Z]     at org.codehaus.plexus.classworlds.launcher.Launcher.launch (Launcher.java:229)
[2019-06-22T11:14:08.105Z]     at org.codehaus.plexus.classworlds.launcher.Launcher.mainWithExitCode (Launcher.java:415)
[2019-06-22T11:14:08.105Z]     at org.codehaus.plexus.classworlds.launcher.Launcher.main (Launcher.java:356)
[2019-06-22T11:14:08.105Z] [ERROR] 
[2019-06-22T11:14:08.105Z] [ERROR] Re-run Maven using the -X switch to enable full debug logging.
[2019-06-22T11:14:08.105Z] [ERROR] 
[2019-06-22T11:14:08.105Z] [ERROR] For more information about the errors and possible solutions, please read the following articles:
[2019-06-22T11:14:08.105Z] [ERROR] [Help 1] http://cwiki.apache.org/confluence/display/MAVEN/MojoFailureException
[2019-06-22T11:14:08.105Z] [ERROR] 
[2019-06-22T11:14:08.105Z] [ERROR] After correcting the problems, you can resume the build with the command
[2019-06-22T11:14:08.105Z] [ERROR]   mvn <goals> -rf :surefire-booter
[Pipeline] }
[Pipeline] // withEnv
[Pipeline] }
[Pipeline] // stage
[Pipeline] fileExists
[Pipeline] fileExists
[Pipeline] archiveArtifacts
[2019-06-22T11:14:08.354Z] Archiving artifacts
[Pipeline] cleanWs
[2019-06-22T11:14:08.422Z] [WS-CLEANUP] Deleting project workspace...
[2019-06-22T11:14:08.422Z] [WS-CLEANUP] Deferred wipeout is used...
[2019-06-22T11:14:08.464Z] [WS-CLEANUP] done
[Pipeline] }
[Pipeline] // ws
[Pipeline] }
[Pipeline] // timestamps
[Pipeline] }
[Pipeline] // node
[Pipeline] }
[2019-06-22T11:14:25.494Z] [INFO] Tests run: 2, Failures: 0, Errors: 0, Skipped: 0, Time elapsed: 25.498 s - in org.apache.maven.surefire.its.jiras.Surefire943ReportContentIT
[2019-06-22T11:14:25.494Z] [INFO] Running org.apache.maven.surefire.its.jiras.Surefire946KillMainProcessInReusableForkIT
[2019-06-22T11:14:46.674Z] [INFO] Tests run: 3, Failures: 0, Errors: 0, Skipped: 0, Time elapsed: 22.895 s - in org.apache.maven.surefire.its.jiras.Surefire946KillMainProcessInReusableForkIT
[2019-06-22T11:14:46.674Z] [INFO] Running org.apache.maven.surefire.its.jiras.Surefire972BizarreNoClassDefIT
[2019-06-22T11:14:53.125Z] [INFO] Tests run: 1, Failures: 0, Errors: 0, Skipped: 0, Time elapsed: 7.686 s - in org.apache.maven.surefire.its.jiras.Surefire972BizarreNoClassDefIT
[2019-06-22T11:14:53.125Z] [INFO] Running org.apache.maven.surefire.its.jiras.Surefire975DefaultVMEncodingIT
[2019-06-22T11:14:58.359Z] [INFO] Tests run: 1, Failures: 0, Errors: 0, Skipped: 0, Time elapsed: 5.929 s - in org.apache.maven.surefire.its.jiras.Surefire975DefaultVMEncodingIT
[2019-06-22T11:14:58.359Z] [INFO] Running org.apache.maven.surefire.its.jiras.Surefire979WrongClassLoaderIT
[2019-06-22T11:15:03.592Z] [INFO] Tests run: 1, Failures: 0, Errors: 0, Skipped: 0, Time elapsed: 5.33 s - in org.apache.maven.surefire.its.jiras.Surefire979WrongClassLoaderIT
[2019-06-22T11:15:03.592Z] [INFO] Running org.apache.maven.surefire.its.jiras.Surefire985ParameterizedRunnerAndCategoriesIT
[2019-06-22T11:15:08.823Z] [INFO] Tests run: 1, Failures: 0, Errors: 0, Skipped: 0, Time elapsed: 4.969 s - in org.apache.maven.surefire.its.jiras.Surefire985ParameterizedRunnerAndCategoriesIT
[2019-06-22T11:15:08.823Z] [INFO] Running org.apache.maven.surefire.its.jiras.Surefire995CategoryInheritanceIT
[2019-06-22T11:15:33.649Z] [INFO] Tests run: 5, Failures: 0, Errors: 0, Skipped: 0, Time elapsed: 23.669 s - in org.apache.maven.surefire.its.jiras.Surefire995CategoryInheritanceIT
[2019-06-22T11:15:33.649Z] [INFO] 
[2019-06-22T11:15:33.649Z] [INFO] Results:
[2019-06-22T11:15:33.649Z] [INFO] 
[2019-06-22T11:15:33.649Z] [WARNING] Tests run: 792, Failures: 0, Errors: 0, Skipped: 144
[2019-06-22T11:15:33.649Z] [INFO] 
[2019-06-22T11:15:33.649Z] [INFO] 
[2019-06-22T11:15:33.649Z] [INFO] --- maven-checkstyle-plugin:3.0.0:check (checkstyle-check) @ surefire-its ---
[2019-06-22T11:15:33.649Z] [INFO] 
[2019-06-22T11:15:33.649Z] [INFO] --- maven-failsafe-plugin:3.0.0-M3:verify (default) @ surefire-its ---
[2019-06-22T11:15:33.649Z] [INFO] Failsafe report directory: /home/jenkins/jenkins-slave/workspace/_maven-surefire_release_3.0.0-M5@2/surefire-its/target/failsafe-reports
[2019-06-22T11:15:33.649Z] [INFO] 
[2019-06-22T11:15:33.649Z] [INFO] --- maven-install-plugin:2.5.2:install (default-install) @ surefire-its ---
[2019-06-22T11:15:33.649Z] [INFO] Skipping artifact installation
[2019-06-22T11:15:33.649Z] [INFO] ------------------------------------------------------------------------
[2019-06-22T11:15:33.649Z] [INFO] Reactor Summary for Apache Maven Surefire 3.0.0-SNAPSHOT:
[2019-06-22T11:15:33.649Z] [INFO] 
[2019-06-22T11:15:33.649Z] [INFO] Apache Maven Surefire .............................. SUCCESS [ 40.457 s]
[2019-06-22T11:15:33.649Z] [INFO] SureFire Logger API ................................ SUCCESS [  6.013 s]
[2019-06-22T11:15:33.649Z] [INFO] SureFire API ....................................... SUCCESS [ 12.160 s]
[2019-06-22T11:15:33.649Z] [INFO] SureFire Booter .................................... SUCCESS [ 12.875 s]
[2019-06-22T11:15:33.649Z] [INFO] Maven Surefire Test-Grouping Support ............... SUCCESS [  7.185 s]
[2019-06-22T11:15:33.649Z] [INFO] SureFire Providers ................................. SUCCESS [  1.059 s]
[2019-06-22T11:15:33.649Z] [INFO] Shared JUnit3 Provider Code ........................ SUCCESS [  4.812 s]
[2019-06-22T11:15:33.649Z] [INFO] Shared Java 5 Provider Base ........................ SUCCESS [  4.742 s]
[2019-06-22T11:15:33.649Z] [INFO] Shared JUnit4 Provider Code ........................ SUCCESS [  5.032 s]
[2019-06-22T11:15:33.649Z] [INFO] Shared JUnit48 Provider Code ....................... SUCCESS [  6.096 s]
[2019-06-22T11:15:33.649Z] [INFO] SureFire JUnit Runner .............................. SUCCESS [  4.186 s]
[2019-06-22T11:15:33.649Z] [INFO] SureFire JUnit4 Runner ............................. SUCCESS [ 13.999 s]
[2019-06-22T11:15:33.649Z] [INFO] Maven Surefire Common .............................. SUCCESS [ 30.753 s]
[2019-06-22T11:15:33.649Z] [INFO] SureFire JUnitCore Runner .......................... SUCCESS [02:18 min]
[2019-06-22T11:15:33.649Z] [INFO] SureFire JUnit Platform Runner ..................... SUCCESS [ 10.154 s]
[2019-06-22T11:15:33.649Z] [INFO] SureFire TestNG Utils .............................. SUCCESS [  4.385 s]
[2019-06-22T11:15:33.649Z] [INFO] SureFire TestNG Runner ............................. SUCCESS [  5.074 s]
[2019-06-22T11:15:33.649Z] [INFO] ShadeFire JUnit3 Provider .......................... SUCCESS [  1.768 s]
[2019-06-22T11:15:33.649Z] [INFO] Surefire Report Parser ............................. SUCCESS [  6.096 s]
[2019-06-22T11:15:33.649Z] [INFO] Maven Surefire Plugin .............................. SUCCESS [ 11.971 s]
[2019-06-22T11:15:33.649Z] [INFO] Maven Failsafe Plugin .............................. SUCCESS [01:02 min]
[2019-06-22T11:15:33.649Z] [INFO] Maven Surefire Report Plugin ....................... SUCCESS [ 15.940 s]
[2019-06-22T11:15:33.649Z] [INFO] Maven Surefire Integration Tests ................... SUCCESS [  01:10 h]
[2019-06-22T11:15:33.649Z] [INFO] ------------------------------------------------------------------------
[2019-06-22T11:15:33.649Z] [INFO] BUILD SUCCESS
[2019-06-22T11:15:33.649Z] [INFO] ------------------------------------------------------------------------
[2019-06-22T11:15:33.649Z] [INFO] Total time:  01:17 h
[2019-06-22T11:15:33.649Z] [INFO] Finished at: 2019-06-22T11:15:33Z
[2019-06-22T11:15:33.649Z] [INFO] ------------------------------------------------------------------------
[Pipeline] }
[Pipeline] // withEnv
[Pipeline] }
[Pipeline] // stage
[Pipeline] fileExists
[Pipeline] zip
[2019-06-22T11:15:34.737Z] Writing zip file of /home/jenkins/jenkins-slave/workspace/_maven-surefire_release_3.0.0-M5@2/maven-failsafe-plugin/target/it to /home/jenkins/jenkins-slave/workspace/_maven-surefire_release_3.0.0-M5@2/maven-failsafe-plugin--linux-jdk8-maven3.6.x.zip
[2019-06-22T11:15:35.349Z] Zipped 78 entries.
[2019-06-22T11:15:35.349Z] Archiving /home/jenkins/jenkins-slave/workspace/_maven-surefire_release_3.0.0-M5@2/maven-failsafe-plugin--linux-jdk8-maven3.6.x.zip
[2019-06-22T11:15:35.349Z] [Fast Archiver] No prior successful build to compare, so performing full copy of artifacts
[Pipeline] fileExists
[Pipeline] zip
[2019-06-22T11:15:36.304Z] Writing zip file of /home/jenkins/jenkins-slave/workspace/_maven-surefire_release_3.0.0-M5@2/surefire-its/target to /home/jenkins/jenkins-slave/workspace/_maven-surefire_release_3.0.0-M5@2/surefire-its--linux-jdk8-maven3.6.x.zip
[2019-06-22T11:15:44.628Z] Zipped 16249 entries.
[2019-06-22T11:15:44.628Z] Archiving /home/jenkins/jenkins-slave/workspace/_maven-surefire_release_3.0.0-M5@2/surefire-its--linux-jdk8-maven3.6.x.zip
[2019-06-22T11:15:44.629Z] [Fast Archiver] No prior successful build to compare, so performing full copy of artifacts
[Pipeline] archiveArtifacts
[2019-06-22T11:15:47.111Z] Archiving artifacts
[2019-06-22T11:15:47.282Z] [Fast Archiver] No prior successful build to compare, so performing full copy of artifacts
[Pipeline] cleanWs
[2019-06-22T11:15:49.454Z] [WS-CLEANUP] Deleting project workspace...
[2019-06-22T11:15:49.454Z] [WS-CLEANUP] Deferred wipeout is used...
[2019-06-22T11:15:49.768Z] [WS-CLEANUP] done
[Pipeline] }
[Pipeline] // ws
[Pipeline] }
[Pipeline] // timestamps
[Pipeline] }
[Pipeline] // node
[Pipeline] }
[Pipeline] // parallel
[Pipeline] echo
Build result: FAILURE
[Pipeline] jiraIssueSelector
[Pipeline] emailext

Build failed in Jenkins: Maven TLP » maven-surefire » release/3.0.0-M5 #7

Posted by Apache Jenkins Server <je...@builds.apache.org>.
See https://builds.apache.org/job/maven-box/job/maven-surefire/job/release%252F3.0.0-M5/7/

No changes.

All tests passed

Build log:
[...truncated 29829 lines...]
[2019-06-17T12:53:17.752Z] [INFO] Exclude: **/.idea
[2019-06-17T12:53:17.752Z] [INFO] Exclude: **/.svn/**/*
[2019-06-17T12:53:17.752Z] [INFO] Exclude: **/*.iml
[2019-06-17T12:53:17.752Z] [INFO] Exclude: **/*.ipr
[2019-06-17T12:53:17.752Z] [INFO] Exclude: **/*.iws
[2019-06-17T12:53:17.752Z] [INFO] Exclude: **/*.versionsBackup
[2019-06-17T12:53:17.752Z] [INFO] Exclude: **/dependency-reduced-pom.xml
[2019-06-17T12:53:17.752Z] [INFO] Exclude: .repository/**
[2019-06-17T12:53:17.752Z] [INFO] Exclude: src/test/resources/**/*
[2019-06-17T12:53:17.752Z] [INFO] Exclude: src/test/resources/**/*.css
[2019-06-17T12:53:17.752Z] [INFO] Exclude: **/*.jj
[2019-06-17T12:53:17.752Z] [INFO] Exclude: src/main/resources/META-INF/services/org.apache.maven.surefire.providerapi.SurefireProvider
[2019-06-17T12:53:17.752Z] [INFO] Exclude: DEPENDENCIES
[2019-06-17T12:53:17.752Z] [INFO] Exclude: .m2/**
[2019-06-17T12:53:17.752Z] [INFO] Exclude: .m2
[2019-06-17T12:53:17.752Z] [INFO] Exclude: .travis.yml
[2019-06-17T12:53:17.752Z] [INFO] 33 resources included (use -debug for more details)
[2019-06-17T12:53:18.090Z] [INFO] Rat check: Summary over all files. Unapproved: 0, unknown: 0, generated: 0, approved: 33 licenses.
[2019-06-17T12:53:18.090Z] [INFO] 
[2019-06-17T12:53:18.090Z] [INFO] --- jacoco-maven-plugin:0.8.3:prepare-agent (jacoco-agent) @ surefire-booter ---
[2019-06-17T12:53:18.090Z] [INFO] Skipping JaCoCo execution because property jacoco.skip is set.
[2019-06-17T12:53:18.090Z] [INFO] jacoco.agent set to empty
[2019-06-17T12:53:18.090Z] [INFO] 
[2019-06-17T12:53:18.090Z] [INFO] --- maven-dependency-plugin:3.1.1:build-classpath (build-test-classpath) @ surefire-booter ---
[2019-06-17T12:53:18.737Z] [INFO] Wrote classpath file 'C:\Users\jenkins\AppData\Local\Temp\2\jenkins-maven-box-maven-surefire-release%2F3.0.0-M5-7\surefire-booter\target\test-classpath\cp.txt'.
[2019-06-17T12:53:18.737Z] [INFO] 
[2019-06-17T12:53:18.737Z] [INFO] --- maven-compiler-plugin:3.7.0:compile (compile-generated) @ surefire-booter ---
[2019-06-17T12:53:18.737Z] [INFO] Nothing to compile - all classes are up to date
[2019-06-17T12:53:18.737Z] [INFO] 
[2019-06-17T12:53:18.737Z] [INFO] --- maven-remote-resources-plugin:1.5:process (process-resource-bundles) @ surefire-booter ---
[2019-06-17T12:53:19.043Z] [INFO] 
[2019-06-17T12:53:19.043Z] [INFO] --- maven-resources-plugin:3.1.0:resources (default-resources) @ surefire-booter ---
[2019-06-17T12:53:19.043Z] [INFO] Using 'UTF-8' encoding to copy filtered resources.
[2019-06-17T12:53:19.043Z] [INFO] skip non existing resourceDirectory C:\Users\jenkins\AppData\Local\Temp\2\jenkins-maven-box-maven-surefire-release%2F3.0.0-M5-7\surefire-booter\src\main\resources
[2019-06-17T12:53:19.043Z] [INFO] Copying 3 resources
[2019-06-17T12:53:19.043Z] [INFO] 
[2019-06-17T12:53:19.043Z] [INFO] --- maven-compiler-plugin:3.7.0:compile (default-compile) @ surefire-booter ---
[2019-06-17T12:53:19.043Z] [INFO] Changes detected - recompiling the module!
[2019-06-17T12:53:19.043Z] [INFO] Compiling 23 source files to C:\Users\jenkins\AppData\Local\Temp\2\jenkins-maven-box-maven-surefire-release%2F3.0.0-M5-7\surefire-booter\target\classes
[2019-06-17T12:53:22.154Z] [INFO] 
[2019-06-17T12:53:22.154Z] [INFO] --- animal-sniffer-maven-plugin:1.17:check (signature-check) @ surefire-booter ---
[2019-06-17T12:53:22.154Z] [INFO] Checking unresolved references to org.codehaus.mojo.signature:java17:1.0
[2019-06-17T12:53:22.455Z] [INFO] 
[2019-06-17T12:53:22.455Z] [INFO] --- maven-resources-plugin:3.1.0:testResources (default-testResources) @ surefire-booter ---
[2019-06-17T12:53:22.759Z] [INFO] Using 'UTF-8' encoding to copy filtered resources.
[2019-06-17T12:53:22.759Z] [INFO] Copying 7 resources
[2019-06-17T12:53:22.759Z] [INFO] Copying 3 resources
[2019-06-17T12:53:22.759Z] [INFO] 
[2019-06-17T12:53:22.759Z] [INFO] --- maven-compiler-plugin:3.7.0:testCompile (default-testCompile) @ surefire-booter ---
[2019-06-17T12:53:22.759Z] [INFO] Changes detected - recompiling the module!
[2019-06-17T12:53:22.759Z] [INFO] Compiling 9 source files to C:\Users\jenkins\AppData\Local\Temp\2\jenkins-maven-box-maven-surefire-release%2F3.0.0-M5-7\surefire-booter\target\test-classes
[2019-06-17T12:53:26.516Z] [INFO] 
[2019-06-17T12:53:26.516Z] [INFO] --- maven-surefire-plugin:3.0.0-M3:test (default-test) @ surefire-booter ---
[2019-06-17T12:53:26.516Z] [INFO] Surefire report directory: C:\Users\jenkins\AppData\Local\Temp\2\jenkins-maven-box-maven-surefire-release%2F3.0.0-M5-7\surefire-booter\target\surefire-reports
[2019-06-17T12:53:26.516Z] [INFO] Using configured provider org.apache.maven.shadefire.surefire.junit.JUnit3Provider
[2019-06-17T12:53:26.516Z] [INFO] parallel='none', perCoreThreadCount=true, threadCount=0, useUnlimitedThreads=false, threadCountSuites=0, threadCountClasses=0, threadCountMethods=0, parallelOptimized=true
[2019-06-17T12:53:26.516Z] [INFO] 
[2019-06-17T12:53:26.516Z] [INFO] -------------------------------------------------------
[2019-06-17T12:53:26.516Z] [INFO]  T E S T S
[2019-06-17T12:53:26.516Z] [INFO] -------------------------------------------------------
[2019-06-17T12:53:27.363Z] [INFO] Running org.apache.maven.surefire.booter.JUnit4SuiteTest
[2019-06-17T12:53:30.936Z] [ERROR] Tests run: 52, Failures: 0, Errors: 1, Skipped: 0, Time elapsed: 3.602 s <<< FAILURE! - in org.apache.maven.surefire.booter.JUnit4SuiteTest
[2019-06-17T12:53:30.936Z] [ERROR] org.apache.maven.surefire.booter.CommandReaderTest  Time elapsed: 0.046 s  <<< ERROR!
[2019-06-17T12:53:30.936Z] java.lang.IllegalStateException: java.lang.ClassNotFoundException: org.apache.maven.surefire.booter.CommandReaderTest
[2019-06-17T12:53:30.936Z] 	at org.apache.maven.surefire.booter.NewClassLoaderRunner.getFromTestClassLoader(NewClassLoaderRunner.java:189)
[2019-06-17T12:53:30.936Z] 	at org.apache.maven.surefire.booter.NewClassLoaderRunner.runChild(NewClassLoaderRunner.java:76)
[2019-06-17T12:53:30.936Z] 	at org.apache.maven.surefire.booter.NewClassLoaderRunner.runChild(NewClassLoaderRunner.java:57)
[2019-06-17T12:53:30.936Z] 	at org.junit.runners.ParentRunner$3.run(ParentRunner.java:290)
[2019-06-17T12:53:30.936Z] 	at org.junit.runners.ParentRunner$1.schedule(ParentRunner.java:71)
[2019-06-17T12:53:30.936Z] 	at org.junit.runners.ParentRunner.runChildren(ParentRunner.java:288)
[2019-06-17T12:53:30.936Z] 	at org.junit.runners.ParentRunner.access$000(ParentRunner.java:58)
[2019-06-17T12:53:30.936Z] 	at org.junit.runners.ParentRunner$2.evaluate(ParentRunner.java:268)
[2019-06-17T12:53:30.936Z] 	at org.junit.runners.ParentRunner.run(ParentRunner.java:363)
[2019-06-17T12:53:30.936Z] 	at org.junit.runners.Suite.runChild(Suite.java:128)
[2019-06-17T12:53:30.936Z] 	at org.junit.runners.Suite.runChild(Suite.java:27)
[2019-06-17T12:53:30.936Z] 	at org.junit.runners.ParentRunner$3.run(ParentRunner.java:290)
[2019-06-17T12:53:30.936Z] 	at org.junit.runners.ParentRunner$1.schedule(ParentRunner.java:71)
[2019-06-17T12:53:30.936Z] 	at org.junit.runners.ParentRunner.runChildren(ParentRunner.java:288)
[2019-06-17T12:53:30.936Z] 	at org.junit.runners.ParentRunner.access$000(ParentRunner.java:58)
[2019-06-17T12:53:30.936Z] 	at org.junit.runners.ParentRunner$2.evaluate(ParentRunner.java:268)
[2019-06-17T12:53:30.936Z] 	at org.junit.runners.ParentRunner.run(ParentRunner.java:363)
[2019-06-17T12:53:30.936Z] 	at junit.framework.JUnit4TestAdapter.run(JUnit4TestAdapter.java:38)
[2019-06-17T12:53:30.936Z] 	at sun.reflect.NativeMethodAccessorImpl.invoke0(Native Method)
[2019-06-17T12:53:30.936Z] 	at sun.reflect.NativeMethodAccessorImpl.invoke(NativeMethodAccessorImpl.java:57)
[2019-06-17T12:53:30.936Z] 	at sun.reflect.DelegatingMethodAccessorImpl.invoke(DelegatingMethodAccessorImpl.java:43)
[2019-06-17T12:53:30.936Z] 	at java.lang.reflect.Method.invoke(Method.java:606)
[2019-06-17T12:53:30.936Z] 	at org.apache.maven.shadefire.surefire.junit.JUnitTestSet.execute(JUnitTestSet.java:99)
[2019-06-17T12:53:30.937Z] 	at org.apache.maven.shadefire.surefire.junit.JUnit3Provider.executeTestSet(JUnit3Provider.java:140)
[2019-06-17T12:53:30.937Z] 	at org.apache.maven.shadefire.surefire.junit.JUnit3Provider.invoke(JUnit3Provider.java:113)
[2019-06-17T12:53:30.937Z] 	at org.apache.maven.shadefire.surefire.booter.ForkedBooter.invokeProviderInSameClassLoader(ForkedBooter.java:384)
[2019-06-17T12:53:30.937Z] 	at org.apache.maven.shadefire.surefire.booter.ForkedBooter.runSuitesInProcess(ForkedBooter.java:345)
[2019-06-17T12:53:30.937Z] 	at org.apache.maven.shadefire.surefire.booter.ForkedBooter.execute(ForkedBooter.java:126)
[2019-06-17T12:53:30.937Z] 	at org.apache.maven.shadefire.surefire.booter.ForkedBooter.main(ForkedBooter.java:418)
[2019-06-17T12:53:30.937Z] Caused by: java.lang.ClassNotFoundException: org.apache.maven.surefire.booter.CommandReaderTest
[2019-06-17T12:53:30.937Z] 	at java.net.URLClassLoader$1.run(URLClassLoader.java:366)
[2019-06-17T12:53:30.937Z] 	at java.net.URLClassLoader$1.run(URLClassLoader.java:355)
[2019-06-17T12:53:30.937Z] 	at java.security.AccessController.doPrivileged(Native Method)
[2019-06-17T12:53:30.937Z] 	at java.net.URLClassLoader.findClass(URLClassLoader.java:354)
[2019-06-17T12:53:30.937Z] 	at java.lang.ClassLoader.loadClass(ClassLoader.java:425)
[2019-06-17T12:53:30.937Z] 	at java.lang.ClassLoader.loadClass(ClassLoader.java:358)
[2019-06-17T12:53:30.937Z] 	at java.lang.Class.forName0(Native Method)
[2019-06-17T12:53:30.937Z] 	at java.lang.Class.forName(Class.java:274)
[2019-06-17T12:53:30.937Z] 	at org.apache.maven.surefire.booter.NewClassLoaderRunner.getFromTestClassLoader(NewClassLoaderRunner.java:185)
[2019-06-17T12:53:30.937Z] 	... 28 more
[2019-06-17T12:53:30.937Z] Caused by: java.lang.ClassNotFoundException: org.apache.maven.surefire.booter.CommandReaderTest
[2019-06-17T12:53:30.937Z] 	at java.net.URLClassLoader$1.run(URLClassLoader.java:366)
[2019-06-17T12:53:30.937Z] 	at java.net.URLClassLoader$1.run(URLClassLoader.java:355)
[2019-06-17T12:53:30.937Z] 	at java.security.AccessController.doPrivileged(Native Method)
[2019-06-17T12:53:30.937Z] 	at java.net.URLClassLoader.findClass(URLClassLoader.java:354)
[2019-06-17T12:53:30.937Z] 	at java.lang.ClassLoader.loadClass(ClassLoader.java:425)
[2019-06-17T12:53:30.937Z] 	at java.lang.ClassLoader.loadClass(ClassLoader.java:358)
[2019-06-17T12:53:30.937Z] 	at java.lang.Class.forName0(Native Method)
[2019-06-17T12:53:30.937Z] 	at java.lang.Class.forName(Class.java:274)
[2019-06-17T12:53:30.937Z] 	at org.apache.maven.surefire.booter.NewClassLoaderRunner.getFromTestClassLoader(NewClassLoaderRunner.java:185)
[2019-06-17T12:53:30.937Z] 	... 28 more
[2019-06-17T12:53:30.937Z] 
[2019-06-17T12:53:31.253Z] [INFO] 
[2019-06-17T12:53:31.253Z] [INFO] Results:
[2019-06-17T12:53:31.253Z] [INFO] 
[2019-06-17T12:53:31.253Z] [ERROR] Errors: 
[2019-06-17T12:53:31.253Z] [ERROR]   junit.framework.TestSuite#org.apache.maven.surefire.booter.CommandReaderTest IllegalStateException
[2019-06-17T12:53:31.253Z] [INFO] 
[2019-06-17T12:53:31.253Z] [ERROR] Tests run: 52, Failures: 0, Errors: 1, Skipped: 0
[2019-06-17T12:53:31.253Z] [INFO] 
[2019-06-17T12:53:31.253Z] [INFO] ------------------------------------------------------------------------
[2019-06-17T12:53:31.253Z] [INFO] Reactor Summary for Apache Maven Surefire 3.0.0-SNAPSHOT:
[2019-06-17T12:53:31.253Z] [INFO] 
[2019-06-17T12:53:31.253Z] [INFO] Apache Maven Surefire .............................. SUCCESS [  8.408 s]
[2019-06-17T12:53:31.253Z] [INFO] SureFire Logger API ................................ SUCCESS [  6.537 s]
[2019-06-17T12:53:31.253Z] [INFO] SureFire API ....................................... SUCCESS [ 16.350 s]
[2019-06-17T12:53:31.253Z] [INFO] SureFire Booter .................................... FAILURE [ 15.939 s]
[2019-06-17T12:53:31.253Z] [INFO] Maven Surefire Test-Grouping Support ............... SKIPPED
[2019-06-17T12:53:31.253Z] [INFO] SureFire Providers ................................. SKIPPED
[2019-06-17T12:53:31.253Z] [INFO] Shared JUnit3 Provider Code ........................ SKIPPED
[2019-06-17T12:53:31.253Z] [INFO] Shared Java 5 Provider Base ........................ SKIPPED
[2019-06-17T12:53:31.253Z] [INFO] Shared JUnit4 Provider Code ........................ SKIPPED
[2019-06-17T12:53:31.253Z] [INFO] Shared JUnit48 Provider Code ....................... SKIPPED
[2019-06-17T12:53:31.253Z] [INFO] SureFire JUnit Runner .............................. SKIPPED
[2019-06-17T12:53:31.253Z] [INFO] SureFire JUnit4 Runner ............................. SKIPPED
[2019-06-17T12:53:31.253Z] [INFO] Maven Surefire Common .............................. SKIPPED
[2019-06-17T12:53:31.253Z] [INFO] SureFire JUnitCore Runner .......................... SKIPPED
[2019-06-17T12:53:31.253Z] [INFO] SureFire JUnit Platform Runner ..................... SKIPPED
[2019-06-17T12:53:31.253Z] [INFO] SureFire TestNG Utils .............................. SKIPPED
[2019-06-17T12:53:31.253Z] [INFO] SureFire TestNG Runner ............................. SKIPPED
[2019-06-17T12:53:31.253Z] [INFO] ShadeFire JUnit3 Provider .......................... SKIPPED
[2019-06-17T12:53:31.253Z] [INFO] Surefire Report Parser ............................. SKIPPED
[2019-06-17T12:53:31.253Z] [INFO] Maven Surefire Plugin .............................. SKIPPED
[2019-06-17T12:53:31.253Z] [INFO] Maven Failsafe Plugin .............................. SKIPPED
[2019-06-17T12:53:31.253Z] [INFO] Maven Surefire Report Plugin ....................... SKIPPED
[2019-06-17T12:53:31.253Z] [INFO] Maven Surefire Integration Tests ................... SKIPPED
[2019-06-17T12:53:31.253Z] [INFO] ------------------------------------------------------------------------
[2019-06-17T12:53:31.253Z] [INFO] BUILD FAILURE
[2019-06-17T12:53:31.253Z] [INFO] ------------------------------------------------------------------------
[2019-06-17T12:53:31.253Z] [INFO] Total time:  48.030 s
[2019-06-17T12:53:31.253Z] [INFO] Finished at: 2019-06-17T05:53:31-07:00
[2019-06-17T12:53:31.253Z] [INFO] ------------------------------------------------------------------------
[2019-06-17T12:53:31.253Z] [ERROR] Failed to execute goal org.apache.maven.plugins:maven-surefire-plugin:3.0.0-M3:test (default-test) on project surefire-booter: There are test failures.
[2019-06-17T12:53:31.253Z] [ERROR] 
[2019-06-17T12:53:31.253Z] [ERROR] Please refer to C:\Users\jenkins\AppData\Local\Temp\2\jenkins-maven-box-maven-surefire-release%2F3.0.0-M5-7\surefire-booter\target\surefire-reports for the individual test results.
[2019-06-17T12:53:31.254Z] [ERROR] Please refer to dump files (if any exist) [date].dump, [date]-jvmRun[N].dump and [date].dumpstream.
[2019-06-17T12:53:31.254Z] [ERROR] -> [Help 1]
[2019-06-17T12:53:31.254Z] org.apache.maven.lifecycle.LifecycleExecutionException: Failed to execute goal org.apache.maven.plugins:maven-surefire-plugin:3.0.0-M3:test (default-test) on project surefire-booter: There are test failures.
[2019-06-17T12:53:31.254Z] 
[2019-06-17T12:53:31.254Z] Please refer to C:\Users\jenkins\AppData\Local\Temp\2\jenkins-maven-box-maven-surefire-release%2F3.0.0-M5-7\surefire-booter\target\surefire-reports for the individual test results.
[2019-06-17T12:53:31.254Z] Please refer to dump files (if any exist) [date].dump, [date]-jvmRun[N].dump and [date].dumpstream.
[2019-06-17T12:53:31.254Z]     at org.apache.maven.lifecycle.internal.MojoExecutor.execute (MojoExecutor.java:215)
[2019-06-17T12:53:31.254Z]     at org.apache.maven.lifecycle.internal.MojoExecutor.execute (MojoExecutor.java:156)
[2019-06-17T12:53:31.254Z]     at org.apache.maven.lifecycle.internal.MojoExecutor.execute (MojoExecutor.java:148)
[2019-06-17T12:53:31.254Z]     at org.apache.maven.lifecycle.internal.LifecycleModuleBuilder.buildProject (LifecycleModuleBuilder.java:117)
[2019-06-17T12:53:31.254Z]     at org.apache.maven.lifecycle.internal.LifecycleModuleBuilder.buildProject (LifecycleModuleBuilder.java:81)
[2019-06-17T12:53:31.254Z]     at org.apache.maven.lifecycle.internal.builder.singlethreaded.SingleThreadedBuilder.build (SingleThreadedBuilder.java:56)
[2019-06-17T12:53:31.254Z]     at org.apache.maven.lifecycle.internal.LifecycleStarter.execute (LifecycleStarter.java:128)
[2019-06-17T12:53:31.254Z]     at org.apache.maven.DefaultMaven.doExecute (DefaultMaven.java:305)
[2019-06-17T12:53:31.254Z]     at org.apache.maven.DefaultMaven.doExecute (DefaultMaven.java:192)
[2019-06-17T12:53:31.254Z]     at org.apache.maven.DefaultMaven.execute (DefaultMaven.java:105)
[2019-06-17T12:53:31.254Z]     at org.apache.maven.cli.MavenCli.execute (MavenCli.java:956)
[2019-06-17T12:53:31.254Z]     at org.apache.maven.cli.MavenCli.doMain (MavenCli.java:288)
[2019-06-17T12:53:31.254Z]     at org.apache.maven.cli.MavenCli.main (MavenCli.java:192)
[2019-06-17T12:53:31.254Z]     at sun.reflect.NativeMethodAccessorImpl.invoke0 (Native Method)
[2019-06-17T12:53:31.254Z]     at sun.reflect.NativeMethodAccessorImpl.invoke (NativeMethodAccessorImpl.java:62)
[2019-06-17T12:53:31.254Z]     at sun.reflect.DelegatingMethodAccessorImpl.invoke (DelegatingMethodAccessorImpl.java:43)
[2019-06-17T12:53:31.254Z]     at java.lang.reflect.Method.invoke (Method.java:498)
[2019-06-17T12:53:31.254Z]     at org.codehaus.plexus.classworlds.launcher.Launcher.launchEnhanced (Launcher.java:289)
[2019-06-17T12:53:31.254Z]     at org.codehaus.plexus.classworlds.launcher.Launcher.launch (Launcher.java:229)
[2019-06-17T12:53:31.254Z]     at org.codehaus.plexus.classworlds.launcher.Launcher.mainWithExitCode (Launcher.java:415)
[2019-06-17T12:53:31.254Z]     at org.codehaus.plexus.classworlds.launcher.Launcher.main (Launcher.java:356)
[2019-06-17T12:53:31.254Z] Caused by: org.apache.maven.plugin.MojoFailureException: There are test failures.
[2019-06-17T12:53:31.254Z] 
[2019-06-17T12:53:31.254Z] Please refer to C:\Users\jenkins\AppData\Local\Temp\2\jenkins-maven-box-maven-surefire-release%2F3.0.0-M5-7\surefire-booter\target\surefire-reports for the individual test results.
[2019-06-17T12:53:31.254Z] Please refer to dump files (if any exist) [date].dump, [date]-jvmRun[N].dump and [date].dumpstream.
[2019-06-17T12:53:31.254Z]     at org.apache.maven.plugin.surefire.SurefireHelper.throwException (SurefireHelper.java:271)
[2019-06-17T12:53:31.254Z]     at org.apache.maven.plugin.surefire.SurefireHelper.reportExecution (SurefireHelper.java:159)
[2019-06-17T12:53:31.254Z]     at org.apache.maven.plugin.surefire.SurefirePlugin.handleSummary (SurefirePlugin.java:373)
[2019-06-17T12:53:31.254Z]     at org.apache.maven.plugin.surefire.AbstractSurefireMojo.executeAfterPreconditionsChecked (AbstractSurefireMojo.java:1018)
[2019-06-17T12:53:31.254Z]     at org.apache.maven.plugin.surefire.AbstractSurefireMojo.execute (AbstractSurefireMojo.java:848)
[2019-06-17T12:53:31.254Z]     at org.apache.maven.plugin.DefaultBuildPluginManager.executeMojo (DefaultBuildPluginManager.java:137)
[2019-06-17T12:53:31.254Z]     at org.apache.maven.lifecycle.internal.MojoExecutor.execute (MojoExecutor.java:210)
[2019-06-17T12:53:31.254Z]     at org.apache.maven.lifecycle.internal.MojoExecutor.execute (MojoExecutor.java:156)
[2019-06-17T12:53:31.254Z]     at org.apache.maven.lifecycle.internal.MojoExecutor.execute (MojoExecutor.java:148)
[2019-06-17T12:53:31.254Z]     at org.apache.maven.lifecycle.internal.LifecycleModuleBuilder.buildProject (LifecycleModuleBuilder.java:117)
[2019-06-17T12:53:31.254Z]     at org.apache.maven.lifecycle.internal.LifecycleModuleBuilder.buildProject (LifecycleModuleBuilder.java:81)
[2019-06-17T12:53:31.254Z]     at org.apache.maven.lifecycle.internal.builder.singlethreaded.SingleThreadedBuilder.build (SingleThreadedBuilder.java:56)
[2019-06-17T12:53:31.254Z]     at org.apache.maven.lifecycle.internal.LifecycleStarter.execute (LifecycleStarter.java:128)
[2019-06-17T12:53:31.254Z]     at org.apache.maven.DefaultMaven.doExecute (DefaultMaven.java:305)
[2019-06-17T12:53:31.254Z]     at org.apache.maven.DefaultMaven.doExecute (DefaultMaven.java:192)
[2019-06-17T12:53:31.254Z]     at org.apache.maven.DefaultMaven.execute (DefaultMaven.java:105)
[2019-06-17T12:53:31.254Z]     at org.apache.maven.cli.MavenCli.execute (MavenCli.java:956)
[2019-06-17T12:53:31.254Z]     at org.apache.maven.cli.MavenCli.doMain (MavenCli.java:288)
[2019-06-17T12:53:31.254Z]     at org.apache.maven.cli.MavenCli.main (MavenCli.java:192)
[2019-06-17T12:53:31.254Z]     at sun.reflect.NativeMethodAccessorImpl.invoke0 (Native Method)
[2019-06-17T12:53:31.254Z]     at sun.reflect.NativeMethodAccessorImpl.invoke (NativeMethodAccessorImpl.java:62)
[2019-06-17T12:53:31.254Z]     at sun.reflect.DelegatingMethodAccessorImpl.invoke (DelegatingMethodAccessorImpl.java:43)
[2019-06-17T12:53:31.254Z]     at java.lang.reflect.Method.invoke (Method.java:498)
[2019-06-17T12:53:31.254Z]     at org.codehaus.plexus.classworlds.launcher.Launcher.launchEnhanced (Launcher.java:289)
[2019-06-17T12:53:31.254Z]     at org.codehaus.plexus.classworlds.launcher.Launcher.launch (Launcher.java:229)
[2019-06-17T12:53:31.254Z]     at org.codehaus.plexus.classworlds.launcher.Launcher.mainWithExitCode (Launcher.java:415)
[2019-06-17T12:53:31.254Z]     at org.codehaus.plexus.classworlds.launcher.Launcher.main (Launcher.java:356)
[2019-06-17T12:53:31.254Z] [ERROR] 
[2019-06-17T12:53:31.254Z] [ERROR] Re-run Maven using the -X switch to enable full debug logging.
[2019-06-17T12:53:31.254Z] [ERROR] 
[2019-06-17T12:53:31.254Z] [ERROR] For more information about the errors and possible solutions, please read the following articles:
[2019-06-17T12:53:31.254Z] [ERROR] [Help 1] http://cwiki.apache.org/confluence/display/MAVEN/MojoFailureException
[2019-06-17T12:53:31.254Z] [ERROR] 
[2019-06-17T12:53:31.254Z] [ERROR] After correcting the problems, you can resume the build with the command
[2019-06-17T12:53:31.254Z] [ERROR]   mvn <goals> -rf :surefire-booter
[Pipeline] }
[Pipeline] // withEnv
[Pipeline] }
[Pipeline] // stage
[Pipeline] fileExists
[Pipeline] fileExists
[Pipeline] archiveArtifacts
[2019-06-17T12:53:31.725Z] Archiving artifacts
[Pipeline] cleanWs
[2019-06-17T12:53:31.791Z] [WS-CLEANUP] Deleting project workspace...
[2019-06-17T12:53:31.791Z] [WS-CLEANUP] Deferred wipeout is used...
[2019-06-17T12:53:31.832Z] [WS-CLEANUP] done
[Pipeline] }
[Pipeline] // ws
[Pipeline] }
[Pipeline] // timestamps
[Pipeline] }
[Pipeline] // node
[Pipeline] }
[Pipeline] // parallel
[Pipeline] echo
Build result: FAILURE
[Pipeline] jiraIssueSelector
[Pipeline] emailext

Build failed in Jenkins: Maven TLP » maven-surefire » release/3.0.0-M5 #6

Posted by Apache Jenkins Server <je...@builds.apache.org>.
See https://builds.apache.org/job/maven-box/job/maven-surefire/job/release%252F3.0.0-M5/6/

No changes.

All tests passed

Build log:
[...truncated 29830 lines...]
[2019-06-14T09:21:43.934Z] [INFO] Exclude: **/.idea
[2019-06-14T09:21:43.934Z] [INFO] Exclude: **/.svn/**/*
[2019-06-14T09:21:43.934Z] [INFO] Exclude: **/*.iml
[2019-06-14T09:21:43.934Z] [INFO] Exclude: **/*.ipr
[2019-06-14T09:21:43.934Z] [INFO] Exclude: **/*.iws
[2019-06-14T09:21:43.934Z] [INFO] Exclude: **/*.versionsBackup
[2019-06-14T09:21:43.934Z] [INFO] Exclude: **/dependency-reduced-pom.xml
[2019-06-14T09:21:43.934Z] [INFO] Exclude: .repository/**
[2019-06-14T09:21:43.934Z] [INFO] Exclude: src/test/resources/**/*
[2019-06-14T09:21:43.934Z] [INFO] Exclude: src/test/resources/**/*.css
[2019-06-14T09:21:43.934Z] [INFO] Exclude: **/*.jj
[2019-06-14T09:21:43.934Z] [INFO] Exclude: src/main/resources/META-INF/services/org.apache.maven.surefire.providerapi.SurefireProvider
[2019-06-14T09:21:43.934Z] [INFO] Exclude: DEPENDENCIES
[2019-06-14T09:21:43.934Z] [INFO] Exclude: .m2/**
[2019-06-14T09:21:43.934Z] [INFO] Exclude: .m2
[2019-06-14T09:21:43.934Z] [INFO] Exclude: .travis.yml
[2019-06-14T09:21:43.934Z] [INFO] 33 resources included (use -debug for more details)
[2019-06-14T09:21:43.934Z] [INFO] Rat check: Summary over all files. Unapproved: 0, unknown: 0, generated: 0, approved: 33 licenses.
[2019-06-14T09:21:43.934Z] [INFO] 
[2019-06-14T09:21:43.934Z] [INFO] --- jacoco-maven-plugin:0.8.3:prepare-agent (jacoco-agent) @ surefire-booter ---
[2019-06-14T09:21:43.934Z] [INFO] Skipping JaCoCo execution because property jacoco.skip is set.
[2019-06-14T09:21:43.934Z] [INFO] jacoco.agent set to empty
[2019-06-14T09:21:43.934Z] [INFO] 
[2019-06-14T09:21:43.934Z] [INFO] --- maven-dependency-plugin:3.1.1:build-classpath (build-test-classpath) @ surefire-booter ---
[2019-06-14T09:21:43.934Z] [INFO] Wrote classpath file 'C:\Users\jenkins\AppData\Local\Temp\2\jenkins-maven-box-maven-surefire-release%2F3.0.0-M5-6\surefire-booter\target\test-classpath\cp.txt'.
[2019-06-14T09:21:43.934Z] [INFO] 
[2019-06-14T09:21:43.934Z] [INFO] --- maven-compiler-plugin:3.7.0:compile (compile-generated) @ surefire-booter ---
[2019-06-14T09:21:43.934Z] [INFO] Nothing to compile - all classes are up to date
[2019-06-14T09:21:43.934Z] [INFO] 
[2019-06-14T09:21:43.934Z] [INFO] --- maven-remote-resources-plugin:1.5:process (process-resource-bundles) @ surefire-booter ---
[2019-06-14T09:21:43.934Z] [INFO] 
[2019-06-14T09:21:43.934Z] [INFO] --- maven-resources-plugin:3.1.0:resources (default-resources) @ surefire-booter ---
[2019-06-14T09:21:43.934Z] [INFO] Using 'UTF-8' encoding to copy filtered resources.
[2019-06-14T09:21:43.934Z] [INFO] skip non existing resourceDirectory C:\Users\jenkins\AppData\Local\Temp\2\jenkins-maven-box-maven-surefire-release%2F3.0.0-M5-6\surefire-booter\src\main\resources
[2019-06-14T09:21:43.934Z] [INFO] Copying 3 resources
[2019-06-14T09:21:43.934Z] [INFO] 
[2019-06-14T09:21:43.934Z] [INFO] --- maven-compiler-plugin:3.7.0:compile (default-compile) @ surefire-booter ---
[2019-06-14T09:21:43.934Z] [INFO] Changes detected - recompiling the module!
[2019-06-14T09:21:43.934Z] [INFO] Compiling 23 source files to C:\Users\jenkins\AppData\Local\Temp\2\jenkins-maven-box-maven-surefire-release%2F3.0.0-M5-6\surefire-booter\target\classes
[2019-06-14T09:21:45.491Z] [INFO] 
[2019-06-14T09:21:45.491Z] [INFO] --- animal-sniffer-maven-plugin:1.17:check (signature-check) @ surefire-booter ---
[2019-06-14T09:21:45.491Z] [INFO] Checking unresolved references to org.codehaus.mojo.signature:java17:1.0
[2019-06-14T09:21:45.491Z] [INFO] 
[2019-06-14T09:21:45.491Z] [INFO] --- maven-resources-plugin:3.1.0:testResources (default-testResources) @ surefire-booter ---
[2019-06-14T09:21:45.491Z] [INFO] Using 'UTF-8' encoding to copy filtered resources.
[2019-06-14T09:21:45.491Z] [INFO] Copying 7 resources
[2019-06-14T09:21:45.492Z] [INFO] Copying 3 resources
[2019-06-14T09:21:45.492Z] [INFO] 
[2019-06-14T09:21:45.492Z] [INFO] --- maven-compiler-plugin:3.7.0:testCompile (default-testCompile) @ surefire-booter ---
[2019-06-14T09:21:45.492Z] [INFO] Changes detected - recompiling the module!
[2019-06-14T09:21:45.492Z] [INFO] Compiling 9 source files to C:\Users\jenkins\AppData\Local\Temp\2\jenkins-maven-box-maven-surefire-release%2F3.0.0-M5-6\surefire-booter\target\test-classes
[2019-06-14T09:21:49.152Z] [INFO] 
[2019-06-14T09:21:49.152Z] [INFO] --- maven-surefire-plugin:3.0.0-M3:test (default-test) @ surefire-booter ---
[2019-06-14T09:21:49.152Z] [INFO] Surefire report directory: C:\Users\jenkins\AppData\Local\Temp\2\jenkins-maven-box-maven-surefire-release%2F3.0.0-M5-6\surefire-booter\target\surefire-reports
[2019-06-14T09:21:49.152Z] [INFO] Using configured provider org.apache.maven.shadefire.surefire.junit.JUnit3Provider
[2019-06-14T09:21:49.152Z] [INFO] parallel='none', perCoreThreadCount=true, threadCount=0, useUnlimitedThreads=false, threadCountSuites=0, threadCountClasses=0, threadCountMethods=0, parallelOptimized=true
[2019-06-14T09:21:49.152Z] [INFO] 
[2019-06-14T09:21:49.152Z] [INFO] -------------------------------------------------------
[2019-06-14T09:21:49.152Z] [INFO]  T E S T S
[2019-06-14T09:21:49.152Z] [INFO] -------------------------------------------------------
[2019-06-14T09:21:49.152Z] [INFO] Running org.apache.maven.surefire.booter.JUnit4SuiteTest
[2019-06-14T09:21:53.778Z] [ERROR] Tests run: 52, Failures: 0, Errors: 1, Skipped: 0, Time elapsed: 3.893 s <<< FAILURE! - in org.apache.maven.surefire.booter.JUnit4SuiteTest
[2019-06-14T09:21:53.778Z] [ERROR] org.apache.maven.surefire.booter.CommandReaderTest  Time elapsed: 0.048 s  <<< ERROR!
[2019-06-14T09:21:53.778Z] java.lang.IllegalStateException: java.lang.ClassNotFoundException: org.apache.maven.surefire.booter.CommandReaderTest
[2019-06-14T09:21:53.778Z] 	at org.apache.maven.surefire.booter.NewClassLoaderRunner.getFromTestClassLoader(NewClassLoaderRunner.java:189)
[2019-06-14T09:21:53.778Z] 	at org.apache.maven.surefire.booter.NewClassLoaderRunner.runChild(NewClassLoaderRunner.java:76)
[2019-06-14T09:21:53.778Z] 	at org.apache.maven.surefire.booter.NewClassLoaderRunner.runChild(NewClassLoaderRunner.java:57)
[2019-06-14T09:21:53.778Z] 	at org.junit.runners.ParentRunner$3.run(ParentRunner.java:290)
[2019-06-14T09:21:53.778Z] 	at org.junit.runners.ParentRunner$1.schedule(ParentRunner.java:71)
[2019-06-14T09:21:53.778Z] 	at org.junit.runners.ParentRunner.runChildren(ParentRunner.java:288)
[2019-06-14T09:21:53.778Z] 	at org.junit.runners.ParentRunner.access$000(ParentRunner.java:58)
[2019-06-14T09:21:53.778Z] 	at org.junit.runners.ParentRunner$2.evaluate(ParentRunner.java:268)
[2019-06-14T09:21:53.778Z] 	at org.junit.runners.ParentRunner.run(ParentRunner.java:363)
[2019-06-14T09:21:53.778Z] 	at org.junit.runners.Suite.runChild(Suite.java:128)
[2019-06-14T09:21:53.779Z] 	at org.junit.runners.Suite.runChild(Suite.java:27)
[2019-06-14T09:21:53.779Z] 	at org.junit.runners.ParentRunner$3.run(ParentRunner.java:290)
[2019-06-14T09:21:53.779Z] 	at org.junit.runners.ParentRunner$1.schedule(ParentRunner.java:71)
[2019-06-14T09:21:53.779Z] 	at org.junit.runners.ParentRunner.runChildren(ParentRunner.java:288)
[2019-06-14T09:21:53.779Z] 	at org.junit.runners.ParentRunner.access$000(ParentRunner.java:58)
[2019-06-14T09:21:53.779Z] 	at org.junit.runners.ParentRunner$2.evaluate(ParentRunner.java:268)
[2019-06-14T09:21:53.779Z] 	at org.junit.runners.ParentRunner.run(ParentRunner.java:363)
[2019-06-14T09:21:53.779Z] 	at junit.framework.JUnit4TestAdapter.run(JUnit4TestAdapter.java:38)
[2019-06-14T09:21:53.779Z] 	at sun.reflect.NativeMethodAccessorImpl.invoke0(Native Method)
[2019-06-14T09:21:53.779Z] 	at sun.reflect.NativeMethodAccessorImpl.invoke(NativeMethodAccessorImpl.java:57)
[2019-06-14T09:21:53.779Z] 	at sun.reflect.DelegatingMethodAccessorImpl.invoke(DelegatingMethodAccessorImpl.java:43)
[2019-06-14T09:21:53.779Z] 	at java.lang.reflect.Method.invoke(Method.java:606)
[2019-06-14T09:21:53.779Z] 	at org.apache.maven.shadefire.surefire.junit.JUnitTestSet.execute(JUnitTestSet.java:99)
[2019-06-14T09:21:53.779Z] 	at org.apache.maven.shadefire.surefire.junit.JUnit3Provider.executeTestSet(JUnit3Provider.java:140)
[2019-06-14T09:21:53.779Z] 	at org.apache.maven.shadefire.surefire.junit.JUnit3Provider.invoke(JUnit3Provider.java:113)
[2019-06-14T09:21:53.779Z] 	at org.apache.maven.shadefire.surefire.booter.ForkedBooter.invokeProviderInSameClassLoader(ForkedBooter.java:384)
[2019-06-14T09:21:53.779Z] 	at org.apache.maven.shadefire.surefire.booter.ForkedBooter.runSuitesInProcess(ForkedBooter.java:345)
[2019-06-14T09:21:53.779Z] 	at org.apache.maven.shadefire.surefire.booter.ForkedBooter.execute(ForkedBooter.java:126)
[2019-06-14T09:21:53.779Z] 	at org.apache.maven.shadefire.surefire.booter.ForkedBooter.main(ForkedBooter.java:418)
[2019-06-14T09:21:53.779Z] Caused by: java.lang.ClassNotFoundException: org.apache.maven.surefire.booter.CommandReaderTest
[2019-06-14T09:21:53.779Z] 	at java.net.URLClassLoader$1.run(URLClassLoader.java:366)
[2019-06-14T09:21:53.779Z] 	at java.net.URLClassLoader$1.run(URLClassLoader.java:355)
[2019-06-14T09:21:53.779Z] 	at java.security.AccessController.doPrivileged(Native Method)
[2019-06-14T09:21:53.779Z] 	at java.net.URLClassLoader.findClass(URLClassLoader.java:354)
[2019-06-14T09:21:53.779Z] 	at java.lang.ClassLoader.loadClass(ClassLoader.java:425)
[2019-06-14T09:21:53.779Z] 	at java.lang.ClassLoader.loadClass(ClassLoader.java:358)
[2019-06-14T09:21:53.779Z] 	at java.lang.Class.forName0(Native Method)
[2019-06-14T09:21:53.779Z] 	at java.lang.Class.forName(Class.java:274)
[2019-06-14T09:21:53.779Z] 	at org.apache.maven.surefire.booter.NewClassLoaderRunner.getFromTestClassLoader(NewClassLoaderRunner.java:185)
[2019-06-14T09:21:53.779Z] 	... 28 more
[2019-06-14T09:21:53.779Z] Caused by: java.lang.ClassNotFoundException: org.apache.maven.surefire.booter.CommandReaderTest
[2019-06-14T09:21:53.779Z] 	at java.net.URLClassLoader$1.run(URLClassLoader.java:366)
[2019-06-14T09:21:53.779Z] 	at java.net.URLClassLoader$1.run(URLClassLoader.java:355)
[2019-06-14T09:21:53.779Z] 	at java.security.AccessController.doPrivileged(Native Method)
[2019-06-14T09:21:53.779Z] 	at java.net.URLClassLoader.findClass(URLClassLoader.java:354)
[2019-06-14T09:21:53.779Z] 	at java.lang.ClassLoader.loadClass(ClassLoader.java:425)
[2019-06-14T09:21:53.779Z] 	at java.lang.ClassLoader.loadClass(ClassLoader.java:358)
[2019-06-14T09:21:53.779Z] 	at java.lang.Class.forName0(Native Method)
[2019-06-14T09:21:53.779Z] 	at java.lang.Class.forName(Class.java:274)
[2019-06-14T09:21:53.779Z] 	at org.apache.maven.surefire.booter.NewClassLoaderRunner.getFromTestClassLoader(NewClassLoaderRunner.java:185)
[2019-06-14T09:21:53.779Z] 	... 28 more
[2019-06-14T09:21:53.779Z] 
[2019-06-14T09:21:53.779Z] [INFO] 
[2019-06-14T09:21:53.779Z] [INFO] Results:
[2019-06-14T09:21:53.779Z] [INFO] 
[2019-06-14T09:21:53.779Z] [ERROR] Errors: 
[2019-06-14T09:21:53.779Z] [ERROR]   junit.framework.TestSuite#org.apache.maven.surefire.booter.CommandReaderTest IllegalStateException
[2019-06-14T09:21:53.779Z] [INFO] 
[2019-06-14T09:21:53.779Z] [ERROR] Tests run: 52, Failures: 0, Errors: 1, Skipped: 0
[2019-06-14T09:21:53.779Z] [INFO] 
[2019-06-14T09:21:53.779Z] [INFO] ------------------------------------------------------------------------
[2019-06-14T09:21:53.779Z] [INFO] Reactor Summary for Apache Maven Surefire 3.0.0-SNAPSHOT:
[2019-06-14T09:21:53.779Z] [INFO] 
[2019-06-14T09:21:53.779Z] [INFO] Apache Maven Surefire .............................. SUCCESS [  8.983 s]
[2019-06-14T09:21:53.779Z] [INFO] SureFire Logger API ................................ SUCCESS [  5.239 s]
[2019-06-14T09:21:53.779Z] [INFO] SureFire API ....................................... SUCCESS [ 17.661 s]
[2019-06-14T09:21:53.779Z] [INFO] SureFire Booter .................................... FAILURE [ 15.235 s]
[2019-06-14T09:21:53.779Z] [INFO] Maven Surefire Test-Grouping Support ............... SKIPPED
[2019-06-14T09:21:53.779Z] [INFO] SureFire Providers ................................. SKIPPED
[2019-06-14T09:21:53.779Z] [INFO] Shared JUnit3 Provider Code ........................ SKIPPED
[2019-06-14T09:21:53.779Z] [INFO] Shared Java 5 Provider Base ........................ SKIPPED
[2019-06-14T09:21:53.779Z] [INFO] Shared JUnit4 Provider Code ........................ SKIPPED
[2019-06-14T09:21:53.779Z] [INFO] Shared JUnit48 Provider Code ....................... SKIPPED
[2019-06-14T09:21:53.779Z] [INFO] SureFire JUnit Runner .............................. SKIPPED
[2019-06-14T09:21:53.779Z] [INFO] SureFire JUnit4 Runner ............................. SKIPPED
[2019-06-14T09:21:53.779Z] [INFO] Maven Surefire Common .............................. SKIPPED
[2019-06-14T09:21:53.779Z] [INFO] SureFire JUnitCore Runner .......................... SKIPPED
[2019-06-14T09:21:53.779Z] [INFO] SureFire JUnit Platform Runner ..................... SKIPPED
[2019-06-14T09:21:53.779Z] [INFO] SureFire TestNG Utils .............................. SKIPPED
[2019-06-14T09:21:53.779Z] [INFO] SureFire TestNG Runner ............................. SKIPPED
[2019-06-14T09:21:53.779Z] [INFO] ShadeFire JUnit3 Provider .......................... SKIPPED
[2019-06-14T09:21:53.779Z] [INFO] Surefire Report Parser ............................. SKIPPED
[2019-06-14T09:21:53.779Z] [INFO] Maven Surefire Plugin .............................. SKIPPED
[2019-06-14T09:21:53.779Z] [INFO] Maven Failsafe Plugin .............................. SKIPPED
[2019-06-14T09:21:53.779Z] [INFO] Maven Surefire Report Plugin ....................... SKIPPED
[2019-06-14T09:21:53.779Z] [INFO] Maven Surefire Integration Tests ................... SKIPPED
[2019-06-14T09:21:53.779Z] [INFO] ------------------------------------------------------------------------
[2019-06-14T09:21:53.779Z] [INFO] BUILD FAILURE
[2019-06-14T09:21:53.779Z] [INFO] ------------------------------------------------------------------------
[2019-06-14T09:21:53.779Z] [INFO] Total time:  48.101 s
[2019-06-14T09:21:53.779Z] [INFO] Finished at: 2019-06-14T02:21:53-07:00
[2019-06-14T09:21:53.779Z] [INFO] ------------------------------------------------------------------------
[2019-06-14T09:21:53.779Z] [ERROR] Failed to execute goal org.apache.maven.plugins:maven-surefire-plugin:3.0.0-M3:test (default-test) on project surefire-booter: There are test failures.
[2019-06-14T09:21:53.779Z] [ERROR] 
[2019-06-14T09:21:53.779Z] [ERROR] Please refer to C:\Users\jenkins\AppData\Local\Temp\2\jenkins-maven-box-maven-surefire-release%2F3.0.0-M5-6\surefire-booter\target\surefire-reports for the individual test results.
[2019-06-14T09:21:53.779Z] [ERROR] Please refer to dump files (if any exist) [date].dump, [date]-jvmRun[N].dump and [date].dumpstream.
[2019-06-14T09:21:53.779Z] [ERROR] -> [Help 1]
[2019-06-14T09:21:53.779Z] org.apache.maven.lifecycle.LifecycleExecutionException: Failed to execute goal org.apache.maven.plugins:maven-surefire-plugin:3.0.0-M3:test (default-test) on project surefire-booter: There are test failures.
[2019-06-14T09:21:53.779Z] 
[2019-06-14T09:21:53.779Z] Please refer to C:\Users\jenkins\AppData\Local\Temp\2\jenkins-maven-box-maven-surefire-release%2F3.0.0-M5-6\surefire-booter\target\surefire-reports for the individual test results.
[2019-06-14T09:21:53.779Z] Please refer to dump files (if any exist) [date].dump, [date]-jvmRun[N].dump and [date].dumpstream.
[2019-06-14T09:21:53.779Z]     at org.apache.maven.lifecycle.internal.MojoExecutor.execute (MojoExecutor.java:215)
[2019-06-14T09:21:53.779Z]     at org.apache.maven.lifecycle.internal.MojoExecutor.execute (MojoExecutor.java:156)
[2019-06-14T09:21:53.779Z]     at org.apache.maven.lifecycle.internal.MojoExecutor.execute (MojoExecutor.java:148)
[2019-06-14T09:21:53.779Z]     at org.apache.maven.lifecycle.internal.LifecycleModuleBuilder.buildProject (LifecycleModuleBuilder.java:117)
[2019-06-14T09:21:53.779Z]     at org.apache.maven.lifecycle.internal.LifecycleModuleBuilder.buildProject (LifecycleModuleBuilder.java:81)
[2019-06-14T09:21:53.779Z]     at org.apache.maven.lifecycle.internal.builder.singlethreaded.SingleThreadedBuilder.build (SingleThreadedBuilder.java:56)
[2019-06-14T09:21:53.779Z]     at org.apache.maven.lifecycle.internal.LifecycleStarter.execute (LifecycleStarter.java:128)
[2019-06-14T09:21:53.779Z]     at org.apache.maven.DefaultMaven.doExecute (DefaultMaven.java:305)
[2019-06-14T09:21:53.780Z]     at org.apache.maven.DefaultMaven.doExecute (DefaultMaven.java:192)
[2019-06-14T09:21:53.780Z]     at org.apache.maven.DefaultMaven.execute (DefaultMaven.java:105)
[2019-06-14T09:21:53.780Z]     at org.apache.maven.cli.MavenCli.execute (MavenCli.java:956)
[2019-06-14T09:21:53.780Z]     at org.apache.maven.cli.MavenCli.doMain (MavenCli.java:288)
[2019-06-14T09:21:53.780Z]     at org.apache.maven.cli.MavenCli.main (MavenCli.java:192)
[2019-06-14T09:21:53.780Z]     at sun.reflect.NativeMethodAccessorImpl.invoke0 (Native Method)
[2019-06-14T09:21:53.780Z]     at sun.reflect.NativeMethodAccessorImpl.invoke (NativeMethodAccessorImpl.java:62)
[2019-06-14T09:21:53.780Z]     at sun.reflect.DelegatingMethodAccessorImpl.invoke (DelegatingMethodAccessorImpl.java:43)
[2019-06-14T09:21:53.780Z]     at java.lang.reflect.Method.invoke (Method.java:498)
[2019-06-14T09:21:53.780Z]     at org.codehaus.plexus.classworlds.launcher.Launcher.launchEnhanced (Launcher.java:289)
[2019-06-14T09:21:53.780Z]     at org.codehaus.plexus.classworlds.launcher.Launcher.launch (Launcher.java:229)
[2019-06-14T09:21:53.780Z]     at org.codehaus.plexus.classworlds.launcher.Launcher.mainWithExitCode (Launcher.java:415)
[2019-06-14T09:21:53.780Z]     at org.codehaus.plexus.classworlds.launcher.Launcher.main (Launcher.java:356)
[2019-06-14T09:21:53.780Z] Caused by: org.apache.maven.plugin.MojoFailureException: There are test failures.
[2019-06-14T09:21:53.780Z] 
[2019-06-14T09:21:53.780Z] Please refer to C:\Users\jenkins\AppData\Local\Temp\2\jenkins-maven-box-maven-surefire-release%2F3.0.0-M5-6\surefire-booter\target\surefire-reports for the individual test results.
[2019-06-14T09:21:53.780Z] Please refer to dump files (if any exist) [date].dump, [date]-jvmRun[N].dump and [date].dumpstream.
[2019-06-14T09:21:53.780Z]     at org.apache.maven.plugin.surefire.SurefireHelper.throwException (SurefireHelper.java:271)
[2019-06-14T09:21:53.780Z]     at org.apache.maven.plugin.surefire.SurefireHelper.reportExecution (SurefireHelper.java:159)
[2019-06-14T09:21:53.780Z]     at org.apache.maven.plugin.surefire.SurefirePlugin.handleSummary (SurefirePlugin.java:373)
[2019-06-14T09:21:53.780Z]     at org.apache.maven.plugin.surefire.AbstractSurefireMojo.executeAfterPreconditionsChecked (AbstractSurefireMojo.java:1018)
[2019-06-14T09:21:53.780Z]     at org.apache.maven.plugin.surefire.AbstractSurefireMojo.execute (AbstractSurefireMojo.java:848)
[2019-06-14T09:21:53.780Z]     at org.apache.maven.plugin.DefaultBuildPluginManager.executeMojo (DefaultBuildPluginManager.java:137)
[2019-06-14T09:21:53.780Z]     at org.apache.maven.lifecycle.internal.MojoExecutor.execute (MojoExecutor.java:210)
[2019-06-14T09:21:53.780Z]     at org.apache.maven.lifecycle.internal.MojoExecutor.execute (MojoExecutor.java:156)
[2019-06-14T09:21:53.780Z]     at org.apache.maven.lifecycle.internal.MojoExecutor.execute (MojoExecutor.java:148)
[2019-06-14T09:21:53.780Z]     at org.apache.maven.lifecycle.internal.LifecycleModuleBuilder.buildProject (LifecycleModuleBuilder.java:117)
[2019-06-14T09:21:53.780Z]     at org.apache.maven.lifecycle.internal.LifecycleModuleBuilder.buildProject (LifecycleModuleBuilder.java:81)
[2019-06-14T09:21:53.780Z]     at org.apache.maven.lifecycle.internal.builder.singlethreaded.SingleThreadedBuilder.build (SingleThreadedBuilder.java:56)
[2019-06-14T09:21:53.780Z]     at org.apache.maven.lifecycle.internal.LifecycleStarter.execute (LifecycleStarter.java:128)
[2019-06-14T09:21:53.780Z]     at org.apache.maven.DefaultMaven.doExecute (DefaultMaven.java:305)
[2019-06-14T09:21:53.780Z]     at org.apache.maven.DefaultMaven.doExecute (DefaultMaven.java:192)
[2019-06-14T09:21:53.780Z]     at org.apache.maven.DefaultMaven.execute (DefaultMaven.java:105)
[2019-06-14T09:21:53.780Z]     at org.apache.maven.cli.MavenCli.execute (MavenCli.java:956)
[2019-06-14T09:21:53.780Z]     at org.apache.maven.cli.MavenCli.doMain (MavenCli.java:288)
[2019-06-14T09:21:53.780Z]     at org.apache.maven.cli.MavenCli.main (MavenCli.java:192)
[2019-06-14T09:21:53.780Z]     at sun.reflect.NativeMethodAccessorImpl.invoke0 (Native Method)
[2019-06-14T09:21:53.780Z]     at sun.reflect.NativeMethodAccessorImpl.invoke (NativeMethodAccessorImpl.java:62)
[2019-06-14T09:21:53.780Z]     at sun.reflect.DelegatingMethodAccessorImpl.invoke (DelegatingMethodAccessorImpl.java:43)
[2019-06-14T09:21:53.780Z]     at java.lang.reflect.Method.invoke (Method.java:498)
[2019-06-14T09:21:53.780Z]     at org.codehaus.plexus.classworlds.launcher.Launcher.launchEnhanced (Launcher.java:289)
[2019-06-14T09:21:53.780Z]     at org.codehaus.plexus.classworlds.launcher.Launcher.launch (Launcher.java:229)
[2019-06-14T09:21:53.780Z]     at org.codehaus.plexus.classworlds.launcher.Launcher.mainWithExitCode (Launcher.java:415)
[2019-06-14T09:21:53.780Z]     at org.codehaus.plexus.classworlds.launcher.Launcher.main (Launcher.java:356)
[2019-06-14T09:21:53.780Z] [ERROR] 
[2019-06-14T09:21:53.780Z] [ERROR] Re-run Maven using the -X switch to enable full debug logging.
[2019-06-14T09:21:53.780Z] [ERROR] 
[2019-06-14T09:21:53.780Z] [ERROR] For more information about the errors and possible solutions, please read the following articles:
[2019-06-14T09:21:53.780Z] [ERROR] [Help 1] http://cwiki.apache.org/confluence/display/MAVEN/MojoFailureException
[2019-06-14T09:21:53.780Z] [ERROR] 
[2019-06-14T09:21:53.780Z] [ERROR] After correcting the problems, you can resume the build with the command
[2019-06-14T09:21:53.780Z] [ERROR]   mvn <goals> -rf :surefire-booter
[Pipeline] }
[Pipeline] // withEnv
[Pipeline] }
[Pipeline] // stage
[Pipeline] fileExists
[Pipeline] fileExists
[Pipeline] archiveArtifacts
[2019-06-14T09:21:53.979Z] Archiving artifacts
[Pipeline] cleanWs
[2019-06-14T09:21:54.041Z] [WS-CLEANUP] Deleting project workspace...
[2019-06-14T09:21:54.041Z] [WS-CLEANUP] Deferred wipeout is used...
[2019-06-14T09:21:54.082Z] [WS-CLEANUP] done
[Pipeline] }
[Pipeline] // ws
[Pipeline] }
[Pipeline] // timestamps
[Pipeline] }
[Pipeline] // node
[Pipeline] }
[Pipeline] // parallel
[Pipeline] echo
Build result: FAILURE
[Pipeline] jiraIssueSelector
[Pipeline] emailext

Build failed in Jenkins: Maven TLP » maven-surefire » release/3.0.0-M5 #5

Posted by Apache Jenkins Server <je...@builds.apache.org>.
See https://builds.apache.org/job/maven-box/job/maven-surefire/job/release%252F3.0.0-M5/5/

No changes.

All tests passed

Build log:
[...truncated 23314 lines...]
[2019-06-10T07:08:40.193Z] [INFO] Running org.apache.maven.surefire.its.jiras.Surefire1122ParallelAndFlakyTestsIT
[2019-06-10T07:08:58.266Z] [INFO] Tests run: 3, Failures: 0, Errors: 0, Skipped: 0, Time elapsed: 16.327 s - in org.apache.maven.surefire.its.jiras.Surefire1122ParallelAndFlakyTestsIT
[2019-06-10T07:08:58.266Z] [INFO] Running org.apache.maven.surefire.its.jiras.Surefire1135ImproveIgnoreMessageForTestNGIT
[2019-06-10T07:09:09.339Z] [INFO] Tests run: 2, Failures: 0, Errors: 0, Skipped: 0, Time elapsed: 12.367 s - in org.apache.maven.surefire.its.jiras.Surefire1135ImproveIgnoreMessageForTestNGIT
[2019-06-10T07:09:09.339Z] [INFO] Running org.apache.maven.surefire.its.jiras.Surefire1136CwdPropagationInForkedModeIT
[2019-06-10T07:09:14.579Z] [INFO] Tests run: 1, Failures: 0, Errors: 0, Skipped: 0, Time elapsed: 5.237 s - in org.apache.maven.surefire.its.jiras.Surefire1136CwdPropagationInForkedModeIT
[2019-06-10T07:09:14.579Z] [INFO] Running org.apache.maven.surefire.its.jiras.Surefire1144XmlRunTimeIT
[2019-06-10T07:09:19.820Z] [INFO] Tests run: 1, Failures: 0, Errors: 0, Skipped: 0, Time elapsed: 5.897 s - in org.apache.maven.surefire.its.jiras.Surefire1144XmlRunTimeIT
[2019-06-10T07:09:19.820Z] [INFO] Running org.apache.maven.surefire.its.jiras.Surefire1152RerunFailingTestsInSuiteIT
[2019-06-10T07:09:32.902Z] [INFO] Tests run: 2, Failures: 0, Errors: 0, Skipped: 0, Time elapsed: 11.503 s - in org.apache.maven.surefire.its.jiras.Surefire1152RerunFailingTestsInSuiteIT
[2019-06-10T07:09:32.902Z] [INFO] Running org.apache.maven.surefire.its.jiras.Surefire1153IncludesAndSpecifiedTestIT
[2019-06-10T07:09:39.346Z] [INFO] Tests run: 2, Failures: 0, Errors: 0, Skipped: 0, Time elapsed: 8.349 s - in org.apache.maven.surefire.its.jiras.Surefire1153IncludesAndSpecifiedTestIT
[2019-06-10T07:09:39.346Z] [INFO] Running org.apache.maven.surefire.its.jiras.Surefire1158RemoveInfoLinesIT
[2019-06-10T07:10:13.572Z] [INFO] Tests run: 6, Failures: 0, Errors: 0, Skipped: 0, Time elapsed: 33.398 s - in org.apache.maven.surefire.its.jiras.Surefire1158RemoveInfoLinesIT
[2019-06-10T07:10:13.573Z] [INFO] Running org.apache.maven.surefire.its.jiras.Surefire1177TestngParallelSuitesIT
[2019-06-10T07:10:28.999Z] [INFO] Tests run: 2, Failures: 0, Errors: 0, Skipped: 0, Time elapsed: 14.432 s - in org.apache.maven.surefire.its.jiras.Surefire1177TestngParallelSuitesIT
[2019-06-10T07:10:28.999Z] [INFO] Running org.apache.maven.surefire.its.jiras.Surefire1179IT
[2019-06-10T07:10:38.367Z] [INFO] Tests run: 1, Failures: 0, Errors: 0, Skipped: 0, Time elapsed: 9.684 s - in org.apache.maven.surefire.its.jiras.Surefire1179IT
[2019-06-10T07:10:38.367Z] [INFO] Running org.apache.maven.surefire.its.jiras.Surefire1185DoNotSpawnTestsIT
[2019-06-10T07:10:41.563Z] [INFO] Tests run: 1, Failures: 0, Errors: 0, Skipped: 0, Time elapsed: 4.21 s - in org.apache.maven.surefire.its.jiras.Surefire1185DoNotSpawnTestsIT
[2019-06-10T07:10:41.563Z] [INFO] Running org.apache.maven.surefire.its.jiras.Surefire1202RerunAndSkipIT
[2019-06-10T07:11:22.012Z] [INFO] Tests run: 2, Failures: 0, Errors: 0, Skipped: 0, Time elapsed: 35.969 s - in org.apache.maven.surefire.its.jiras.Surefire1202RerunAndSkipIT
[2019-06-10T07:11:22.012Z] [INFO] Running org.apache.maven.surefire.its.jiras.Surefire1209RerunAndForkCountIT
[2019-06-10T07:12:28.160Z] [INFO] Tests run: 4, Failures: 0, Errors: 0, Skipped: 0, Time elapsed: 62.337 s - in org.apache.maven.surefire.its.jiras.Surefire1209RerunAndForkCountIT
[2019-06-10T07:12:28.160Z] [INFO] Running org.apache.maven.surefire.its.jiras.Surefire1211JUnitTestNgIT
[2019-06-10T07:12:31.351Z] [INFO] Tests run: 2, Failures: 0, Errors: 0, Skipped: 0, Time elapsed: 11.331 s - in org.apache.maven.surefire.its.jiras.Surefire1211JUnitTestNgIT
[2019-06-10T07:12:31.351Z] [INFO] Running org.apache.maven.surefire.its.jiras.Surefire1264IT
[2019-06-10T07:12:44.425Z] [INFO] Tests run: 2, Failures: 0, Errors: 0, Skipped: 0, Time elapsed: 13.639 s - in org.apache.maven.surefire.its.jiras.Surefire1264IT
[2019-06-10T07:12:44.425Z] [INFO] Running org.apache.maven.surefire.its.jiras.Surefire1265Java9IT
[2019-06-10T07:12:44.425Z] [WARNING] Tests run: 1, Failures: 0, Errors: 0, Skipped: 1, Time elapsed: 0 s - in org.apache.maven.surefire.its.jiras.Surefire1265Java9IT
[2019-06-10T07:12:44.425Z] [INFO] Running org.apache.maven.surefire.its.jiras.Surefire1278GroupNameEndingIT
[2019-06-10T07:12:52.228Z] [INFO] Tests run: 1, Failures: 0, Errors: 0, Skipped: 0, Time elapsed: 7.388 s - in org.apache.maven.surefire.its.jiras.Surefire1278GroupNameEndingIT
[2019-06-10T07:12:52.228Z] [INFO] Running org.apache.maven.surefire.its.jiras.Surefire1295AttributeJvmCrashesToTestsIT
[2019-06-10T07:14:10.383Z] [INFO] Tests run: 9, Failures: 0, Errors: 0, Skipped: 0, Time elapsed: 75.186 s - in org.apache.maven.surefire.its.jiras.Surefire1295AttributeJvmCrashesToTestsIT
[2019-06-10T07:14:10.383Z] [INFO] Running org.apache.maven.surefire.its.jiras.Surefire1364SystemPropertiesIT
[2019-06-10T07:15:06.239Z] [INFO] Tests run: 10, Failures: 0, Errors: 0, Skipped: 0, Time elapsed: 58.573 s - in org.apache.maven.surefire.its.jiras.Surefire1364SystemPropertiesIT
[2019-06-10T07:15:06.239Z] [INFO] Running org.apache.maven.surefire.its.jiras.Surefire1367AssumptionLogsIT
[2019-06-10T07:15:27.451Z] [INFO] Tests run: 4, Failures: 0, Errors: 0, Skipped: 0, Time elapsed: 20.12 s - in org.apache.maven.surefire.its.jiras.Surefire1367AssumptionLogsIT
[2019-06-10T07:15:27.451Z] [INFO] Running org.apache.maven.surefire.its.jiras.Surefire1383ScanSessionDependenciesIT
[2019-06-10T07:15:35.459Z] [INFO] Tests run: 1, Failures: 0, Errors: 0, Skipped: 0, Time elapsed: 9.314 s - in org.apache.maven.surefire.its.jiras.Surefire1383ScanSessionDependenciesIT
[2019-06-10T07:15:35.460Z] [INFO] Running org.apache.maven.surefire.its.jiras.Surefire1396CustomProviderClassPathIT
[2019-06-10T07:15:48.688Z] [INFO] Tests run: 1, Failures: 0, Errors: 0, Skipped: 0, Time elapsed: 13.151 s - in org.apache.maven.surefire.its.jiras.Surefire1396CustomProviderClassPathIT
[2019-06-10T07:15:48.688Z] [INFO] Running org.apache.maven.surefire.its.jiras.Surefire141PluggableProvidersIT
[2019-06-10T07:16:18.170Z] [INFO] Tests run: 4, Failures: 0, Errors: 0, Skipped: 0, Time elapsed: 28.798 s - in org.apache.maven.surefire.its.jiras.Surefire141PluggableProvidersIT
[2019-06-10T07:16:18.170Z] [INFO] Running org.apache.maven.surefire.its.jiras.Surefire146ForkPerTestNoSetupIT
[2019-06-10T07:16:22.345Z] [INFO] Tests run: 1, Failures: 0, Errors: 0, Skipped: 0, Time elapsed: 4.892 s - in org.apache.maven.surefire.its.jiras.Surefire146ForkPerTestNoSetupIT
[2019-06-10T07:16:22.345Z] [INFO] Running org.apache.maven.surefire.its.jiras.Surefire1490ReportTitleDescriptionIT
[2019-06-10T07:16:47.363Z] [INFO] Tests run: 2, Failures: 0, Errors: 0, Skipped: 0, Time elapsed: 24.179 s - in org.apache.maven.surefire.its.jiras.Surefire1490ReportTitleDescriptionIT
[2019-06-10T07:16:47.363Z] [INFO] Running org.apache.maven.surefire.its.jiras.Surefire1534ReuseForksFalseWithJavaModuleIT
[2019-06-10T07:16:47.363Z] [WARNING] Tests run: 3, Failures: 0, Errors: 0, Skipped: 3, Time elapsed: 0.001 s - in org.apache.maven.surefire.its.jiras.Surefire1534ReuseForksFalseWithJavaModuleIT
[2019-06-10T07:16:47.363Z] [INFO] Running org.apache.maven.surefire.its.jiras.Surefire1535TestNGParallelSuitesIT
[2019-06-10T07:17:17.025Z] [INFO] Tests run: 4, Failures: 0, Errors: 0, Skipped: 0, Time elapsed: 27.713 s - in org.apache.maven.surefire.its.jiras.Surefire1535TestNGParallelSuitesIT
[2019-06-10T07:17:17.025Z] [INFO] Running org.apache.maven.surefire.its.jiras.Surefire1585IT
[2019-06-10T07:17:17.025Z] [WARNING] Tests run: 2, Failures: 0, Errors: 0, Skipped: 2, Time elapsed: 0.001 s - in org.apache.maven.surefire.its.jiras.Surefire1585IT
[2019-06-10T07:17:17.025Z] [INFO] Running org.apache.maven.surefire.its.jiras.Surefire162CharsetProviderIT
[2019-06-10T07:17:19.330Z] [INFO] Tests run: 1, Failures: 0, Errors: 0, Skipped: 0, Time elapsed: 4.761 s - in org.apache.maven.surefire.its.jiras.Surefire162CharsetProviderIT
[2019-06-10T07:17:19.330Z] [INFO] Running org.apache.maven.surefire.its.jiras.Surefire224WellFormedXmlFailuresIT
[2019-06-10T07:17:23.506Z] [INFO] Tests run: 1, Failures: 0, Errors: 0, Skipped: 0, Time elapsed: 4.811 s - in org.apache.maven.surefire.its.jiras.Surefire224WellFormedXmlFailuresIT
[2019-06-10T07:17:23.506Z] [INFO] Running org.apache.maven.surefire.its.jiras.Surefire257NotRerunningTestsIT
[2019-06-10T07:17:30.358Z] [INFO] Tests run: 1, Failures: 0, Errors: 0, Skipped: 0, Time elapsed: 6.809 s - in org.apache.maven.surefire.its.jiras.Surefire257NotRerunningTestsIT
[2019-06-10T07:17:30.358Z] [INFO] Running org.apache.maven.surefire.its.jiras.Surefire260TestWithIdenticalNamesIT
[2019-06-10T07:17:30.358Z] [WARNING] Tests run: 1, Failures: 0, Errors: 0, Skipped: 1, Time elapsed: 0 s - in org.apache.maven.surefire.its.jiras.Surefire260TestWithIdenticalNamesIT
[2019-06-10T07:17:30.358Z] [INFO] Running org.apache.maven.surefire.its.jiras.Surefire34SecurityManagerIT
[2019-06-10T07:17:41.458Z] [INFO] Tests run: 2, Failures: 0, Errors: 0, Skipped: 0, Time elapsed: 9.633 s - in org.apache.maven.surefire.its.jiras.Surefire34SecurityManagerIT
[2019-06-10T07:17:41.458Z] [INFO] Running org.apache.maven.surefire.its.jiras.Surefire376TestNgAfterSuiteFailureIT
[2019-06-10T07:17:45.628Z] [INFO] Tests run: 1, Failures: 0, Errors: 0, Skipped: 0, Time elapsed: 5.289 s - in org.apache.maven.surefire.its.jiras.Surefire376TestNgAfterSuiteFailureIT
[2019-06-10T07:17:45.628Z] [INFO] Running org.apache.maven.surefire.its.jiras.Surefire377TestNgAndJUnitTogetherIT
[2019-06-10T07:17:56.700Z] [INFO] Tests run: 2, Failures: 0, Errors: 0, Skipped: 0, Time elapsed: 10.179 s - in org.apache.maven.surefire.its.jiras.Surefire377TestNgAndJUnitTogetherIT
[2019-06-10T07:17:56.700Z] [INFO] Running org.apache.maven.surefire.its.jiras.Surefire408ManualProviderSelectionIT
[2019-06-10T07:18:00.860Z] [INFO] Tests run: 1, Failures: 0, Errors: 0, Skipped: 0, Time elapsed: 4.997 s - in org.apache.maven.surefire.its.jiras.Surefire408ManualProviderSelectionIT
[2019-06-10T07:18:00.861Z] [INFO] Running org.apache.maven.surefire.its.jiras.Surefire42NotExtendingTestCaseIT
[2019-06-10T07:18:06.097Z] [INFO] Tests run: 1, Failures: 0, Errors: 0, Skipped: 0, Time elapsed: 4.722 s - in org.apache.maven.surefire.its.jiras.Surefire42NotExtendingTestCaseIT
[2019-06-10T07:18:06.097Z] [INFO] Running org.apache.maven.surefire.its.jiras.Surefire44InnerClassTestIT
[2019-06-10T07:18:10.252Z] [INFO] Tests run: 1, Failures: 0, Errors: 0, Skipped: 0, Time elapsed: 4.753 s - in org.apache.maven.surefire.its.jiras.Surefire44InnerClassTestIT
[2019-06-10T07:18:10.252Z] [INFO] Running org.apache.maven.surefire.its.jiras.Surefire500PuzzlingErrorIT
[2019-06-10T07:18:15.490Z] [INFO] Tests run: 1, Failures: 0, Errors: 0, Skipped: 0, Time elapsed: 5.21 s - in org.apache.maven.surefire.its.jiras.Surefire500PuzzlingErrorIT
[2019-06-10T07:18:15.490Z] [INFO] Running org.apache.maven.surefire.its.jiras.Surefire510TestClassPathForkModesIT
[2019-06-10T07:18:24.819Z] [INFO] Tests run: 2, Failures: 0, Errors: 0, Skipped: 0, Time elapsed: 9.69 s - in org.apache.maven.surefire.its.jiras.Surefire510TestClassPathForkModesIT
[2019-06-10T07:18:24.819Z] [INFO] Running org.apache.maven.surefire.its.jiras.Surefire569RunTestFromDependencyJarsIT
[2019-06-10T07:18:30.352Z] [INFO] Tests run: 1, Failures: 0, Errors: 0, Skipped: 0, Time elapsed: 4.713 s - in org.apache.maven.surefire.its.jiras.Surefire569RunTestFromDependencyJarsIT
[2019-06-10T07:18:30.352Z] [INFO] Running org.apache.maven.surefire.its.jiras.Surefire570MultipleReportDirectoriesIT
[2019-06-10T07:18:55.402Z] [INFO] Tests run: 2, Failures: 0, Errors: 0, Skipped: 0, Time elapsed: 25.747 s - in org.apache.maven.surefire.its.jiras.Surefire570MultipleReportDirectoriesIT
[2019-06-10T07:18:55.402Z] [INFO] Running org.apache.maven.surefire.its.jiras.Surefire613TestCountInParallelIT
[2019-06-10T07:19:01.851Z] [INFO] Tests run: 1, Failures: 0, Errors: 0, Skipped: 0, Time elapsed: 5.651 s - in org.apache.maven.surefire.its.jiras.Surefire613TestCountInParallelIT
[2019-06-10T07:19:01.851Z] [INFO] Running org.apache.maven.surefire.its.jiras.Surefire621TestCountingJunit3InParallelIT
[2019-06-10T07:19:31.000Z] [INFO] Tests run: 5, Failures: 0, Errors: 0, Skipped: 0, Time elapsed: 29.893 s - in org.apache.maven.surefire.its.jiras.Surefire621TestCountingJunit3InParallelIT
[2019-06-10T07:19:31.000Z] [INFO] Running org.apache.maven.surefire.its.jiras.Surefire628ConsoleOutputBeforeAndAfterClassIT
[2019-06-10T07:19:37.444Z] [INFO] Tests run: 1, Failures: 0, Errors: 0, Skipped: 0, Time elapsed: 5.806 s - in org.apache.maven.surefire.its.jiras.Surefire628ConsoleOutputBeforeAndAfterClassIT
[2019-06-10T07:19:37.444Z] [INFO] Running org.apache.maven.surefire.its.jiras.Surefire634UnsettableSystemPropertiesWarningIT
[2019-06-10T07:19:42.683Z] [INFO] Tests run: 1, Failures: 0, Errors: 0, Skipped: 0, Time elapsed: 5.276 s - in org.apache.maven.surefire.its.jiras.Surefire634UnsettableSystemPropertiesWarningIT
[2019-06-10T07:19:42.683Z] [INFO] Running org.apache.maven.surefire.its.jiras.Surefire649EmptyStringSystemPropertiesIT
[2019-06-10T07:19:50.475Z] [INFO] Tests run: 2, Failures: 0, Errors: 0, Skipped: 0, Time elapsed: 8.251 s - in org.apache.maven.surefire.its.jiras.Surefire649EmptyStringSystemPropertiesIT
[2019-06-10T07:19:50.475Z] [INFO] Running org.apache.maven.surefire.its.jiras.Surefire673MockitoIT
[2019-06-10T07:19:56.920Z] [INFO] Tests run: 1, Failures: 0, Errors: 0, Skipped: 0, Time elapsed: 6.323 s - in org.apache.maven.surefire.its.jiras.Surefire673MockitoIT
[2019-06-10T07:19:56.920Z] [INFO] Running org.apache.maven.surefire.its.jiras.Surefire674BuildFailingWhenErrorsIT
[2019-06-10T07:20:02.157Z] [INFO] Tests run: 1, Failures: 0, Errors: 0, Skipped: 0, Time elapsed: 5.195 s - in org.apache.maven.surefire.its.jiras.Surefire674BuildFailingWhenErrorsIT
[2019-06-10T07:20:02.157Z] [INFO] Running org.apache.maven.surefire.its.jiras.Surefire674BuildFailingWhenFailsafeErrorsIT
[2019-06-10T07:20:08.784Z] [INFO] Tests run: 1, Failures: 0, Errors: 0, Skipped: 0, Time elapsed: 7.037 s - in org.apache.maven.surefire.its.jiras.Surefire674BuildFailingWhenFailsafeErrorsIT
[2019-06-10T07:20:08.784Z] [INFO] Running org.apache.maven.surefire.its.jiras.Surefire685CommaSeparatedIncludesIT
[2019-06-10T07:20:14.024Z] [INFO] Tests run: 1, Failures: 0, Errors: 0, Skipped: 0, Time elapsed: 4.898 s - in org.apache.maven.surefire.its.jiras.Surefire685CommaSeparatedIncludesIT
[2019-06-10T07:20:14.024Z] [INFO] Running org.apache.maven.surefire.its.jiras.Surefire697NiceSummaryIT
[2019-06-10T07:20:19.262Z] [INFO] Tests run: 1, Failures: 0, Errors: 0, Skipped: 0, Time elapsed: 4.686 s - in org.apache.maven.surefire.its.jiras.Surefire697NiceSummaryIT
[2019-06-10T07:20:19.262Z] [INFO] Running org.apache.maven.surefire.its.jiras.Surefire705ParallelForkTimeoutIT
[2019-06-10T07:20:25.702Z] [INFO] Tests run: 1, Failures: 0, Errors: 0, Skipped: 0, Time elapsed: 7.423 s - in org.apache.maven.surefire.its.jiras.Surefire705ParallelForkTimeoutIT
[2019-06-10T07:20:25.702Z] [INFO] Running org.apache.maven.surefire.its.jiras.Surefire733AllOverrridesCapturedIT
[2019-06-10T07:20:34.333Z] [INFO] Tests run: 1, Failures: 0, Errors: 0, Skipped: 0, Time elapsed: 4.817 s - in org.apache.maven.surefire.its.jiras.Surefire733AllOverrridesCapturedIT
[2019-06-10T07:20:34.333Z] [INFO] Running org.apache.maven.surefire.its.jiras.Surefire735ForkFailWithRedirectConsoleOutputIT
[2019-06-10T07:20:39.568Z] [INFO] Tests run: 2, Failures: 0, Errors: 0, Skipped: 0, Time elapsed: 8.613 s - in org.apache.maven.surefire.its.jiras.Surefire735ForkFailWithRedirectConsoleOutputIT
[2019-06-10T07:20:39.568Z] [INFO] Running org.apache.maven.surefire.its.jiras.Surefire740TruncatedCommaIT
[2019-06-10T07:20:46.009Z] [INFO] Tests run: 1, Failures: 0, Errors: 0, Skipped: 0, Time elapsed: 5.839 s - in org.apache.maven.surefire.its.jiras.Surefire740TruncatedCommaIT
[2019-06-10T07:20:46.009Z] [INFO] Running org.apache.maven.surefire.its.jiras.Surefire747MethodParallelWithSuiteCountIT
[2019-06-10T07:21:07.199Z] [INFO] Tests run: 2, Failures: 0, Errors: 0, Skipped: 0, Time elapsed: 21.982 s - in org.apache.maven.surefire.its.jiras.Surefire747MethodParallelWithSuiteCountIT
[2019-06-10T07:21:07.199Z] [INFO] Running org.apache.maven.surefire.its.jiras.Surefire772BothReportsIT
[2019-06-10T07:21:18.552Z] [INFO] Tests run: 3, Failures: 0, Errors: 0, Skipped: 0, Time elapsed: 10.321 s - in org.apache.maven.surefire.its.jiras.Surefire772BothReportsIT
[2019-06-10T07:21:18.552Z] [INFO] Running org.apache.maven.surefire.its.jiras.Surefire772NoFailsafeReportsIT
[2019-06-10T07:21:31.626Z] [INFO] Tests run: 4, Failures: 0, Errors: 0, Skipped: 0, Time elapsed: 13.68 s - in org.apache.maven.surefire.its.jiras.Surefire772NoFailsafeReportsIT
[2019-06-10T07:21:31.626Z] [INFO] Running org.apache.maven.surefire.its.jiras.Surefire772NoSurefireReportsIT
[2019-06-10T07:21:44.953Z] [INFO] Tests run: 4, Failures: 0, Errors: 0, Skipped: 0, Time elapsed: 13.728 s - in org.apache.maven.surefire.its.jiras.Surefire772NoSurefireReportsIT
[2019-06-10T07:21:44.953Z] [INFO] Running org.apache.maven.surefire.its.jiras.Surefire772SpecifiedReportsIT
[2019-06-10T07:21:56.037Z] [INFO] Tests run: 3, Failures: 0, Errors: 0, Skipped: 0, Time elapsed: 10.303 s - in org.apache.maven.surefire.its.jiras.Surefire772SpecifiedReportsIT
[2019-06-10T07:21:56.037Z] [INFO] Running org.apache.maven.surefire.its.jiras.Surefire801ForkModeNoneClassLoaderIT
[2019-06-10T07:22:00.199Z] [INFO] Tests run: 1, Failures: 0, Errors: 0, Skipped: 0, Time elapsed: 4.295 s - in org.apache.maven.surefire.its.jiras.Surefire801ForkModeNoneClassLoaderIT
[2019-06-10T07:22:00.199Z] [INFO] Running org.apache.maven.surefire.its.jiras.Surefire803MultiFailsafeExecsIT
[2019-06-10T07:22:18.334Z] [INFO] Tests run: 2, Failures: 0, Errors: 0, Skipped: 0, Time elapsed: 17.811 s - in org.apache.maven.surefire.its.jiras.Surefire803MultiFailsafeExecsIT
[2019-06-10T07:22:18.335Z] [INFO] Running org.apache.maven.surefire.its.jiras.Surefire806SpecifiedTestControlsIT
[2019-06-10T07:22:21.513Z] [WARNING] Tests run: 3, Failures: 0, Errors: 0, Skipped: 2, Time elapsed: 4.401 s - in org.apache.maven.surefire.its.jiras.Surefire806SpecifiedTestControlsIT
[2019-06-10T07:22:21.513Z] [INFO] Running org.apache.maven.surefire.its.jiras.Surefire809GroupExpressionsIT
[2019-06-10T07:22:56.112Z] [INFO] Tests run: 6, Failures: 0, Errors: 0, Skipped: 0, Time elapsed: 33.736 s - in org.apache.maven.surefire.its.jiras.Surefire809GroupExpressionsIT
[2019-06-10T07:22:56.112Z] [INFO] Running org.apache.maven.surefire.its.jiras.Surefire812Log4JClassLoaderIT
[2019-06-10T07:23:01.621Z] [INFO] Tests run: 1, Failures: 0, Errors: 0, Skipped: 0, Time elapsed: 6.055 s - in org.apache.maven.surefire.its.jiras.Surefire812Log4JClassLoaderIT
[2019-06-10T07:23:01.621Z] [INFO] Running org.apache.maven.surefire.its.jiras.Surefire817SystemExitIT
[2019-06-10T07:23:08.060Z] [INFO] Tests run: 1, Failures: 0, Errors: 0, Skipped: 0, Time elapsed: 5.596 s - in org.apache.maven.surefire.its.jiras.Surefire817SystemExitIT
[2019-06-10T07:23:08.060Z] [INFO] Running org.apache.maven.surefire.its.jiras.Surefire818NpeIgnoresTestsIT
[2019-06-10T07:23:13.369Z] [INFO] Tests run: 1, Failures: 0, Errors: 0, Skipped: 0, Time elapsed: 5.844 s - in org.apache.maven.surefire.its.jiras.Surefire818NpeIgnoresTestsIT
[2019-06-10T07:23:13.369Z] [INFO] Running org.apache.maven.surefire.its.jiras.Surefire828EmptyGroupExprIT
[2019-06-10T07:23:38.514Z] [INFO] Tests run: 4, Failures: 0, Errors: 0, Skipped: 0, Time elapsed: 25.054 s - in org.apache.maven.surefire.its.jiras.Surefire828EmptyGroupExprIT
[2019-06-10T07:23:38.514Z] [INFO] Running org.apache.maven.surefire.its.jiras.Surefire832ProviderSelectionIT
[2019-06-10T07:23:44.957Z] [INFO] Tests run: 1, Failures: 0, Errors: 0, Skipped: 0, Time elapsed: 6.525 s - in org.apache.maven.surefire.its.jiras.Surefire832ProviderSelectionIT
[2019-06-10T07:23:44.957Z] [INFO] Running org.apache.maven.surefire.its.jiras.Surefire839TestWithoutCategoriesIT
[2019-06-10T07:23:58.325Z] [INFO] Tests run: 2, Failures: 0, Errors: 0, Skipped: 0, Time elapsed: 13.257 s - in org.apache.maven.surefire.its.jiras.Surefire839TestWithoutCategoriesIT
[2019-06-10T07:23:58.325Z] [INFO] Running org.apache.maven.surefire.its.jiras.Surefire847AdditionalFailureIT
[2019-06-10T07:24:04.916Z] [INFO] Tests run: 1, Failures: 0, Errors: 0, Skipped: 0, Time elapsed: 6.189 s - in org.apache.maven.surefire.its.jiras.Surefire847AdditionalFailureIT
[2019-06-10T07:24:04.916Z] [INFO] Running org.apache.maven.surefire.its.jiras.Surefire855AllowFailsafeUseArtifactFileIT
[2019-06-10T07:24:52.406Z] [INFO] Tests run: 4, Failures: 0, Errors: 0, Skipped: 0, Time elapsed: 41.411 s - in org.apache.maven.surefire.its.jiras.Surefire855AllowFailsafeUseArtifactFileIT
[2019-06-10T07:24:52.406Z] [INFO] Running org.apache.maven.surefire.its.jiras.Surefire901MIssingResultfileWhenNoTestsIT
[2019-06-10T07:24:52.406Z] [INFO] Tests run: 1, Failures: 0, Errors: 0, Skipped: 0, Time elapsed: 4.126 s - in org.apache.maven.surefire.its.jiras.Surefire901MIssingResultfileWhenNoTestsIT
[2019-06-10T07:24:52.406Z] [INFO] Running org.apache.maven.surefire.its.jiras.Surefire907PerThreadWithoutThreadCountIT
[2019-06-10T07:24:53.877Z] [INFO] Tests run: 1, Failures: 0, Errors: 0, Skipped: 0, Time elapsed: 3.866 s - in org.apache.maven.surefire.its.jiras.Surefire907PerThreadWithoutThreadCountIT
[2019-06-10T07:24:53.877Z] [INFO] Running org.apache.maven.surefire.its.jiras.Surefire920TestFailureIgnoreWithTimeoutIT
[2019-06-10T07:25:09.423Z] [INFO] Tests run: 2, Failures: 0, Errors: 0, Skipped: 0, Time elapsed: 13.895 s - in org.apache.maven.surefire.its.jiras.Surefire920TestFailureIgnoreWithTimeoutIT
[2019-06-10T07:25:09.423Z] [INFO] Running org.apache.maven.surefire.its.jiras.Surefire926FailureWith2ProvidersIT
[2019-06-10T07:25:17.222Z] [INFO] Tests run: 1, Failures: 0, Errors: 0, Skipped: 0, Time elapsed: 8.805 s - in org.apache.maven.surefire.its.jiras.Surefire926FailureWith2ProvidersIT
[2019-06-10T07:25:17.222Z] [INFO] Running org.apache.maven.surefire.its.jiras.Surefire930TestNgSuiteXmlIT
[2019-06-10T07:25:22.528Z] [INFO] Tests run: 1, Failures: 0, Errors: 0, Skipped: 0, Time elapsed: 6.025 s - in org.apache.maven.surefire.its.jiras.Surefire930TestNgSuiteXmlIT
[2019-06-10T07:25:22.528Z] [INFO] Running org.apache.maven.surefire.its.jiras.Surefire943ReportContentIT
[2019-06-10T07:25:51.721Z] [INFO] Tests run: 2, Failures: 0, Errors: 0, Skipped: 0, Time elapsed: 25.913 s - in org.apache.maven.surefire.its.jiras.Surefire943ReportContentIT
[2019-06-10T07:25:51.721Z] [INFO] Running org.apache.maven.surefire.its.jiras.Surefire946KillMainProcessInReusableForkIT
[2019-06-10T07:26:12.921Z] [INFO] Tests run: 3, Failures: 0, Errors: 0, Skipped: 0, Time elapsed: 24.186 s - in org.apache.maven.surefire.its.jiras.Surefire946KillMainProcessInReusableForkIT
[2019-06-10T07:26:12.921Z] [INFO] Running org.apache.maven.surefire.its.jiras.Surefire972BizarreNoClassDefIT
[2019-06-10T07:26:20.716Z] [INFO] Tests run: 1, Failures: 0, Errors: 0, Skipped: 0, Time elapsed: 7.273 s - in org.apache.maven.surefire.its.jiras.Surefire972BizarreNoClassDefIT
[2019-06-10T07:26:20.716Z] [INFO] Running org.apache.maven.surefire.its.jiras.Surefire975DefaultVMEncodingIT
[2019-06-10T07:26:27.154Z] [INFO] Tests run: 1, Failures: 0, Errors: 0, Skipped: 0, Time elapsed: 6.972 s - in org.apache.maven.surefire.its.jiras.Surefire975DefaultVMEncodingIT
[2019-06-10T07:26:27.154Z] [INFO] Running org.apache.maven.surefire.its.jiras.Surefire979WrongClassLoaderIT
[2019-06-10T07:26:32.396Z] [INFO] Tests run: 1, Failures: 0, Errors: 0, Skipped: 0, Time elapsed: 5.109 s - in org.apache.maven.surefire.its.jiras.Surefire979WrongClassLoaderIT
[2019-06-10T07:26:32.397Z] [INFO] Running org.apache.maven.surefire.its.jiras.Surefire985ParameterizedRunnerAndCategoriesIT
[2019-06-10T07:26:36.559Z] [INFO] Tests run: 1, Failures: 0, Errors: 0, Skipped: 0, Time elapsed: 4.982 s - in org.apache.maven.surefire.its.jiras.Surefire985ParameterizedRunnerAndCategoriesIT
[2019-06-10T07:26:36.559Z] [INFO] Running org.apache.maven.surefire.its.jiras.Surefire995CategoryInheritanceIT
[2019-06-10T07:27:01.426Z] [INFO] Tests run: 5, Failures: 0, Errors: 0, Skipped: 0, Time elapsed: 24.015 s - in org.apache.maven.surefire.its.jiras.Surefire995CategoryInheritanceIT
[2019-06-10T07:27:01.426Z] [INFO] 
[2019-06-10T07:27:01.426Z] [INFO] Results:
[2019-06-10T07:27:01.426Z] [INFO] 
[2019-06-10T07:27:01.427Z] [WARNING] Tests run: 792, Failures: 0, Errors: 0, Skipped: 165
[2019-06-10T07:27:01.427Z] [INFO] 
[2019-06-10T07:27:01.427Z] [INFO] 
[2019-06-10T07:27:01.427Z] [INFO] --- maven-checkstyle-plugin:3.0.0:check (checkstyle-check) @ surefire-its ---
[2019-06-10T07:27:02.136Z] [INFO] 
[2019-06-10T07:27:02.136Z] [INFO] --- maven-failsafe-plugin:3.0.0-M3:verify (default) @ surefire-its ---
[2019-06-10T07:27:02.136Z] [INFO] Failsafe report directory: /home/jenkins/jenkins-slave/workspace/_maven-surefire_release_3.0.0-M5@2/surefire-its/target/failsafe-reports
[2019-06-10T07:27:02.136Z] [INFO] 
[2019-06-10T07:27:02.136Z] [INFO] --- maven-install-plugin:2.5.2:install (default-install) @ surefire-its ---
[2019-06-10T07:27:02.136Z] [INFO] Skipping artifact installation
[2019-06-10T07:27:02.136Z] [INFO] ------------------------------------------------------------------------
[2019-06-10T07:27:02.136Z] [INFO] Reactor Summary for Apache Maven Surefire 3.0.0-SNAPSHOT:
[2019-06-10T07:27:02.136Z] [INFO] 
[2019-06-10T07:27:02.136Z] [INFO] Apache Maven Surefire .............................. SUCCESS [ 20.127 s]
[2019-06-10T07:27:02.136Z] [INFO] SureFire Logger API ................................ SUCCESS [  4.311 s]
[2019-06-10T07:27:02.136Z] [INFO] SureFire API ....................................... SUCCESS [ 12.703 s]
[2019-06-10T07:27:02.136Z] [INFO] SureFire Booter .................................... SUCCESS [ 11.954 s]
[2019-06-10T07:27:02.136Z] [INFO] Maven Surefire Test-Grouping Support ............... SUCCESS [  5.835 s]
[2019-06-10T07:27:02.136Z] [INFO] SureFire Providers ................................. SUCCESS [  1.179 s]
[2019-06-10T07:27:02.136Z] [INFO] Shared JUnit3 Provider Code ........................ SUCCESS [  4.466 s]
[2019-06-10T07:27:02.136Z] [INFO] Shared Java 5 Provider Base ........................ SUCCESS [  4.712 s]
[2019-06-10T07:27:02.136Z] [INFO] Shared JUnit4 Provider Code ........................ SUCCESS [  4.718 s]
[2019-06-10T07:27:02.136Z] [INFO] Shared JUnit48 Provider Code ....................... SUCCESS [  5.668 s]
[2019-06-10T07:27:02.136Z] [INFO] SureFire JUnit Runner .............................. SUCCESS [  4.223 s]
[2019-06-10T07:27:02.136Z] [INFO] SureFire JUnit4 Runner ............................. SUCCESS [  4.443 s]
[2019-06-10T07:27:02.136Z] [INFO] Maven Surefire Common .............................. SUCCESS [ 32.977 s]
[2019-06-10T07:27:02.136Z] [INFO] SureFire JUnitCore Runner .......................... SUCCESS [02:13 min]
[2019-06-10T07:27:02.136Z] [INFO] SureFire JUnit Platform Runner ..................... SUCCESS [  9.753 s]
[2019-06-10T07:27:02.136Z] [INFO] SureFire TestNG Utils .............................. SUCCESS [  4.347 s]
[2019-06-10T07:27:02.136Z] [INFO] SureFire TestNG Runner ............................. SUCCESS [  5.090 s]
[2019-06-10T07:27:02.136Z] [INFO] ShadeFire JUnit3 Provider .......................... SUCCESS [  1.608 s]
[2019-06-10T07:27:02.136Z] [INFO] Surefire Report Parser ............................. SUCCESS [  6.159 s]
[2019-06-10T07:27:02.136Z] [INFO] Maven Surefire Plugin .............................. SUCCESS [ 10.403 s]
[2019-06-10T07:27:02.136Z] [INFO] Maven Failsafe Plugin .............................. SUCCESS [01:12 min]
[2019-06-10T07:27:02.136Z] [INFO] Maven Surefire Report Plugin ....................... SUCCESS [ 16.241 s]
[2019-06-10T07:27:02.136Z] [INFO] Maven Surefire Integration Tests ................... SUCCESS [  01:07 h]
[2019-06-10T07:27:02.136Z] [INFO] ------------------------------------------------------------------------
[2019-06-10T07:27:02.136Z] [INFO] BUILD SUCCESS
[2019-06-10T07:27:02.136Z] [INFO] ------------------------------------------------------------------------
[2019-06-10T07:27:02.136Z] [INFO] Total time:  01:14 h
[2019-06-10T07:27:02.136Z] [INFO] Finished at: 2019-06-10T07:27:01Z
[2019-06-10T07:27:02.136Z] [INFO] ------------------------------------------------------------------------
[Pipeline] }
[Pipeline] // withEnv
[Pipeline] }
[Pipeline] // stage
[Pipeline] cleanWs
[2019-06-10T07:27:02.844Z] [WS-CLEANUP] Deleting project workspace...
[2019-06-10T07:27:02.844Z] [WS-CLEANUP] Deferred wipeout is used...
[2019-06-10T07:27:03.163Z] [WS-CLEANUP] done
[Pipeline] }
[Pipeline] // ws
[Pipeline] }
[Pipeline] // timestamps
[Pipeline] }
[Pipeline] // node
[Pipeline] }
[2019-06-10T07:27:03.403Z] Terminated
Aborted by tibordigana
[Pipeline] // node
[Pipeline] // node
[Pipeline] // node
[Pipeline] // node
[Pipeline] }
Failed in branch windows-jdk12-maven3.6.x
[Pipeline] }
Failed in branch windows-jdk11-maven3.6.x
[Pipeline] }
Failed in branch windows-jdk8-maven3.6.x
[Pipeline] }
Failed in branch windows-jdk7-maven3.6.x
[Pipeline] // parallel
[Pipeline] echo
org.jenkinsci.plugins.workflow.steps.FlowInterruptedException: org.jenkinsci.plugins.workflow.steps.FlowInterruptedException
[Pipeline] echo
Build result: FAILURE
[Pipeline] jiraIssueSelector
[Pipeline] emailext

Build failed in Jenkins: Maven TLP » maven-surefire » release/3.0.0-M5 #4

Posted by Apache Jenkins Server <je...@builds.apache.org>.
See https://builds.apache.org/job/maven-box/job/maven-surefire/job/release%252F3.0.0-M5/4/

Changes:

* [MNG-6573] Use Maven 3.6.0 as default
* H39 has weird issues, exclude it for now
* Fix no access to currentBuild.rawBuild
* fixed typo
* Include more recent JDKs

All tests passed

Build log:
[...truncated 29874 lines...]
[2019-06-04T07:40:56.088Z] 	at java.lang.ClassLoader.loadClass(ClassLoader.java:425)
[2019-06-04T07:40:56.088Z] 	at java.lang.ClassLoader.loadClass(ClassLoader.java:358)
[2019-06-04T07:40:56.088Z] 	at java.lang.Class.forName0(Native Method)
[2019-06-04T07:40:56.088Z] 	at java.lang.Class.forName(Class.java:274)
[2019-06-04T07:40:56.088Z] 	at org.apache.maven.surefire.booter.NewClassLoaderRunner.getFromTestClassLoader(NewClassLoaderRunner.java:185)
[2019-06-04T07:40:56.088Z] 	... 28 more
[2019-06-04T07:40:56.088Z] 
[2019-06-04T07:40:56.088Z] [INFO] 
[2019-06-04T07:40:56.088Z] [INFO] Results:
[2019-06-04T07:40:56.088Z] [INFO] 
[2019-06-04T07:40:56.088Z] [ERROR] Errors: 
[2019-06-04T07:40:56.088Z] [ERROR]   junit.framework.TestSuite#org.apache.maven.surefire.booter.CommandReaderTest IllegalStateException
[2019-06-04T07:40:56.088Z] [INFO] 
[2019-06-04T07:40:56.088Z] [ERROR] Tests run: 52, Failures: 0, Errors: 1, Skipped: 0
[2019-06-04T07:40:56.088Z] [INFO] 
[2019-06-04T07:40:56.088Z] [INFO] ------------------------------------------------------------------------
[2019-06-04T07:40:56.088Z] [INFO] Reactor Summary for Apache Maven Surefire 3.0.0-SNAPSHOT:
[2019-06-04T07:40:56.088Z] [INFO] 
[2019-06-04T07:40:56.088Z] [INFO] Apache Maven Surefire .............................. SUCCESS [  8.407 s]
[2019-06-04T07:40:56.088Z] [INFO] SureFire Logger API ................................ SUCCESS [  5.398 s]
[2019-06-04T07:40:56.088Z] [INFO] SureFire API ....................................... SUCCESS [ 18.618 s]
[2019-06-04T07:40:56.088Z] [INFO] SureFire Booter .................................... FAILURE [ 17.717 s]
[2019-06-04T07:40:56.088Z] [INFO] Maven Surefire Test-Grouping Support ............... SKIPPED
[2019-06-04T07:40:56.088Z] [INFO] SureFire Providers ................................. SKIPPED
[2019-06-04T07:40:56.088Z] [INFO] Shared JUnit3 Provider Code ........................ SKIPPED
[2019-06-04T07:40:56.088Z] [INFO] Shared Java 5 Provider Base ........................ SKIPPED
[2019-06-04T07:40:56.088Z] [INFO] Shared JUnit4 Provider Code ........................ SKIPPED
[2019-06-04T07:40:56.088Z] [INFO] Shared JUnit48 Provider Code ....................... SKIPPED
[2019-06-04T07:40:56.088Z] [INFO] SureFire JUnit Runner .............................. SKIPPED
[2019-06-04T07:40:56.088Z] [INFO] SureFire JUnit4 Runner ............................. SKIPPED
[2019-06-04T07:40:56.088Z] [INFO] Maven Surefire Common .............................. SKIPPED
[2019-06-04T07:40:56.088Z] [INFO] SureFire JUnitCore Runner .......................... SKIPPED
[2019-06-04T07:40:56.088Z] [INFO] SureFire JUnit Platform Runner ..................... SKIPPED
[2019-06-04T07:40:56.088Z] [INFO] SureFire TestNG Utils .............................. SKIPPED
[2019-06-04T07:40:56.088Z] [INFO] SureFire TestNG Runner ............................. SKIPPED
[2019-06-04T07:40:56.088Z] [INFO] ShadeFire JUnit3 Provider .......................... SKIPPED
[2019-06-04T07:40:56.088Z] [INFO] Surefire Report Parser ............................. SKIPPED
[2019-06-04T07:40:56.088Z] [INFO] Maven Surefire Plugin .............................. SKIPPED
[2019-06-04T07:40:56.088Z] [INFO] Maven Failsafe Plugin .............................. SKIPPED
[2019-06-04T07:40:56.088Z] [INFO] Maven Surefire Report Plugin ....................... SKIPPED
[2019-06-04T07:40:56.088Z] [INFO] Maven Surefire Integration Tests ................... SKIPPED
[2019-06-04T07:40:56.088Z] [INFO] ------------------------------------------------------------------------
[2019-06-04T07:40:56.088Z] [INFO] BUILD FAILURE
[2019-06-04T07:40:56.088Z] [INFO] ------------------------------------------------------------------------
[2019-06-04T07:40:56.088Z] [INFO] Total time:  51.224 s
[2019-06-04T07:40:56.088Z] [INFO] Finished at: 2019-06-04T00:40:56-07:00
[2019-06-04T07:40:56.088Z] [INFO] ------------------------------------------------------------------------
[2019-06-04T07:40:56.088Z] [ERROR] Failed to execute goal org.apache.maven.plugins:maven-surefire-plugin:3.0.0-M3:test (default-test) on project surefire-booter: There are test failures.
[2019-06-04T07:40:56.088Z] [ERROR] 
[2019-06-04T07:40:56.088Z] [ERROR] Please refer to C:\Users\jenkins\AppData\Local\Temp\2\jenkins-maven-box-maven-surefire-release%2F3.0.0-M5-4\surefire-booter\target\surefire-reports for the individual test results.
[2019-06-04T07:40:56.088Z] [ERROR] Please refer to dump files (if any exist) [date].dump, [date]-jvmRun[N].dump and [date].dumpstream.
[2019-06-04T07:40:56.088Z] [ERROR] -> [Help 1]
[2019-06-04T07:40:56.088Z] org.apache.maven.lifecycle.LifecycleExecutionException: Failed to execute goal org.apache.maven.plugins:maven-surefire-plugin:3.0.0-M3:test (default-test) on project surefire-booter: There are test failures.
[2019-06-04T07:40:56.088Z] 
[2019-06-04T07:40:56.088Z] Please refer to C:\Users\jenkins\AppData\Local\Temp\2\jenkins-maven-box-maven-surefire-release%2F3.0.0-M5-4\surefire-booter\target\surefire-reports for the individual test results.
[2019-06-04T07:40:56.088Z] Please refer to dump files (if any exist) [date].dump, [date]-jvmRun[N].dump and [date].dumpstream.
[2019-06-04T07:40:56.088Z]     at org.apache.maven.lifecycle.internal.MojoExecutor.execute (MojoExecutor.java:215)
[2019-06-04T07:40:56.088Z]     at org.apache.maven.lifecycle.internal.MojoExecutor.execute (MojoExecutor.java:156)
[2019-06-04T07:40:56.088Z]     at org.apache.maven.lifecycle.internal.MojoExecutor.execute (MojoExecutor.java:148)
[2019-06-04T07:40:56.088Z]     at org.apache.maven.lifecycle.internal.LifecycleModuleBuilder.buildProject (LifecycleModuleBuilder.java:117)
[2019-06-04T07:40:56.088Z]     at org.apache.maven.lifecycle.internal.LifecycleModuleBuilder.buildProject (LifecycleModuleBuilder.java:81)
[2019-06-04T07:40:56.088Z]     at org.apache.maven.lifecycle.internal.builder.singlethreaded.SingleThreadedBuilder.build (SingleThreadedBuilder.java:56)
[2019-06-04T07:40:56.088Z]     at org.apache.maven.lifecycle.internal.LifecycleStarter.execute (LifecycleStarter.java:128)
[2019-06-04T07:40:56.088Z]     at org.apache.maven.DefaultMaven.doExecute (DefaultMaven.java:305)
[2019-06-04T07:40:56.088Z]     at org.apache.maven.DefaultMaven.doExecute (DefaultMaven.java:192)
[2019-06-04T07:40:56.088Z]     at org.apache.maven.DefaultMaven.execute (DefaultMaven.java:105)
[2019-06-04T07:40:56.089Z]     at org.apache.maven.cli.MavenCli.execute (MavenCli.java:956)
[2019-06-04T07:40:56.089Z]     at org.apache.maven.cli.MavenCli.doMain (MavenCli.java:288)
[2019-06-04T07:40:56.089Z]     at org.apache.maven.cli.MavenCli.main (MavenCli.java:192)
[2019-06-04T07:40:56.089Z]     at sun.reflect.NativeMethodAccessorImpl.invoke0 (Native Method)
[2019-06-04T07:40:56.089Z]     at sun.reflect.NativeMethodAccessorImpl.invoke (NativeMethodAccessorImpl.java:62)
[2019-06-04T07:40:56.089Z]     at sun.reflect.DelegatingMethodAccessorImpl.invoke (DelegatingMethodAccessorImpl.java:43)
[2019-06-04T07:40:56.089Z]     at java.lang.reflect.Method.invoke (Method.java:498)
[2019-06-04T07:40:56.089Z]     at org.codehaus.plexus.classworlds.launcher.Launcher.launchEnhanced (Launcher.java:289)
[2019-06-04T07:40:56.089Z]     at org.codehaus.plexus.classworlds.launcher.Launcher.launch (Launcher.java:229)
[2019-06-04T07:40:56.089Z]     at org.codehaus.plexus.classworlds.launcher.Launcher.mainWithExitCode (Launcher.java:415)
[2019-06-04T07:40:56.089Z]     at org.codehaus.plexus.classworlds.launcher.Launcher.main (Launcher.java:356)
[2019-06-04T07:40:56.089Z] Caused by: org.apache.maven.plugin.MojoFailureException: There are test failures.
[2019-06-04T07:40:56.089Z] 
[2019-06-04T07:40:56.089Z] Please refer to C:\Users\jenkins\AppData\Local\Temp\2\jenkins-maven-box-maven-surefire-release%2F3.0.0-M5-4\surefire-booter\target\surefire-reports for the individual test results.
[2019-06-04T07:40:56.089Z] Please refer to dump files (if any exist) [date].dump, [date]-jvmRun[N].dump and [date].dumpstream.
[2019-06-04T07:40:56.089Z]     at org.apache.maven.plugin.surefire.SurefireHelper.throwException (SurefireHelper.java:271)
[2019-06-04T07:40:56.089Z]     at org.apache.maven.plugin.surefire.SurefireHelper.reportExecution (SurefireHelper.java:159)
[2019-06-04T07:40:56.089Z]     at org.apache.maven.plugin.surefire.SurefirePlugin.handleSummary (SurefirePlugin.java:373)
[2019-06-04T07:40:56.089Z]     at org.apache.maven.plugin.surefire.AbstractSurefireMojo.executeAfterPreconditionsChecked (AbstractSurefireMojo.java:1018)
[2019-06-04T07:40:56.089Z]     at org.apache.maven.plugin.surefire.AbstractSurefireMojo.execute (AbstractSurefireMojo.java:848)
[2019-06-04T07:40:56.089Z]     at org.apache.maven.plugin.DefaultBuildPluginManager.executeMojo (DefaultBuildPluginManager.java:137)
[2019-06-04T07:40:56.089Z]     at org.apache.maven.lifecycle.internal.MojoExecutor.execute (MojoExecutor.java:210)
[2019-06-04T07:40:56.089Z]     at org.apache.maven.lifecycle.internal.MojoExecutor.execute (MojoExecutor.java:156)
[2019-06-04T07:40:56.089Z]     at org.apache.maven.lifecycle.internal.MojoExecutor.execute (MojoExecutor.java:148)
[2019-06-04T07:40:56.089Z]     at org.apache.maven.lifecycle.internal.LifecycleModuleBuilder.buildProject (LifecycleModuleBuilder.java:117)
[2019-06-04T07:40:56.089Z]     at org.apache.maven.lifecycle.internal.LifecycleModuleBuilder.buildProject (LifecycleModuleBuilder.java:81)
[2019-06-04T07:40:56.089Z]     at org.apache.maven.lifecycle.internal.builder.singlethreaded.SingleThreadedBuilder.build (SingleThreadedBuilder.java:56)
[2019-06-04T07:40:56.089Z]     at org.apache.maven.lifecycle.internal.LifecycleStarter.execute (LifecycleStarter.java:128)
[2019-06-04T07:40:56.089Z]     at org.apache.maven.DefaultMaven.doExecute (DefaultMaven.java:305)
[2019-06-04T07:40:56.089Z]     at org.apache.maven.DefaultMaven.doExecute (DefaultMaven.java:192)
[2019-06-04T07:40:56.089Z]     at org.apache.maven.DefaultMaven.execute (DefaultMaven.java:105)
[2019-06-04T07:40:56.089Z]     at org.apache.maven.cli.MavenCli.execute (MavenCli.java:956)
[2019-06-04T07:40:56.089Z]     at org.apache.maven.cli.MavenCli.doMain (MavenCli.java:288)
[2019-06-04T07:40:56.089Z]     at org.apache.maven.cli.MavenCli.main (MavenCli.java:192)
[2019-06-04T07:40:56.089Z]     at sun.reflect.NativeMethodAccessorImpl.invoke0 (Native Method)
[2019-06-04T07:40:56.089Z]     at sun.reflect.NativeMethodAccessorImpl.invoke (NativeMethodAccessorImpl.java:62)
[2019-06-04T07:40:56.089Z]     at sun.reflect.DelegatingMethodAccessorImpl.invoke (DelegatingMethodAccessorImpl.java:43)
[2019-06-04T07:40:56.089Z]     at java.lang.reflect.Method.invoke (Method.java:498)
[2019-06-04T07:40:56.089Z]     at org.codehaus.plexus.classworlds.launcher.Launcher.launchEnhanced (Launcher.java:289)
[2019-06-04T07:40:56.089Z]     at org.codehaus.plexus.classworlds.launcher.Launcher.launch (Launcher.java:229)
[2019-06-04T07:40:56.089Z]     at org.codehaus.plexus.classworlds.launcher.Launcher.mainWithExitCode (Launcher.java:415)
[2019-06-04T07:40:56.089Z]     at org.codehaus.plexus.classworlds.launcher.Launcher.main (Launcher.java:356)
[2019-06-04T07:40:56.089Z] [ERROR] 
[2019-06-04T07:40:56.089Z] [ERROR] Re-run Maven using the -X switch to enable full debug logging.
[2019-06-04T07:40:56.089Z] [ERROR] 
[2019-06-04T07:40:56.089Z] [ERROR] For more information about the errors and possible solutions, please read the following articles:
[2019-06-04T07:40:56.089Z] [ERROR] [Help 1] http://cwiki.apache.org/confluence/display/MAVEN/MojoFailureException
[2019-06-04T07:40:56.089Z] [ERROR] 
[2019-06-04T07:40:56.089Z] [ERROR] After correcting the problems, you can resume the build with the command
[2019-06-04T07:40:56.089Z] [ERROR]   mvn <goals> -rf :surefire-booter
[Pipeline] }
[Pipeline] // withEnv
[Pipeline] }
[Pipeline] // stage
[Pipeline] fileExists
[Pipeline] fileExists
[Pipeline] archiveArtifacts
[2019-06-04T07:40:56.609Z] Archiving artifacts
[Pipeline] cleanWs
[2019-06-04T07:40:56.669Z] [WS-CLEANUP] Deleting project workspace...
[2019-06-04T07:40:56.669Z] [WS-CLEANUP] Deferred wipeout is used...
[2019-06-04T07:40:56.712Z] [WS-CLEANUP] done
[Pipeline] }
[Pipeline] // ws
[Pipeline] }
[Pipeline] // timestamps
[Pipeline] }
[Pipeline] // node
[Pipeline] }
[2019-06-04T07:41:10.318Z] [INFO] Tests run: 4, Failures: 0, Errors: 0, Skipped: 0, Time elapsed: 17.769 s - in org.apache.maven.surefire.its.jiras.Surefire828EmptyGroupExprIT
[2019-06-04T07:41:10.318Z] [INFO] Running org.apache.maven.surefire.its.jiras.Surefire832ProviderSelectionIT
[2019-06-04T07:41:14.485Z] [INFO] Tests run: 1, Failures: 0, Errors: 0, Skipped: 0, Time elapsed: 4.4 s - in org.apache.maven.surefire.its.jiras.Surefire832ProviderSelectionIT
[2019-06-04T07:41:14.486Z] [INFO] Running org.apache.maven.surefire.its.jiras.Surefire839TestWithoutCategoriesIT
[2019-06-04T07:41:23.915Z] [INFO] Tests run: 2, Failures: 0, Errors: 0, Skipped: 0, Time elapsed: 9.038 s - in org.apache.maven.surefire.its.jiras.Surefire839TestWithoutCategoriesIT
[2019-06-04T07:41:23.915Z] [INFO] Running org.apache.maven.surefire.its.jiras.Surefire847AdditionalFailureIT
[2019-06-04T07:41:28.077Z] [INFO] Tests run: 1, Failures: 0, Errors: 0, Skipped: 0, Time elapsed: 4.85 s - in org.apache.maven.surefire.its.jiras.Surefire847AdditionalFailureIT
[2019-06-04T07:41:28.077Z] [INFO] Running org.apache.maven.surefire.its.jiras.Surefire855AllowFailsafeUseArtifactFileIT
[2019-06-04T07:42:08.284Z] [INFO] Tests run: 4, Failures: 0, Errors: 0, Skipped: 0, Time elapsed: 40.058 s - in org.apache.maven.surefire.its.jiras.Surefire855AllowFailsafeUseArtifactFileIT
[2019-06-04T07:42:08.284Z] [INFO] Running org.apache.maven.surefire.its.jiras.Surefire901MIssingResultfileWhenNoTestsIT
[2019-06-04T07:42:11.468Z] [INFO] Tests run: 1, Failures: 0, Errors: 0, Skipped: 0, Time elapsed: 3.441 s - in org.apache.maven.surefire.its.jiras.Surefire901MIssingResultfileWhenNoTestsIT
[2019-06-04T07:42:11.468Z] [INFO] Running org.apache.maven.surefire.its.jiras.Surefire907PerThreadWithoutThreadCountIT
[2019-06-04T07:42:14.648Z] [INFO] Tests run: 1, Failures: 0, Errors: 0, Skipped: 0, Time elapsed: 2.81 s - in org.apache.maven.surefire.its.jiras.Surefire907PerThreadWithoutThreadCountIT
[2019-06-04T07:42:14.648Z] [INFO] Running org.apache.maven.surefire.its.jiras.Surefire920TestFailureIgnoreWithTimeoutIT
[2019-06-04T07:42:24.035Z] [INFO] Tests run: 2, Failures: 0, Errors: 0, Skipped: 0, Time elapsed: 10.156 s - in org.apache.maven.surefire.its.jiras.Surefire920TestFailureIgnoreWithTimeoutIT
[2019-06-04T07:42:24.035Z] [INFO] Running org.apache.maven.surefire.its.jiras.Surefire926FailureWith2ProvidersIT
[2019-06-04T07:42:30.481Z] [INFO] Tests run: 1, Failures: 0, Errors: 0, Skipped: 0, Time elapsed: 6.164 s - in org.apache.maven.surefire.its.jiras.Surefire926FailureWith2ProvidersIT
[2019-06-04T07:42:30.481Z] [INFO] Running org.apache.maven.surefire.its.jiras.Surefire930TestNgSuiteXmlIT
[2019-06-04T07:42:35.721Z] [INFO] Tests run: 1, Failures: 0, Errors: 0, Skipped: 0, Time elapsed: 4.629 s - in org.apache.maven.surefire.its.jiras.Surefire930TestNgSuiteXmlIT
[2019-06-04T07:42:35.721Z] [INFO] Running org.apache.maven.surefire.its.jiras.Surefire943ReportContentIT
[2019-06-04T07:42:57.141Z] [INFO] Tests run: 2, Failures: 0, Errors: 0, Skipped: 0, Time elapsed: 21.829 s - in org.apache.maven.surefire.its.jiras.Surefire943ReportContentIT
[2019-06-04T07:42:57.141Z] [INFO] Running org.apache.maven.surefire.its.jiras.Surefire946KillMainProcessInReusableForkIT
[2019-06-04T07:43:18.346Z] [INFO] Tests run: 3, Failures: 0, Errors: 0, Skipped: 0, Time elapsed: 21.438 s - in org.apache.maven.surefire.its.jiras.Surefire946KillMainProcessInReusableForkIT
[2019-06-04T07:43:18.347Z] [INFO] Running org.apache.maven.surefire.its.jiras.Surefire972BizarreNoClassDefIT
[2019-06-04T07:43:24.793Z] [INFO] Tests run: 1, Failures: 0, Errors: 0, Skipped: 0, Time elapsed: 5.698 s - in org.apache.maven.surefire.its.jiras.Surefire972BizarreNoClassDefIT
[2019-06-04T07:43:24.793Z] [INFO] Running org.apache.maven.surefire.its.jiras.Surefire975DefaultVMEncodingIT
[2019-06-04T07:43:30.039Z] [INFO] Tests run: 1, Failures: 0, Errors: 0, Skipped: 0, Time elapsed: 6.042 s - in org.apache.maven.surefire.its.jiras.Surefire975DefaultVMEncodingIT
[2019-06-04T07:43:30.039Z] [INFO] Running org.apache.maven.surefire.its.jiras.Surefire979WrongClassLoaderIT
[2019-06-04T07:43:34.203Z] [INFO] Tests run: 1, Failures: 0, Errors: 0, Skipped: 0, Time elapsed: 4.087 s - in org.apache.maven.surefire.its.jiras.Surefire979WrongClassLoaderIT
[2019-06-04T07:43:34.203Z] [INFO] Running org.apache.maven.surefire.its.jiras.Surefire985ParameterizedRunnerAndCategoriesIT
[2019-06-04T07:43:38.363Z] [INFO] Tests run: 1, Failures: 0, Errors: 0, Skipped: 0, Time elapsed: 3.851 s - in org.apache.maven.surefire.its.jiras.Surefire985ParameterizedRunnerAndCategoriesIT
[2019-06-04T07:43:38.363Z] [INFO] Running org.apache.maven.surefire.its.jiras.Surefire995CategoryInheritanceIT
[2019-06-04T07:43:56.858Z] [INFO] Tests run: 5, Failures: 0, Errors: 0, Skipped: 0, Time elapsed: 17.754 s - in org.apache.maven.surefire.its.jiras.Surefire995CategoryInheritanceIT
[2019-06-04T07:43:56.858Z] [INFO] 
[2019-06-04T07:43:56.858Z] [INFO] Results:
[2019-06-04T07:43:56.858Z] [INFO] 
[2019-06-04T07:43:56.858Z] [WARNING] Tests run: 792, Failures: 0, Errors: 0, Skipped: 165
[2019-06-04T07:43:56.858Z] [INFO] 
[2019-06-04T07:43:56.858Z] [INFO] 
[2019-06-04T07:43:56.859Z] [INFO] --- maven-checkstyle-plugin:3.0.0:check (checkstyle-check) @ surefire-its ---
[2019-06-04T07:44:02.225Z] [INFO] 
[2019-06-04T07:44:02.225Z] [INFO] --- maven-failsafe-plugin:3.0.0-M3:verify (default) @ surefire-its ---
[2019-06-04T07:44:02.225Z] [INFO] Failsafe report directory: /home/jenkins/jenkins-slave/workspace/_maven-surefire_release_3.0.0-M5@2/surefire-its/target/failsafe-reports
[2019-06-04T07:44:02.225Z] [INFO] 
[2019-06-04T07:44:02.225Z] [INFO] --- maven-install-plugin:2.5.2:install (default-install) @ surefire-its ---
[2019-06-04T07:44:02.225Z] [INFO] Skipping artifact installation
[2019-06-04T07:44:02.225Z] [INFO] ------------------------------------------------------------------------
[2019-06-04T07:44:02.225Z] [INFO] Reactor Summary for Apache Maven Surefire 3.0.0-SNAPSHOT:
[2019-06-04T07:44:02.225Z] [INFO] 
[2019-06-04T07:44:02.225Z] [INFO] Apache Maven Surefire .............................. SUCCESS [ 43.226 s]
[2019-06-04T07:44:02.225Z] [INFO] SureFire Logger API ................................ SUCCESS [  5.185 s]
[2019-06-04T07:44:02.225Z] [INFO] SureFire API ....................................... SUCCESS [ 10.154 s]
[2019-06-04T07:44:02.225Z] [INFO] SureFire Booter .................................... SUCCESS [ 10.549 s]
[2019-06-04T07:44:02.225Z] [INFO] Maven Surefire Test-Grouping Support ............... SUCCESS [  6.378 s]
[2019-06-04T07:44:02.225Z] [INFO] SureFire Providers ................................. SUCCESS [  0.855 s]
[2019-06-04T07:44:02.225Z] [INFO] Shared JUnit3 Provider Code ........................ SUCCESS [  2.903 s]
[2019-06-04T07:44:02.225Z] [INFO] Shared Java 5 Provider Base ........................ SUCCESS [  3.632 s]
[2019-06-04T07:44:02.225Z] [INFO] Shared JUnit4 Provider Code ........................ SUCCESS [  3.913 s]
[2019-06-04T07:44:02.225Z] [INFO] Shared JUnit48 Provider Code ....................... SUCCESS [  4.384 s]
[2019-06-04T07:44:02.225Z] [INFO] SureFire JUnit Runner .............................. SUCCESS [  3.199 s]
[2019-06-04T07:44:02.225Z] [INFO] SureFire JUnit4 Runner ............................. SUCCESS [  4.082 s]
[2019-06-04T07:44:02.225Z] [INFO] Maven Surefire Common .............................. SUCCESS [ 27.251 s]
[2019-06-04T07:44:02.225Z] [INFO] SureFire JUnitCore Runner .......................... SUCCESS [02:13 min]
[2019-06-04T07:44:02.225Z] [INFO] SureFire JUnit Platform Runner ..................... SUCCESS [  7.995 s]
[2019-06-04T07:44:02.225Z] [INFO] SureFire TestNG Utils .............................. SUCCESS [  3.525 s]
[2019-06-04T07:44:02.225Z] [INFO] SureFire TestNG Runner ............................. SUCCESS [  3.866 s]
[2019-06-04T07:44:02.225Z] [INFO] ShadeFire JUnit3 Provider .......................... SUCCESS [  1.439 s]
[2019-06-04T07:44:02.225Z] [INFO] Surefire Report Parser ............................. SUCCESS [  4.598 s]
[2019-06-04T07:44:02.225Z] [INFO] Maven Surefire Plugin .............................. SUCCESS [  9.611 s]
[2019-06-04T07:44:02.225Z] [INFO] Maven Failsafe Plugin .............................. SUCCESS [01:00 min]
[2019-06-04T07:44:02.225Z] [INFO] Maven Surefire Report Plugin ....................... SUCCESS [ 13.894 s]
[2019-06-04T07:44:02.225Z] [INFO] Maven Surefire Integration Tests ................... SUCCESS [55:59 min]
[2019-06-04T07:44:02.225Z] [INFO] ------------------------------------------------------------------------
[2019-06-04T07:44:02.225Z] [INFO] BUILD SUCCESS
[2019-06-04T07:44:02.225Z] [INFO] ------------------------------------------------------------------------
[2019-06-04T07:44:02.225Z] [INFO] Total time:  01:02 h
[2019-06-04T07:44:02.225Z] [INFO] Finished at: 2019-06-04T07:44:01Z
[2019-06-04T07:44:02.225Z] [INFO] ------------------------------------------------------------------------
[Pipeline] }
[Pipeline] // withEnv
[Pipeline] }
[Pipeline] // stage
[Pipeline] fileExists
[Pipeline] zip
[2019-06-04T07:44:03.288Z] Writing zip file of /home/jenkins/jenkins-slave/workspace/_maven-surefire_release_3.0.0-M5@2/maven-failsafe-plugin/target/it to /home/jenkins/jenkins-slave/workspace/_maven-surefire_release_3.0.0-M5@2/maven-failsafe-plugin--linux-jdk7-maven3.6.x.zip
[2019-06-04T07:44:04.493Z] Zipped 78 entries.
[2019-06-04T07:44:04.493Z] Archiving /home/jenkins/jenkins-slave/workspace/_maven-surefire_release_3.0.0-M5@2/maven-failsafe-plugin--linux-jdk7-maven3.6.x.zip
[2019-06-04T07:44:04.493Z] [Fast Archiver] No prior successful build to compare, so performing full copy of artifacts
[Pipeline] fileExists
[Pipeline] zip
[2019-06-04T07:44:05.596Z] Writing zip file of /home/jenkins/jenkins-slave/workspace/_maven-surefire_release_3.0.0-M5@2/surefire-its/target to /home/jenkins/jenkins-slave/workspace/_maven-surefire_release_3.0.0-M5@2/surefire-its--linux-jdk7-maven3.6.x.zip
[2019-06-04T07:44:40.330Z] Zipped 16072 entries.
[2019-06-04T07:44:40.330Z] Archiving /home/jenkins/jenkins-slave/workspace/_maven-surefire_release_3.0.0-M5@2/surefire-its--linux-jdk7-maven3.6.x.zip
[2019-06-04T07:44:40.330Z] [Fast Archiver] No prior successful build to compare, so performing full copy of artifacts
[Pipeline] archiveArtifacts
[2019-06-04T07:44:42.406Z] Archiving artifacts
[2019-06-04T07:44:42.749Z] [Fast Archiver] No prior successful build to compare, so performing full copy of artifacts
[Pipeline] cleanWs
[2019-06-04T07:44:44.708Z] [WS-CLEANUP] Deleting project workspace...
[2019-06-04T07:44:44.708Z] [WS-CLEANUP] Deferred wipeout is used...
[2019-06-04T07:44:45.028Z] [WS-CLEANUP] done
[Pipeline] }
[Pipeline] // ws
[Pipeline] }
[Pipeline] // timestamps
[Pipeline] }
[Pipeline] // node
[Pipeline] }
[Pipeline] // parallel
[Pipeline] echo
Build result: FAILURE
[Pipeline] jiraIssueSelector
[Pipeline] jiraComment
[Pipeline] emailext

Build failed in Jenkins: Maven TLP » maven-surefire » release/3.0.0-M5 #3

Posted by Apache Jenkins Server <je...@builds.apache.org>.
See https://builds.apache.org/job/maven-box/job/maven-surefire/job/release%252F3.0.0-M5/3/

No changes.

All tests passed

Build log:
[...truncated 29822 lines...]
[2019-04-15T03:16:31.890Z] [INFO] Exclude: **/.idea
[2019-04-15T03:16:31.890Z] [INFO] Exclude: **/.svn/**/*
[2019-04-15T03:16:31.890Z] [INFO] Exclude: **/*.iml
[2019-04-15T03:16:31.890Z] [INFO] Exclude: **/*.ipr
[2019-04-15T03:16:31.890Z] [INFO] Exclude: **/*.iws
[2019-04-15T03:16:31.890Z] [INFO] Exclude: **/*.versionsBackup
[2019-04-15T03:16:31.890Z] [INFO] Exclude: **/dependency-reduced-pom.xml
[2019-04-15T03:16:31.890Z] [INFO] Exclude: .repository/**
[2019-04-15T03:16:31.890Z] [INFO] Exclude: src/test/resources/**/*
[2019-04-15T03:16:31.890Z] [INFO] Exclude: src/test/resources/**/*.css
[2019-04-15T03:16:31.890Z] [INFO] Exclude: **/*.jj
[2019-04-15T03:16:31.890Z] [INFO] Exclude: src/main/resources/META-INF/services/org.apache.maven.surefire.providerapi.SurefireProvider
[2019-04-15T03:16:31.890Z] [INFO] Exclude: DEPENDENCIES
[2019-04-15T03:16:31.890Z] [INFO] Exclude: .m2/**
[2019-04-15T03:16:31.891Z] [INFO] Exclude: .m2
[2019-04-15T03:16:31.891Z] [INFO] Exclude: .travis.yml
[2019-04-15T03:16:31.891Z] [INFO] 33 resources included (use -debug for more details)
[2019-04-15T03:16:31.891Z] [INFO] Rat check: Summary over all files. Unapproved: 0, unknown: 0, generated: 0, approved: 33 licenses.
[2019-04-15T03:16:31.891Z] [INFO] 
[2019-04-15T03:16:31.891Z] [INFO] --- jacoco-maven-plugin:0.8.3:prepare-agent (jacoco-agent) @ surefire-booter ---
[2019-04-15T03:16:31.891Z] [INFO] Skipping JaCoCo execution because property jacoco.skip is set.
[2019-04-15T03:16:31.891Z] [INFO] jacoco.agent set to empty
[2019-04-15T03:16:31.891Z] [INFO] 
[2019-04-15T03:16:31.891Z] [INFO] --- maven-dependency-plugin:3.1.1:build-classpath (build-test-classpath) @ surefire-booter ---
[2019-04-15T03:16:32.541Z] [INFO] Wrote classpath file 'C:\Users\jenkins\AppData\Local\Temp\2\jenkins-maven-box-maven-surefire-release%2F3.0.0-M5-3\surefire-booter\target\test-classpath\cp.txt'.
[2019-04-15T03:16:32.541Z] [INFO] 
[2019-04-15T03:16:32.541Z] [INFO] --- maven-compiler-plugin:3.7.0:compile (compile-generated) @ surefire-booter ---
[2019-04-15T03:16:32.541Z] [INFO] Nothing to compile - all classes are up to date
[2019-04-15T03:16:32.541Z] [INFO] 
[2019-04-15T03:16:32.541Z] [INFO] --- maven-remote-resources-plugin:1.5:process (process-resource-bundles) @ surefire-booter ---
[2019-04-15T03:16:32.839Z] [INFO] 
[2019-04-15T03:16:32.839Z] [INFO] --- maven-resources-plugin:3.1.0:resources (default-resources) @ surefire-booter ---
[2019-04-15T03:16:32.839Z] [INFO] Using 'UTF-8' encoding to copy filtered resources.
[2019-04-15T03:16:32.839Z] [INFO] skip non existing resourceDirectory C:\Users\jenkins\AppData\Local\Temp\2\jenkins-maven-box-maven-surefire-release%2F3.0.0-M5-3\surefire-booter\src\main\resources
[2019-04-15T03:16:32.839Z] [INFO] Copying 3 resources
[2019-04-15T03:16:32.839Z] [INFO] 
[2019-04-15T03:16:32.839Z] [INFO] --- maven-compiler-plugin:3.7.0:compile (default-compile) @ surefire-booter ---
[2019-04-15T03:16:32.839Z] [INFO] Changes detected - recompiling the module!
[2019-04-15T03:16:32.839Z] [INFO] Compiling 23 source files to C:\Users\jenkins\AppData\Local\Temp\2\jenkins-maven-box-maven-surefire-release%2F3.0.0-M5-3\surefire-booter\target\classes
[2019-04-15T03:16:35.672Z] [INFO] 
[2019-04-15T03:16:35.672Z] [INFO] --- animal-sniffer-maven-plugin:1.17:check (signature-check) @ surefire-booter ---
[2019-04-15T03:16:35.672Z] [INFO] Checking unresolved references to org.codehaus.mojo.signature:java17:1.0
[2019-04-15T03:16:35.968Z] [INFO] 
[2019-04-15T03:16:35.968Z] [INFO] --- maven-resources-plugin:3.1.0:testResources (default-testResources) @ surefire-booter ---
[2019-04-15T03:16:35.968Z] [INFO] Using 'UTF-8' encoding to copy filtered resources.
[2019-04-15T03:16:35.968Z] [INFO] Copying 7 resources
[2019-04-15T03:16:35.968Z] [INFO] Copying 3 resources
[2019-04-15T03:16:35.968Z] [INFO] 
[2019-04-15T03:16:35.968Z] [INFO] --- maven-compiler-plugin:3.7.0:testCompile (default-testCompile) @ surefire-booter ---
[2019-04-15T03:16:35.968Z] [INFO] Changes detected - recompiling the module!
[2019-04-15T03:16:35.968Z] [INFO] Compiling 9 source files to C:\Users\jenkins\AppData\Local\Temp\2\jenkins-maven-box-maven-surefire-release%2F3.0.0-M5-3\surefire-booter\target\test-classes
[2019-04-15T03:16:39.139Z] [INFO] 
[2019-04-15T03:16:39.139Z] [INFO] --- maven-surefire-plugin:3.0.0-M3:test (default-test) @ surefire-booter ---
[2019-04-15T03:16:39.139Z] [INFO] Surefire report directory: C:\Users\jenkins\AppData\Local\Temp\2\jenkins-maven-box-maven-surefire-release%2F3.0.0-M5-3\surefire-booter\target\surefire-reports
[2019-04-15T03:16:39.139Z] [INFO] Using configured provider org.apache.maven.shadefire.surefire.junit.JUnit3Provider
[2019-04-15T03:16:39.139Z] [INFO] parallel='none', perCoreThreadCount=true, threadCount=0, useUnlimitedThreads=false, threadCountSuites=0, threadCountClasses=0, threadCountMethods=0, parallelOptimized=true
[2019-04-15T03:16:39.139Z] [INFO] 
[2019-04-15T03:16:39.139Z] [INFO] -------------------------------------------------------
[2019-04-15T03:16:39.139Z] [INFO]  T E S T S
[2019-04-15T03:16:39.139Z] [INFO] -------------------------------------------------------
[2019-04-15T03:16:39.470Z] [INFO] Running org.apache.maven.surefire.booter.JUnit4SuiteTest
[2019-04-15T03:16:43.112Z] [ERROR] Tests run: 52, Failures: 0, Errors: 1, Skipped: 0, Time elapsed: 3.594 s <<< FAILURE! - in org.apache.maven.surefire.booter.JUnit4SuiteTest
[2019-04-15T03:16:43.112Z] [ERROR] org.apache.maven.surefire.booter.CommandReaderTest  Time elapsed: 0.057 s  <<< ERROR!
[2019-04-15T03:16:43.112Z] java.lang.IllegalStateException: java.lang.ClassNotFoundException: org.apache.maven.surefire.booter.CommandReaderTest
[2019-04-15T03:16:43.112Z] 	at org.apache.maven.surefire.booter.NewClassLoaderRunner.getFromTestClassLoader(NewClassLoaderRunner.java:189)
[2019-04-15T03:16:43.112Z] 	at org.apache.maven.surefire.booter.NewClassLoaderRunner.runChild(NewClassLoaderRunner.java:76)
[2019-04-15T03:16:43.112Z] 	at org.apache.maven.surefire.booter.NewClassLoaderRunner.runChild(NewClassLoaderRunner.java:57)
[2019-04-15T03:16:43.112Z] 	at org.junit.runners.ParentRunner$3.run(ParentRunner.java:290)
[2019-04-15T03:16:43.112Z] 	at org.junit.runners.ParentRunner$1.schedule(ParentRunner.java:71)
[2019-04-15T03:16:43.112Z] 	at org.junit.runners.ParentRunner.runChildren(ParentRunner.java:288)
[2019-04-15T03:16:43.112Z] 	at org.junit.runners.ParentRunner.access$000(ParentRunner.java:58)
[2019-04-15T03:16:43.112Z] 	at org.junit.runners.ParentRunner$2.evaluate(ParentRunner.java:268)
[2019-04-15T03:16:43.112Z] 	at org.junit.runners.ParentRunner.run(ParentRunner.java:363)
[2019-04-15T03:16:43.112Z] 	at org.junit.runners.Suite.runChild(Suite.java:128)
[2019-04-15T03:16:43.112Z] 	at org.junit.runners.Suite.runChild(Suite.java:27)
[2019-04-15T03:16:43.112Z] 	at org.junit.runners.ParentRunner$3.run(ParentRunner.java:290)
[2019-04-15T03:16:43.112Z] 	at org.junit.runners.ParentRunner$1.schedule(ParentRunner.java:71)
[2019-04-15T03:16:43.112Z] 	at org.junit.runners.ParentRunner.runChildren(ParentRunner.java:288)
[2019-04-15T03:16:43.112Z] 	at org.junit.runners.ParentRunner.access$000(ParentRunner.java:58)
[2019-04-15T03:16:43.112Z] 	at org.junit.runners.ParentRunner$2.evaluate(ParentRunner.java:268)
[2019-04-15T03:16:43.112Z] 	at org.junit.runners.ParentRunner.run(ParentRunner.java:363)
[2019-04-15T03:16:43.112Z] 	at junit.framework.JUnit4TestAdapter.run(JUnit4TestAdapter.java:38)
[2019-04-15T03:16:43.112Z] 	at sun.reflect.NativeMethodAccessorImpl.invoke0(Native Method)
[2019-04-15T03:16:43.112Z] 	at sun.reflect.NativeMethodAccessorImpl.invoke(NativeMethodAccessorImpl.java:57)
[2019-04-15T03:16:43.112Z] 	at sun.reflect.DelegatingMethodAccessorImpl.invoke(DelegatingMethodAccessorImpl.java:43)
[2019-04-15T03:16:43.112Z] 	at java.lang.reflect.Method.invoke(Method.java:606)
[2019-04-15T03:16:43.112Z] 	at org.apache.maven.shadefire.surefire.junit.JUnitTestSet.execute(JUnitTestSet.java:99)
[2019-04-15T03:16:43.112Z] 	at org.apache.maven.shadefire.surefire.junit.JUnit3Provider.executeTestSet(JUnit3Provider.java:140)
[2019-04-15T03:16:43.112Z] 	at org.apache.maven.shadefire.surefire.junit.JUnit3Provider.invoke(JUnit3Provider.java:113)
[2019-04-15T03:16:43.112Z] 	at org.apache.maven.shadefire.surefire.booter.ForkedBooter.invokeProviderInSameClassLoader(ForkedBooter.java:384)
[2019-04-15T03:16:43.112Z] 	at org.apache.maven.shadefire.surefire.booter.ForkedBooter.runSuitesInProcess(ForkedBooter.java:345)
[2019-04-15T03:16:43.112Z] 	at org.apache.maven.shadefire.surefire.booter.ForkedBooter.execute(ForkedBooter.java:126)
[2019-04-15T03:16:43.112Z] 	at org.apache.maven.shadefire.surefire.booter.ForkedBooter.main(ForkedBooter.java:418)
[2019-04-15T03:16:43.112Z] Caused by: java.lang.ClassNotFoundException: org.apache.maven.surefire.booter.CommandReaderTest
[2019-04-15T03:16:43.112Z] 	at java.net.URLClassLoader$1.run(URLClassLoader.java:366)
[2019-04-15T03:16:43.112Z] 	at java.net.URLClassLoader$1.run(URLClassLoader.java:355)
[2019-04-15T03:16:43.112Z] 	at java.security.AccessController.doPrivileged(Native Method)
[2019-04-15T03:16:43.112Z] 	at java.net.URLClassLoader.findClass(URLClassLoader.java:354)
[2019-04-15T03:16:43.112Z] 	at java.lang.ClassLoader.loadClass(ClassLoader.java:425)
[2019-04-15T03:16:43.112Z] 	at java.lang.ClassLoader.loadClass(ClassLoader.java:358)
[2019-04-15T03:16:43.112Z] 	at java.lang.Class.forName0(Native Method)
[2019-04-15T03:16:43.112Z] 	at java.lang.Class.forName(Class.java:274)
[2019-04-15T03:16:43.112Z] 	at org.apache.maven.surefire.booter.NewClassLoaderRunner.getFromTestClassLoader(NewClassLoaderRunner.java:185)
[2019-04-15T03:16:43.112Z] 	... 28 more
[2019-04-15T03:16:43.112Z] Caused by: java.lang.ClassNotFoundException: org.apache.maven.surefire.booter.CommandReaderTest
[2019-04-15T03:16:43.112Z] 	at java.net.URLClassLoader$1.run(URLClassLoader.java:366)
[2019-04-15T03:16:43.112Z] 	at java.net.URLClassLoader$1.run(URLClassLoader.java:355)
[2019-04-15T03:16:43.112Z] 	at java.security.AccessController.doPrivileged(Native Method)
[2019-04-15T03:16:43.112Z] 	at java.net.URLClassLoader.findClass(URLClassLoader.java:354)
[2019-04-15T03:16:43.112Z] 	at java.lang.ClassLoader.loadClass(ClassLoader.java:425)
[2019-04-15T03:16:43.112Z] 	at java.lang.ClassLoader.loadClass(ClassLoader.java:358)
[2019-04-15T03:16:43.112Z] 	at java.lang.Class.forName0(Native Method)
[2019-04-15T03:16:43.112Z] 	at java.lang.Class.forName(Class.java:274)
[2019-04-15T03:16:43.112Z] 	at org.apache.maven.surefire.booter.NewClassLoaderRunner.getFromTestClassLoader(NewClassLoaderRunner.java:185)
[2019-04-15T03:16:43.112Z] 	... 28 more
[2019-04-15T03:16:43.112Z] 
[2019-04-15T03:16:43.409Z] [INFO] 
[2019-04-15T03:16:43.409Z] [INFO] Results:
[2019-04-15T03:16:43.409Z] [INFO] 
[2019-04-15T03:16:43.409Z] [ERROR] Errors: 
[2019-04-15T03:16:43.409Z] [ERROR]   junit.framework.TestSuite#org.apache.maven.surefire.booter.CommandReaderTest IllegalStateException
[2019-04-15T03:16:43.409Z] [INFO] 
[2019-04-15T03:16:43.409Z] [ERROR] Tests run: 52, Failures: 0, Errors: 1, Skipped: 0
[2019-04-15T03:16:43.409Z] [INFO] 
[2019-04-15T03:16:43.409Z] [INFO] ------------------------------------------------------------------------
[2019-04-15T03:16:43.409Z] [INFO] Reactor Summary for Apache Maven Surefire 3.0.0-SNAPSHOT:
[2019-04-15T03:16:43.409Z] [INFO] 
[2019-04-15T03:16:43.409Z] [INFO] Apache Maven Surefire .............................. SUCCESS [  7.750 s]
[2019-04-15T03:16:43.409Z] [INFO] SureFire Logger API ................................ SUCCESS [  5.083 s]
[2019-04-15T03:16:43.409Z] [INFO] SureFire API ....................................... SUCCESS [ 14.316 s]
[2019-04-15T03:16:43.409Z] [INFO] SureFire Booter .................................... FAILURE [ 13.178 s]
[2019-04-15T03:16:43.409Z] [INFO] Maven Surefire Test-Grouping Support ............... SKIPPED
[2019-04-15T03:16:43.409Z] [INFO] SureFire Providers ................................. SKIPPED
[2019-04-15T03:16:43.409Z] [INFO] Shared JUnit3 Provider Code ........................ SKIPPED
[2019-04-15T03:16:43.409Z] [INFO] Shared Java 5 Provider Base ........................ SKIPPED
[2019-04-15T03:16:43.409Z] [INFO] Shared JUnit4 Provider Code ........................ SKIPPED
[2019-04-15T03:16:43.409Z] [INFO] Shared JUnit48 Provider Code ....................... SKIPPED
[2019-04-15T03:16:43.409Z] [INFO] SureFire JUnit Runner .............................. SKIPPED
[2019-04-15T03:16:43.409Z] [INFO] SureFire JUnit4 Runner ............................. SKIPPED
[2019-04-15T03:16:43.409Z] [INFO] Maven Surefire Common .............................. SKIPPED
[2019-04-15T03:16:43.409Z] [INFO] SureFire JUnitCore Runner .......................... SKIPPED
[2019-04-15T03:16:43.409Z] [INFO] SureFire JUnit Platform Runner ..................... SKIPPED
[2019-04-15T03:16:43.409Z] [INFO] SureFire TestNG Utils .............................. SKIPPED
[2019-04-15T03:16:43.409Z] [INFO] SureFire TestNG Runner ............................. SKIPPED
[2019-04-15T03:16:43.409Z] [INFO] ShadeFire JUnit3 Provider .......................... SKIPPED
[2019-04-15T03:16:43.409Z] [INFO] Surefire Report Parser ............................. SKIPPED
[2019-04-15T03:16:43.409Z] [INFO] Maven Surefire Plugin .............................. SKIPPED
[2019-04-15T03:16:43.409Z] [INFO] Maven Failsafe Plugin .............................. SKIPPED
[2019-04-15T03:16:43.409Z] [INFO] Maven Surefire Report Plugin ....................... SKIPPED
[2019-04-15T03:16:43.409Z] [INFO] Maven Surefire Integration Tests ................... SKIPPED
[2019-04-15T03:16:43.409Z] [INFO] ------------------------------------------------------------------------
[2019-04-15T03:16:43.409Z] [INFO] BUILD FAILURE
[2019-04-15T03:16:43.409Z] [INFO] ------------------------------------------------------------------------
[2019-04-15T03:16:43.409Z] [INFO] Total time:  41.020 s
[2019-04-15T03:16:43.409Z] [INFO] Finished at: 2019-04-15T03:16:42Z
[2019-04-15T03:16:43.409Z] [INFO] ------------------------------------------------------------------------
[2019-04-15T03:16:43.409Z] [ERROR] Failed to execute goal org.apache.maven.plugins:maven-surefire-plugin:3.0.0-M3:test (default-test) on project surefire-booter: There are test failures.
[2019-04-15T03:16:43.409Z] [ERROR] 
[2019-04-15T03:16:43.409Z] [ERROR] Please refer to C:\Users\jenkins\AppData\Local\Temp\2\jenkins-maven-box-maven-surefire-release%2F3.0.0-M5-3\surefire-booter\target\surefire-reports for the individual test results.
[2019-04-15T03:16:43.409Z] [ERROR] Please refer to dump files (if any exist) [date].dump, [date]-jvmRun[N].dump and [date].dumpstream.
[2019-04-15T03:16:43.409Z] [ERROR] -> [Help 1]
[2019-04-15T03:16:43.409Z] org.apache.maven.lifecycle.LifecycleExecutionException: Failed to execute goal org.apache.maven.plugins:maven-surefire-plugin:3.0.0-M3:test (default-test) on project surefire-booter: There are test failures.
[2019-04-15T03:16:43.409Z] 
[2019-04-15T03:16:43.409Z] Please refer to C:\Users\jenkins\AppData\Local\Temp\2\jenkins-maven-box-maven-surefire-release%2F3.0.0-M5-3\surefire-booter\target\surefire-reports for the individual test results.
[2019-04-15T03:16:43.409Z] Please refer to dump files (if any exist) [date].dump, [date]-jvmRun[N].dump and [date].dumpstream.
[2019-04-15T03:16:43.409Z]     at org.apache.maven.lifecycle.internal.MojoExecutor.execute (MojoExecutor.java:215)
[2019-04-15T03:16:43.409Z]     at org.apache.maven.lifecycle.internal.MojoExecutor.execute (MojoExecutor.java:156)
[2019-04-15T03:16:43.409Z]     at org.apache.maven.lifecycle.internal.MojoExecutor.execute (MojoExecutor.java:148)
[2019-04-15T03:16:43.409Z]     at org.apache.maven.lifecycle.internal.LifecycleModuleBuilder.buildProject (LifecycleModuleBuilder.java:117)
[2019-04-15T03:16:43.409Z]     at org.apache.maven.lifecycle.internal.LifecycleModuleBuilder.buildProject (LifecycleModuleBuilder.java:81)
[2019-04-15T03:16:43.409Z]     at org.apache.maven.lifecycle.internal.builder.singlethreaded.SingleThreadedBuilder.build (SingleThreadedBuilder.java:56)
[2019-04-15T03:16:43.409Z]     at org.apache.maven.lifecycle.internal.LifecycleStarter.execute (LifecycleStarter.java:128)
[2019-04-15T03:16:43.409Z]     at org.apache.maven.DefaultMaven.doExecute (DefaultMaven.java:305)
[2019-04-15T03:16:43.409Z]     at org.apache.maven.DefaultMaven.doExecute (DefaultMaven.java:192)
[2019-04-15T03:16:43.409Z]     at org.apache.maven.DefaultMaven.execute (DefaultMaven.java:105)
[2019-04-15T03:16:43.409Z]     at org.apache.maven.cli.MavenCli.execute (MavenCli.java:956)
[2019-04-15T03:16:43.409Z]     at org.apache.maven.cli.MavenCli.doMain (MavenCli.java:288)
[2019-04-15T03:16:43.409Z]     at org.apache.maven.cli.MavenCli.main (MavenCli.java:192)
[2019-04-15T03:16:43.409Z]     at sun.reflect.NativeMethodAccessorImpl.invoke0 (Native Method)
[2019-04-15T03:16:43.409Z]     at sun.reflect.NativeMethodAccessorImpl.invoke (NativeMethodAccessorImpl.java:62)
[2019-04-15T03:16:43.409Z]     at sun.reflect.DelegatingMethodAccessorImpl.invoke (DelegatingMethodAccessorImpl.java:43)
[2019-04-15T03:16:43.409Z]     at java.lang.reflect.Method.invoke (Method.java:498)
[2019-04-15T03:16:43.409Z]     at org.codehaus.plexus.classworlds.launcher.Launcher.launchEnhanced (Launcher.java:289)
[2019-04-15T03:16:43.409Z]     at org.codehaus.plexus.classworlds.launcher.Launcher.launch (Launcher.java:229)
[2019-04-15T03:16:43.409Z]     at org.codehaus.plexus.classworlds.launcher.Launcher.mainWithExitCode (Launcher.java:415)
[2019-04-15T03:16:43.409Z]     at org.codehaus.plexus.classworlds.launcher.Launcher.main (Launcher.java:356)
[2019-04-15T03:16:43.409Z] Caused by: org.apache.maven.plugin.MojoFailureException: There are test failures.
[2019-04-15T03:16:43.409Z] 
[2019-04-15T03:16:43.409Z] Please refer to C:\Users\jenkins\AppData\Local\Temp\2\jenkins-maven-box-maven-surefire-release%2F3.0.0-M5-3\surefire-booter\target\surefire-reports for the individual test results.
[2019-04-15T03:16:43.409Z] Please refer to dump files (if any exist) [date].dump, [date]-jvmRun[N].dump and [date].dumpstream.
[2019-04-15T03:16:43.409Z]     at org.apache.maven.plugin.surefire.SurefireHelper.throwException (SurefireHelper.java:271)
[2019-04-15T03:16:43.409Z]     at org.apache.maven.plugin.surefire.SurefireHelper.reportExecution (SurefireHelper.java:159)
[2019-04-15T03:16:43.409Z]     at org.apache.maven.plugin.surefire.SurefirePlugin.handleSummary (SurefirePlugin.java:373)
[2019-04-15T03:16:43.409Z]     at org.apache.maven.plugin.surefire.AbstractSurefireMojo.executeAfterPreconditionsChecked (AbstractSurefireMojo.java:1018)
[2019-04-15T03:16:43.409Z]     at org.apache.maven.plugin.surefire.AbstractSurefireMojo.execute (AbstractSurefireMojo.java:848)
[2019-04-15T03:16:43.410Z]     at org.apache.maven.plugin.DefaultBuildPluginManager.executeMojo (DefaultBuildPluginManager.java:137)
[2019-04-15T03:16:43.410Z]     at org.apache.maven.lifecycle.internal.MojoExecutor.execute (MojoExecutor.java:210)
[2019-04-15T03:16:43.410Z]     at org.apache.maven.lifecycle.internal.MojoExecutor.execute (MojoExecutor.java:156)
[2019-04-15T03:16:43.410Z]     at org.apache.maven.lifecycle.internal.MojoExecutor.execute (MojoExecutor.java:148)
[2019-04-15T03:16:43.410Z]     at org.apache.maven.lifecycle.internal.LifecycleModuleBuilder.buildProject (LifecycleModuleBuilder.java:117)
[2019-04-15T03:16:43.410Z]     at org.apache.maven.lifecycle.internal.LifecycleModuleBuilder.buildProject (LifecycleModuleBuilder.java:81)
[2019-04-15T03:16:43.410Z]     at org.apache.maven.lifecycle.internal.builder.singlethreaded.SingleThreadedBuilder.build (SingleThreadedBuilder.java:56)
[2019-04-15T03:16:43.410Z]     at org.apache.maven.lifecycle.internal.LifecycleStarter.execute (LifecycleStarter.java:128)
[2019-04-15T03:16:43.410Z]     at org.apache.maven.DefaultMaven.doExecute (DefaultMaven.java:305)
[2019-04-15T03:16:43.410Z]     at org.apache.maven.DefaultMaven.doExecute (DefaultMaven.java:192)
[2019-04-15T03:16:43.410Z]     at org.apache.maven.DefaultMaven.execute (DefaultMaven.java:105)
[2019-04-15T03:16:43.410Z]     at org.apache.maven.cli.MavenCli.execute (MavenCli.java:956)
[2019-04-15T03:16:43.410Z]     at org.apache.maven.cli.MavenCli.doMain (MavenCli.java:288)
[2019-04-15T03:16:43.410Z]     at org.apache.maven.cli.MavenCli.main (MavenCli.java:192)
[2019-04-15T03:16:43.410Z]     at sun.reflect.NativeMethodAccessorImpl.invoke0 (Native Method)
[2019-04-15T03:16:43.410Z]     at sun.reflect.NativeMethodAccessorImpl.invoke (NativeMethodAccessorImpl.java:62)
[2019-04-15T03:16:43.410Z]     at sun.reflect.DelegatingMethodAccessorImpl.invoke (DelegatingMethodAccessorImpl.java:43)
[2019-04-15T03:16:43.410Z]     at java.lang.reflect.Method.invoke (Method.java:498)
[2019-04-15T03:16:43.410Z]     at org.codehaus.plexus.classworlds.launcher.Launcher.launchEnhanced (Launcher.java:289)
[2019-04-15T03:16:43.410Z]     at org.codehaus.plexus.classworlds.launcher.Launcher.launch (Launcher.java:229)
[2019-04-15T03:16:43.410Z]     at org.codehaus.plexus.classworlds.launcher.Launcher.mainWithExitCode (Launcher.java:415)
[2019-04-15T03:16:43.410Z]     at org.codehaus.plexus.classworlds.launcher.Launcher.main (Launcher.java:356)
[2019-04-15T03:16:43.410Z] [ERROR] 
[2019-04-15T03:16:43.410Z] [ERROR] Re-run Maven using the -X switch to enable full debug logging.
[2019-04-15T03:16:43.410Z] [ERROR] 
[2019-04-15T03:16:43.410Z] [ERROR] For more information about the errors and possible solutions, please read the following articles:
[2019-04-15T03:16:43.410Z] [ERROR] [Help 1] http://cwiki.apache.org/confluence/display/MAVEN/MojoFailureException
[2019-04-15T03:16:43.410Z] [ERROR] 
[2019-04-15T03:16:43.410Z] [ERROR] After correcting the problems, you can resume the build with the command
[2019-04-15T03:16:43.410Z] [ERROR]   mvn <goals> -rf :surefire-booter
[Pipeline] }
[Pipeline] // withEnv
[Pipeline] }
[Pipeline] // stage
[Pipeline] fileExists
[Pipeline] fileExists
[Pipeline] archiveArtifacts
[2019-04-15T03:16:43.739Z] Archiving artifacts
[Pipeline] cleanWs
[2019-04-15T03:16:43.817Z] [WS-CLEANUP] Deleting project workspace...
[2019-04-15T03:16:43.817Z] [WS-CLEANUP] Deferred wipeout is used...
[2019-04-15T03:16:43.867Z] [WS-CLEANUP] done
[Pipeline] }
[Pipeline] // ws
[Pipeline] }
[Pipeline] // timestamps
[Pipeline] }
[Pipeline] // node
[Pipeline] }
[Pipeline] // parallel
[Pipeline] echo
Build result: FAILURE
[Pipeline] jiraIssueSelector
[Pipeline] emailext

Build failed in Jenkins: Maven TLP » maven-surefire » release/3.0.0-M5 #2

Posted by Apache Jenkins Server <je...@builds.apache.org>.
See https://builds.apache.org/job/maven-box/job/maven-surefire/job/release%252F3.0.0-M5/2/

Changes:

* Switch back to Windows label

All tests passed

Build log:
[...truncated 31721 lines...]
[2019-04-10T09:58:08.415Z] [INFO] Downloading from central: https://repo.maven.apache.org/maven2/org/apache/maven/maven/2.0.5/maven-2.0.5.pom
[2019-04-10T09:58:08.415Z] [INFO] Downloaded from central: https://repo.maven.apache.org/maven2/org/apache/maven/maven/2.0.5/maven-2.0.5.pom (5.7 kB at 190 kB/s)
[2019-04-10T09:58:08.415Z] [INFO] Downloading from central: https://repo.maven.apache.org/maven2/org/apache/maven/maven-artifact/2.0.5/maven-artifact-2.0.5.pom
[2019-04-10T09:58:08.738Z] [INFO] Downloaded from central: https://repo.maven.apache.org/maven2/org/apache/maven/maven-artifact/2.0.5/maven-artifact-2.0.5.pom (727 B at 20 kB/s)
[2019-04-10T09:58:08.738Z] [INFO] Downloading from central: https://repo.maven.apache.org/maven2/org/apache/maven/shared/maven-dependency-tree/3.0.1/maven-dependency-tree-3.0.1.pom
[2019-04-10T09:58:08.738Z] [INFO] Downloaded from central: https://repo.maven.apache.org/maven2/org/apache/maven/shared/maven-dependency-tree/3.0.1/maven-dependency-tree-3.0.1.pom (7.5 kB at 220 kB/s)
[2019-04-10T09:58:08.738Z] [INFO] Downloading from central: https://repo.maven.apache.org/maven2/org/tukaani/xz/1.8/xz-1.8.jar
[2019-04-10T09:58:08.738Z] [INFO] Downloading from central: https://repo.maven.apache.org/maven2/org/apache/maven/shared/maven-shared-io/3.0.0/maven-shared-io-3.0.0.jar
[2019-04-10T09:58:08.738Z] [INFO] Downloading from central: https://repo.maven.apache.org/maven2/org/apache/maven/shared/file-management/3.0.0/file-management-3.0.0.jar
[2019-04-10T09:58:08.738Z] [INFO] Downloading from central: https://repo.maven.apache.org/maven2/org/apache/commons/commons-compress/1.16.1/commons-compress-1.16.1.jar
[2019-04-10T09:58:08.738Z] [INFO] Downloading from central: https://repo.maven.apache.org/maven2/org/codehaus/plexus/plexus-archiver/3.6.0/plexus-archiver-3.6.0.jar
[2019-04-10T09:58:09.105Z] [INFO] Downloaded from central: https://repo.maven.apache.org/maven2/org/apache/maven/shared/file-management/3.0.0/file-management-3.0.0.jar (35 kB at 172 kB/s)
[2019-04-10T09:58:09.105Z] [INFO] Downloading from central: https://repo.maven.apache.org/maven2/org/apache/maven/wagon/wagon-provider-api/2.10/wagon-provider-api-2.10.jar
[2019-04-10T09:58:09.105Z] [INFO] Downloaded from central: https://repo.maven.apache.org/maven2/org/apache/commons/commons-compress/1.16.1/commons-compress-1.16.1.jar (560 kB at 2.5 MB/s)
[2019-04-10T09:58:09.105Z] [INFO] Downloading from central: https://repo.maven.apache.org/maven2/org/apache/maven/shared/maven-dependency-analyzer/1.10/maven-dependency-analyzer-1.10.jar
[2019-04-10T09:58:09.105Z] [INFO] Downloaded from central: https://repo.maven.apache.org/maven2/org/tukaani/xz/1.8/xz-1.8.jar (109 kB at 386 kB/s)
[2019-04-10T09:58:09.105Z] [INFO] Downloading from central: https://repo.maven.apache.org/maven2/org/ow2/asm/asm/6.1.1/asm-6.1.1.jar
[2019-04-10T09:58:09.105Z] [INFO] Downloaded from central: https://repo.maven.apache.org/maven2/org/apache/maven/wagon/wagon-provider-api/2.10/wagon-provider-api-2.10.jar (54 kB at 132 kB/s)
[2019-04-10T09:58:09.105Z] [INFO] Downloading from central: https://repo.maven.apache.org/maven2/org/apache/maven/shared/maven-dependency-tree/3.0.1/maven-dependency-tree-3.0.1.jar
[2019-04-10T09:58:09.105Z] [INFO] Downloaded from central: https://repo.maven.apache.org/maven2/org/apache/maven/shared/maven-dependency-analyzer/1.10/maven-dependency-analyzer-1.10.jar (35 kB at 82 kB/s)
[2019-04-10T09:58:09.105Z] [INFO] Downloaded from central: https://repo.maven.apache.org/maven2/org/apache/maven/shared/maven-shared-io/3.0.0/maven-shared-io-3.0.0.jar (41 kB at 90 kB/s)
[2019-04-10T09:58:09.106Z] [INFO] Downloaded from central: https://repo.maven.apache.org/maven2/org/ow2/asm/asm/6.1.1/asm-6.1.1.jar (108 kB at 232 kB/s)
[2019-04-10T09:58:09.425Z] [INFO] Downloaded from central: https://repo.maven.apache.org/maven2/org/codehaus/plexus/plexus-archiver/3.6.0/plexus-archiver-3.6.0.jar (191 kB at 360 kB/s)
[2019-04-10T09:58:09.425Z] [INFO] Downloaded from central: https://repo.maven.apache.org/maven2/org/apache/maven/shared/maven-dependency-tree/3.0.1/maven-dependency-tree-3.0.1.jar (37 kB at 61 kB/s)
[2019-04-10T09:58:10.492Z] [INFO] Wrote classpath file 'C:\Users\jenkins\AppData\Local\Temp\2\jenkins-maven-box-maven-surefire-release%2F3.0.0-M5-2\surefire-booter\target\test-classpath\cp.txt'.
[2019-04-10T09:58:10.492Z] [INFO] 
[2019-04-10T09:58:10.492Z] [INFO] --- maven-compiler-plugin:3.7.0:compile (compile-generated) @ surefire-booter ---
[2019-04-10T09:58:10.492Z] [INFO] Nothing to compile - all classes are up to date
[2019-04-10T09:58:10.492Z] [INFO] 
[2019-04-10T09:58:10.492Z] [INFO] --- maven-remote-resources-plugin:1.5:process (process-resource-bundles) @ surefire-booter ---
[2019-04-10T09:58:10.492Z] [INFO] 
[2019-04-10T09:58:10.492Z] [INFO] --- maven-resources-plugin:3.1.0:resources (default-resources) @ surefire-booter ---
[2019-04-10T09:58:10.492Z] [INFO] Using 'UTF-8' encoding to copy filtered resources.
[2019-04-10T09:58:10.492Z] [INFO] skip non existing resourceDirectory C:\Users\jenkins\AppData\Local\Temp\2\jenkins-maven-box-maven-surefire-release%2F3.0.0-M5-2\surefire-booter\src\main\resources
[2019-04-10T09:58:10.492Z] [INFO] Copying 3 resources
[2019-04-10T09:58:10.492Z] [INFO] 
[2019-04-10T09:58:10.492Z] [INFO] --- maven-compiler-plugin:3.7.0:compile (default-compile) @ surefire-booter ---
[2019-04-10T09:58:10.492Z] [INFO] Changes detected - recompiling the module!
[2019-04-10T09:58:10.492Z] [INFO] Compiling 23 source files to C:\Users\jenkins\AppData\Local\Temp\2\jenkins-maven-box-maven-surefire-release%2F3.0.0-M5-2\surefire-booter\target\classes
[2019-04-10T09:58:14.083Z] [INFO] 
[2019-04-10T09:58:14.083Z] [INFO] --- animal-sniffer-maven-plugin:1.17:check (signature-check) @ surefire-booter ---
[2019-04-10T09:58:14.083Z] [INFO] Checking unresolved references to org.codehaus.mojo.signature:java17:1.0
[2019-04-10T09:58:14.397Z] [INFO] 
[2019-04-10T09:58:14.397Z] [INFO] --- maven-resources-plugin:3.1.0:testResources (default-testResources) @ surefire-booter ---
[2019-04-10T09:58:14.397Z] [INFO] Using 'UTF-8' encoding to copy filtered resources.
[2019-04-10T09:58:14.397Z] [INFO] Copying 7 resources
[2019-04-10T09:58:14.397Z] [INFO] Copying 3 resources
[2019-04-10T09:58:14.397Z] [INFO] 
[2019-04-10T09:58:14.721Z] [INFO] --- maven-compiler-plugin:3.7.0:testCompile (default-testCompile) @ surefire-booter ---
[2019-04-10T09:58:14.721Z] [INFO] Changes detected - recompiling the module!
[2019-04-10T09:58:14.721Z] [INFO] Compiling 9 source files to C:\Users\jenkins\AppData\Local\Temp\2\jenkins-maven-box-maven-surefire-release%2F3.0.0-M5-2\surefire-booter\target\test-classes
[2019-04-10T09:58:18.379Z] [INFO] 
[2019-04-10T09:58:18.379Z] [INFO] --- maven-surefire-plugin:3.0.0-M3:test (default-test) @ surefire-booter ---
[2019-04-10T09:58:18.379Z] [INFO] Surefire report directory: C:\Users\jenkins\AppData\Local\Temp\2\jenkins-maven-box-maven-surefire-release%2F3.0.0-M5-2\surefire-booter\target\surefire-reports
[2019-04-10T09:58:18.379Z] [INFO] Using configured provider org.apache.maven.shadefire.surefire.junit.JUnit3Provider
[2019-04-10T09:58:18.379Z] [INFO] parallel='none', perCoreThreadCount=true, threadCount=0, useUnlimitedThreads=false, threadCountSuites=0, threadCountClasses=0, threadCountMethods=0, parallelOptimized=true
[2019-04-10T09:58:18.379Z] [INFO] 
[2019-04-10T09:58:18.379Z] [INFO] -------------------------------------------------------
[2019-04-10T09:58:18.379Z] [INFO]  T E S T S
[2019-04-10T09:58:18.379Z] [INFO] -------------------------------------------------------
[2019-04-10T09:58:19.056Z] [INFO] Running org.apache.maven.surefire.booter.JUnit4SuiteTest
[2019-04-10T09:58:23.537Z] [ERROR] Tests run: 52, Failures: 0, Errors: 1, Skipped: 0, Time elapsed: 4.738 s <<< FAILURE! - in org.apache.maven.surefire.booter.JUnit4SuiteTest
[2019-04-10T09:58:23.537Z] [ERROR] org.apache.maven.surefire.booter.CommandReaderTest  Time elapsed: 0.062 s  <<< ERROR!
[2019-04-10T09:58:23.537Z] java.lang.IllegalStateException: java.lang.ClassNotFoundException: org.apache.maven.surefire.booter.CommandReaderTest
[2019-04-10T09:58:23.538Z] 	at org.apache.maven.surefire.booter.NewClassLoaderRunner.getFromTestClassLoader(NewClassLoaderRunner.java:189)
[2019-04-10T09:58:23.538Z] 	at org.apache.maven.surefire.booter.NewClassLoaderRunner.runChild(NewClassLoaderRunner.java:76)
[2019-04-10T09:58:23.538Z] 	at org.apache.maven.surefire.booter.NewClassLoaderRunner.runChild(NewClassLoaderRunner.java:57)
[2019-04-10T09:58:23.538Z] 	at org.junit.runners.ParentRunner$3.run(ParentRunner.java:290)
[2019-04-10T09:58:23.538Z] 	at org.junit.runners.ParentRunner$1.schedule(ParentRunner.java:71)
[2019-04-10T09:58:23.538Z] 	at org.junit.runners.ParentRunner.runChildren(ParentRunner.java:288)
[2019-04-10T09:58:23.538Z] 	at org.junit.runners.ParentRunner.access$000(ParentRunner.java:58)
[2019-04-10T09:58:23.538Z] 	at org.junit.runners.ParentRunner$2.evaluate(ParentRunner.java:268)
[2019-04-10T09:58:23.538Z] 	at org.junit.runners.ParentRunner.run(ParentRunner.java:363)
[2019-04-10T09:58:23.538Z] 	at org.junit.runners.Suite.runChild(Suite.java:128)
[2019-04-10T09:58:23.538Z] 	at org.junit.runners.Suite.runChild(Suite.java:27)
[2019-04-10T09:58:23.538Z] 	at org.junit.runners.ParentRunner$3.run(ParentRunner.java:290)
[2019-04-10T09:58:23.538Z] 	at org.junit.runners.ParentRunner$1.schedule(ParentRunner.java:71)
[2019-04-10T09:58:23.538Z] 	at org.junit.runners.ParentRunner.runChildren(ParentRunner.java:288)
[2019-04-10T09:58:23.538Z] 	at org.junit.runners.ParentRunner.access$000(ParentRunner.java:58)
[2019-04-10T09:58:23.538Z] 	at org.junit.runners.ParentRunner$2.evaluate(ParentRunner.java:268)
[2019-04-10T09:58:23.538Z] 	at org.junit.runners.ParentRunner.run(ParentRunner.java:363)
[2019-04-10T09:58:23.538Z] 	at junit.framework.JUnit4TestAdapter.run(JUnit4TestAdapter.java:38)
[2019-04-10T09:58:23.538Z] 	at sun.reflect.NativeMethodAccessorImpl.invoke0(Native Method)
[2019-04-10T09:58:23.538Z] 	at sun.reflect.NativeMethodAccessorImpl.invoke(NativeMethodAccessorImpl.java:57)
[2019-04-10T09:58:23.538Z] 	at sun.reflect.DelegatingMethodAccessorImpl.invoke(DelegatingMethodAccessorImpl.java:43)
[2019-04-10T09:58:23.538Z] 	at java.lang.reflect.Method.invoke(Method.java:606)
[2019-04-10T09:58:23.538Z] 	at org.apache.maven.shadefire.surefire.junit.JUnitTestSet.execute(JUnitTestSet.java:99)
[2019-04-10T09:58:23.538Z] 	at org.apache.maven.shadefire.surefire.junit.JUnit3Provider.executeTestSet(JUnit3Provider.java:140)
[2019-04-10T09:58:23.538Z] 	at org.apache.maven.shadefire.surefire.junit.JUnit3Provider.invoke(JUnit3Provider.java:113)
[2019-04-10T09:58:23.538Z] 	at org.apache.maven.shadefire.surefire.booter.ForkedBooter.invokeProviderInSameClassLoader(ForkedBooter.java:384)
[2019-04-10T09:58:23.538Z] 	at org.apache.maven.shadefire.surefire.booter.ForkedBooter.runSuitesInProcess(ForkedBooter.java:345)
[2019-04-10T09:58:23.538Z] 	at org.apache.maven.shadefire.surefire.booter.ForkedBooter.execute(ForkedBooter.java:126)
[2019-04-10T09:58:23.538Z] 	at org.apache.maven.shadefire.surefire.booter.ForkedBooter.main(ForkedBooter.java:418)
[2019-04-10T09:58:23.538Z] Caused by: java.lang.ClassNotFoundException: org.apache.maven.surefire.booter.CommandReaderTest
[2019-04-10T09:58:23.538Z] 	at java.net.URLClassLoader$1.run(URLClassLoader.java:366)
[2019-04-10T09:58:23.538Z] 	at java.net.URLClassLoader$1.run(URLClassLoader.java:355)
[2019-04-10T09:58:23.538Z] 	at java.security.AccessController.doPrivileged(Native Method)
[2019-04-10T09:58:23.538Z] 	at java.net.URLClassLoader.findClass(URLClassLoader.java:354)
[2019-04-10T09:58:23.538Z] 	at java.lang.ClassLoader.loadClass(ClassLoader.java:425)
[2019-04-10T09:58:23.538Z] 	at java.lang.ClassLoader.loadClass(ClassLoader.java:358)
[2019-04-10T09:58:23.538Z] 	at java.lang.Class.forName0(Native Method)
[2019-04-10T09:58:23.538Z] 	at java.lang.Class.forName(Class.java:274)
[2019-04-10T09:58:23.538Z] 	at org.apache.maven.surefire.booter.NewClassLoaderRunner.getFromTestClassLoader(NewClassLoaderRunner.java:185)
[2019-04-10T09:58:23.538Z] 	... 28 more
[2019-04-10T09:58:23.538Z] Caused by: java.lang.ClassNotFoundException: org.apache.maven.surefire.booter.CommandReaderTest
[2019-04-10T09:58:23.538Z] 	at java.net.URLClassLoader$1.run(URLClassLoader.java:366)
[2019-04-10T09:58:23.538Z] 	at java.net.URLClassLoader$1.run(URLClassLoader.java:355)
[2019-04-10T09:58:23.538Z] 	at java.security.AccessController.doPrivileged(Native Method)
[2019-04-10T09:58:23.538Z] 	at java.net.URLClassLoader.findClass(URLClassLoader.java:354)
[2019-04-10T09:58:23.538Z] 	at java.lang.ClassLoader.loadClass(ClassLoader.java:425)
[2019-04-10T09:58:23.538Z] 	at java.lang.ClassLoader.loadClass(ClassLoader.java:358)
[2019-04-10T09:58:23.538Z] 	at java.lang.Class.forName0(Native Method)
[2019-04-10T09:58:23.538Z] 	at java.lang.Class.forName(Class.java:274)
[2019-04-10T09:58:23.538Z] 	at org.apache.maven.surefire.booter.NewClassLoaderRunner.getFromTestClassLoader(NewClassLoaderRunner.java:185)
[2019-04-10T09:58:23.538Z] 	... 28 more
[2019-04-10T09:58:23.538Z] 
[2019-04-10T09:58:24.183Z] [INFO] 
[2019-04-10T09:58:24.183Z] [INFO] Results:
[2019-04-10T09:58:24.183Z] [INFO] 
[2019-04-10T09:58:24.183Z] [ERROR] Errors: 
[2019-04-10T09:58:24.183Z] [ERROR]   junit.framework.TestSuite#org.apache.maven.surefire.booter.CommandReaderTest IllegalStateException
[2019-04-10T09:58:24.183Z] [INFO] 
[2019-04-10T09:58:24.183Z] [ERROR] Tests run: 52, Failures: 0, Errors: 1, Skipped: 0
[2019-04-10T09:58:24.183Z] [INFO] 
[2019-04-10T09:58:24.183Z] [INFO] ------------------------------------------------------------------------
[2019-04-10T09:58:24.183Z] [INFO] Reactor Summary for Apache Maven Surefire 3.0.0-SNAPSHOT:
[2019-04-10T09:58:24.183Z] [INFO] 
[2019-04-10T09:58:24.183Z] [INFO] Apache Maven Surefire .............................. SUCCESS [01:02 min]
[2019-04-10T09:58:24.183Z] [INFO] SureFire Logger API ................................ SUCCESS [ 12.988 s]
[2019-04-10T09:58:24.183Z] [INFO] SureFire API ....................................... SUCCESS [ 24.082 s]
[2019-04-10T09:58:24.183Z] [INFO] SureFire Booter .................................... FAILURE [ 19.759 s]
[2019-04-10T09:58:24.183Z] [INFO] Maven Surefire Test-Grouping Support ............... SKIPPED
[2019-04-10T09:58:24.183Z] [INFO] SureFire Providers ................................. SKIPPED
[2019-04-10T09:58:24.183Z] [INFO] Shared JUnit3 Provider Code ........................ SKIPPED
[2019-04-10T09:58:24.183Z] [INFO] Shared Java 5 Provider Base ........................ SKIPPED
[2019-04-10T09:58:24.183Z] [INFO] Shared JUnit4 Provider Code ........................ SKIPPED
[2019-04-10T09:58:24.183Z] [INFO] Shared JUnit48 Provider Code ....................... SKIPPED
[2019-04-10T09:58:24.183Z] [INFO] SureFire JUnit Runner .............................. SKIPPED
[2019-04-10T09:58:24.183Z] [INFO] SureFire JUnit4 Runner ............................. SKIPPED
[2019-04-10T09:58:24.183Z] [INFO] Maven Surefire Common .............................. SKIPPED
[2019-04-10T09:58:24.183Z] [INFO] SureFire JUnitCore Runner .......................... SKIPPED
[2019-04-10T09:58:24.183Z] [INFO] SureFire JUnit Platform Runner ..................... SKIPPED
[2019-04-10T09:58:24.183Z] [INFO] SureFire TestNG Utils .............................. SKIPPED
[2019-04-10T09:58:24.183Z] [INFO] SureFire TestNG Runner ............................. SKIPPED
[2019-04-10T09:58:24.183Z] [INFO] ShadeFire JUnit3 Provider .......................... SKIPPED
[2019-04-10T09:58:24.183Z] [INFO] Surefire Report Parser ............................. SKIPPED
[2019-04-10T09:58:24.183Z] [INFO] Maven Surefire Plugin .............................. SKIPPED
[2019-04-10T09:58:24.183Z] [INFO] Maven Failsafe Plugin .............................. SKIPPED
[2019-04-10T09:58:24.183Z] [INFO] Maven Surefire Report Plugin ....................... SKIPPED
[2019-04-10T09:58:24.183Z] [INFO] Maven Surefire Integration Tests ................... SKIPPED
[2019-04-10T09:58:24.183Z] [INFO] ------------------------------------------------------------------------
[2019-04-10T09:58:24.183Z] [INFO] BUILD FAILURE
[2019-04-10T09:58:24.183Z] [INFO] ------------------------------------------------------------------------
[2019-04-10T09:58:24.183Z] [INFO] Total time:  02:02 min
[2019-04-10T09:58:24.183Z] [INFO] Finished at: 2019-04-10T02:58:23-07:00
[2019-04-10T09:58:24.183Z] [INFO] ------------------------------------------------------------------------
[2019-04-10T09:58:24.183Z] [ERROR] Failed to execute goal org.apache.maven.plugins:maven-surefire-plugin:3.0.0-M3:test (default-test) on project surefire-booter: There are test failures.
[2019-04-10T09:58:24.183Z] [ERROR] 
[2019-04-10T09:58:24.183Z] [ERROR] Please refer to C:\Users\jenkins\AppData\Local\Temp\2\jenkins-maven-box-maven-surefire-release%2F3.0.0-M5-2\surefire-booter\target\surefire-reports for the individual test results.
[2019-04-10T09:58:24.183Z] [ERROR] Please refer to dump files (if any exist) [date].dump, [date]-jvmRun[N].dump and [date].dumpstream.
[2019-04-10T09:58:24.183Z] [ERROR] -> [Help 1]
[2019-04-10T09:58:24.183Z] org.apache.maven.lifecycle.LifecycleExecutionException: Failed to execute goal org.apache.maven.plugins:maven-surefire-plugin:3.0.0-M3:test (default-test) on project surefire-booter: There are test failures.
[2019-04-10T09:58:24.183Z] 
[2019-04-10T09:58:24.183Z] Please refer to C:\Users\jenkins\AppData\Local\Temp\2\jenkins-maven-box-maven-surefire-release%2F3.0.0-M5-2\surefire-booter\target\surefire-reports for the individual test results.
[2019-04-10T09:58:24.183Z] Please refer to dump files (if any exist) [date].dump, [date]-jvmRun[N].dump and [date].dumpstream.
[2019-04-10T09:58:24.183Z]     at org.apache.maven.lifecycle.internal.MojoExecutor.execute (MojoExecutor.java:215)
[2019-04-10T09:58:24.183Z]     at org.apache.maven.lifecycle.internal.MojoExecutor.execute (MojoExecutor.java:156)
[2019-04-10T09:58:24.183Z]     at org.apache.maven.lifecycle.internal.MojoExecutor.execute (MojoExecutor.java:148)
[2019-04-10T09:58:24.183Z]     at org.apache.maven.lifecycle.internal.LifecycleModuleBuilder.buildProject (LifecycleModuleBuilder.java:117)
[2019-04-10T09:58:24.183Z]     at org.apache.maven.lifecycle.internal.LifecycleModuleBuilder.buildProject (LifecycleModuleBuilder.java:81)
[2019-04-10T09:58:24.183Z]     at org.apache.maven.lifecycle.internal.builder.singlethreaded.SingleThreadedBuilder.build (SingleThreadedBuilder.java:56)
[2019-04-10T09:58:24.183Z]     at org.apache.maven.lifecycle.internal.LifecycleStarter.execute (LifecycleStarter.java:128)
[2019-04-10T09:58:24.183Z]     at org.apache.maven.DefaultMaven.doExecute (DefaultMaven.java:305)
[2019-04-10T09:58:24.183Z]     at org.apache.maven.DefaultMaven.doExecute (DefaultMaven.java:192)
[2019-04-10T09:58:24.183Z]     at org.apache.maven.DefaultMaven.execute (DefaultMaven.java:105)
[2019-04-10T09:58:24.183Z]     at org.apache.maven.cli.MavenCli.execute (MavenCli.java:956)
[2019-04-10T09:58:24.183Z]     at org.apache.maven.cli.MavenCli.doMain (MavenCli.java:288)
[2019-04-10T09:58:24.183Z]     at org.apache.maven.cli.MavenCli.main (MavenCli.java:192)
[2019-04-10T09:58:24.183Z]     at sun.reflect.NativeMethodAccessorImpl.invoke0 (Native Method)
[2019-04-10T09:58:24.183Z]     at sun.reflect.NativeMethodAccessorImpl.invoke (NativeMethodAccessorImpl.java:62)
[2019-04-10T09:58:24.183Z]     at sun.reflect.DelegatingMethodAccessorImpl.invoke (DelegatingMethodAccessorImpl.java:43)
[2019-04-10T09:58:24.183Z]     at java.lang.reflect.Method.invoke (Method.java:498)
[2019-04-10T09:58:24.183Z]     at org.codehaus.plexus.classworlds.launcher.Launcher.launchEnhanced (Launcher.java:289)
[2019-04-10T09:58:24.183Z]     at org.codehaus.plexus.classworlds.launcher.Launcher.launch (Launcher.java:229)
[2019-04-10T09:58:24.183Z]     at org.codehaus.plexus.classworlds.launcher.Launcher.mainWithExitCode (Launcher.java:415)
[2019-04-10T09:58:24.183Z]     at org.codehaus.plexus.classworlds.launcher.Launcher.main (Launcher.java:356)
[2019-04-10T09:58:24.183Z] Caused by: org.apache.maven.plugin.MojoFailureException: There are test failures.
[2019-04-10T09:58:24.183Z] 
[2019-04-10T09:58:24.183Z] Please refer to C:\Users\jenkins\AppData\Local\Temp\2\jenkins-maven-box-maven-surefire-release%2F3.0.0-M5-2\surefire-booter\target\surefire-reports for the individual test results.
[2019-04-10T09:58:24.183Z] Please refer to dump files (if any exist) [date].dump, [date]-jvmRun[N].dump and [date].dumpstream.
[2019-04-10T09:58:24.184Z]     at org.apache.maven.plugin.surefire.SurefireHelper.throwException (SurefireHelper.java:271)
[2019-04-10T09:58:24.184Z]     at org.apache.maven.plugin.surefire.SurefireHelper.reportExecution (SurefireHelper.java:159)
[2019-04-10T09:58:24.184Z]     at org.apache.maven.plugin.surefire.SurefirePlugin.handleSummary (SurefirePlugin.java:373)
[2019-04-10T09:58:24.184Z]     at org.apache.maven.plugin.surefire.AbstractSurefireMojo.executeAfterPreconditionsChecked (AbstractSurefireMojo.java:1018)
[2019-04-10T09:58:24.184Z]     at org.apache.maven.plugin.surefire.AbstractSurefireMojo.execute (AbstractSurefireMojo.java:848)
[2019-04-10T09:58:24.184Z]     at org.apache.maven.plugin.DefaultBuildPluginManager.executeMojo (DefaultBuildPluginManager.java:137)
[2019-04-10T09:58:24.184Z]     at org.apache.maven.lifecycle.internal.MojoExecutor.execute (MojoExecutor.java:210)
[2019-04-10T09:58:24.184Z]     at org.apache.maven.lifecycle.internal.MojoExecutor.execute (MojoExecutor.java:156)
[2019-04-10T09:58:24.184Z]     at org.apache.maven.lifecycle.internal.MojoExecutor.execute (MojoExecutor.java:148)
[2019-04-10T09:58:24.184Z]     at org.apache.maven.lifecycle.internal.LifecycleModuleBuilder.buildProject (LifecycleModuleBuilder.java:117)
[2019-04-10T09:58:24.184Z]     at org.apache.maven.lifecycle.internal.LifecycleModuleBuilder.buildProject (LifecycleModuleBuilder.java:81)
[2019-04-10T09:58:24.184Z]     at org.apache.maven.lifecycle.internal.builder.singlethreaded.SingleThreadedBuilder.build (SingleThreadedBuilder.java:56)
[2019-04-10T09:58:24.184Z]     at org.apache.maven.lifecycle.internal.LifecycleStarter.execute (LifecycleStarter.java:128)
[2019-04-10T09:58:24.184Z]     at org.apache.maven.DefaultMaven.doExecute (DefaultMaven.java:305)
[2019-04-10T09:58:24.184Z]     at org.apache.maven.DefaultMaven.doExecute (DefaultMaven.java:192)
[2019-04-10T09:58:24.184Z]     at org.apache.maven.DefaultMaven.execute (DefaultMaven.java:105)
[2019-04-10T09:58:24.184Z]     at org.apache.maven.cli.MavenCli.execute (MavenCli.java:956)
[2019-04-10T09:58:24.184Z]     at org.apache.maven.cli.MavenCli.doMain (MavenCli.java:288)
[2019-04-10T09:58:24.184Z]     at org.apache.maven.cli.MavenCli.main (MavenCli.java:192)
[2019-04-10T09:58:24.184Z]     at sun.reflect.NativeMethodAccessorImpl.invoke0 (Native Method)
[2019-04-10T09:58:24.184Z]     at sun.reflect.NativeMethodAccessorImpl.invoke (NativeMethodAccessorImpl.java:62)
[2019-04-10T09:58:24.184Z]     at sun.reflect.DelegatingMethodAccessorImpl.invoke (DelegatingMethodAccessorImpl.java:43)
[2019-04-10T09:58:24.184Z]     at java.lang.reflect.Method.invoke (Method.java:498)
[2019-04-10T09:58:24.184Z]     at org.codehaus.plexus.classworlds.launcher.Launcher.launchEnhanced (Launcher.java:289)
[2019-04-10T09:58:24.184Z]     at org.codehaus.plexus.classworlds.launcher.Launcher.launch (Launcher.java:229)
[2019-04-10T09:58:24.184Z]     at org.codehaus.plexus.classworlds.launcher.Launcher.mainWithExitCode (Launcher.java:415)
[2019-04-10T09:58:24.184Z]     at org.codehaus.plexus.classworlds.launcher.Launcher.main (Launcher.java:356)
[2019-04-10T09:58:24.184Z] [ERROR] 
[2019-04-10T09:58:24.184Z] [ERROR] Re-run Maven using the -X switch to enable full debug logging.
[2019-04-10T09:58:24.184Z] [ERROR] 
[2019-04-10T09:58:24.184Z] [ERROR] For more information about the errors and possible solutions, please read the following articles:
[2019-04-10T09:58:24.184Z] [ERROR] [Help 1] http://cwiki.apache.org/confluence/display/MAVEN/MojoFailureException
[2019-04-10T09:58:24.184Z] [ERROR] 
[2019-04-10T09:58:24.184Z] [ERROR] After correcting the problems, you can resume the build with the command
[2019-04-10T09:58:24.184Z] [ERROR]   mvn <goals> -rf :surefire-booter
[Pipeline] }
[Pipeline] // withEnv
[Pipeline] }
[Pipeline] // stage
[Pipeline] fileExists
[Pipeline] fileExists
[Pipeline] archiveArtifacts
[2019-04-10T09:58:24.408Z] Archiving artifacts
[Pipeline] cleanWs
[2019-04-10T09:58:24.483Z] [WS-CLEANUP] Deleting project workspace...
[2019-04-10T09:58:24.483Z] [WS-CLEANUP] Deferred wipeout is used...
[2019-04-10T09:58:24.529Z] [WS-CLEANUP] done
[Pipeline] }
[Pipeline] // ws
[Pipeline] }
[Pipeline] // timestamps
[Pipeline] }
[Pipeline] // node
[Pipeline] }
[Pipeline] // parallel
[Pipeline] echo
Build result: FAILURE
[Pipeline] jiraIssueSelector
[Pipeline] emailext