You are viewing a plain text version of this content. The canonical link for it is here.
Posted to dev@pdfbox.apache.org by Apache Jenkins Server <je...@builds.apache.org> on 2026/06/24 12:20:16 UTC
Build failed in Jenkins: PDFBox » PDFBox-sonar2 » pdfbox-reactor #2142
See <https://ci-builds.apache.org/job/PDFBox/job/PDFBox-sonar2/org.apache.pdfbox$pdfbox-reactor/2142/display/redirect>
Changes:
------------------------------------------
[INFO]
[INFO] ------------------< org.apache.pdfbox:pdfbox-reactor >------------------
[INFO] Building pdfbox-reactor 4.0.0-SNAPSHOT [11/11]
[INFO] from pom.xml
[INFO] --------------------------------[ pom ]---------------------------------
[INFO]
[INFO] --- enforcer:3.6.3:enforce (default) @ pdfbox-reactor ---
[INFO]
[INFO] --- enforcer:3.6.3:enforce (enforce-maven-version) @ pdfbox-reactor ---
[INFO]
[INFO] --- enforcer:3.6.3:enforce (enforce-java-version) @ pdfbox-reactor ---
[INFO]
[INFO] --- checkstyle:3.6.0:check (check) @ pdfbox-reactor ---
[INFO] Starting audit...
Audit done.
[INFO] You have 0 Checkstyle violations.
[INFO]
[INFO] --- jacoco:0.8.15:prepare-agent (default) @ pdfbox-reactor ---
[INFO] surefireArgLine set to -javaagent:/home/jenkins/.m2/repository/org/jacoco/org.jacoco.agent/0.8.15/org.jacoco.agent-0.8.15-runtime.jar=destfile=<https://ci-builds.apache.org/job/PDFBox/job/PDFBox-sonar2/org.apache.pdfbox$pdfbox-reactor/ws/target/jacoco.exec>
[INFO]
[INFO] --- remote-resources:3.3.0:process (process-resource-bundles) @ pdfbox-reactor ---
[INFO] Preparing remote bundle org.apache.apache.resources:apache-jar-resource-bundle:1.8
[INFO] Copying 3 resources from 1 bundle.
[INFO]
[INFO] --- jacoco:0.8.15:report (report) @ pdfbox-reactor ---
[INFO] Skipping JaCoCo execution due to missing execution data file.
[INFO]
[INFO] --- source:3.4.0:jar-no-fork (attach-sources) @ pdfbox-reactor ---
[INFO]
[INFO] ------------------< org.apache.pdfbox:pdfbox-reactor >------------------
[INFO] Building pdfbox-reactor 4.0.0-SNAPSHOT [12/11]
[INFO] from pom.xml
[INFO] --------------------------------[ pom ]---------------------------------
[INFO]
[INFO] --- sonar:5.7.0.6970:sonar (default-cli) @ pdfbox-reactor ---
[WARNING] Using an unspecified version instead of an explicit plugin version may introduce breaking analysis changes at an unwanted time. It is highly recommended to use an explicit version, e.g. 'org.sonarsource.scanner.maven:sonar-maven-plugin:5.7.0.6970'.
[INFO] Java 17.0.12 Eclipse Adoptium (64-bit)
[INFO] Linux 5.15.0-164-generic (amd64)
[INFO] Communicating with SonarQube Cloud
[INFO] JRE provisioning: os[linux], arch[x86_64]
[INFO] Starting SonarScanner Engine...
[INFO] Java 21.0.9 Eclipse Adoptium (64-bit)
[INFO] Load global settings
[INFO] Load global settings (done) | time=1337ms
[INFO] Server id: 1BD809FA-AWHW8ct9-T_TB3XqouNu
[INFO] Loading required plugins
[INFO] Load plugins index
[INFO] Load plugins index (done) | time=244ms
[INFO] Load/download plugins
[INFO] Load/download plugins (done) | time=906ms
[INFO] Loaded core extensions: sca, a3s, architecture
[INFO] Process project properties
[INFO] Project key: pdfbox-reactor
[INFO] Base dir: <https://ci-builds.apache.org/job/PDFBox/job/PDFBox-sonar2/org.apache.pdfbox$pdfbox-reactor/ws/>
[INFO] Working dir: <https://ci-builds.apache.org/job/PDFBox/job/PDFBox-sonar2/org.apache.pdfbox$pdfbox-reactor/ws/target/sonar>
[INFO] Load project settings for component key: 'pdfbox-reactor'
[INFO] Load project settings for component key: 'pdfbox-reactor' (done) | time=330ms
[INFO] Found an active CI vendor: 'Jenkins'
[ERROR] Error retrieving feature flags, using default analyzer behavior
Not authorized or project not found. Please check the 'SONAR_TOKEN' environment variable, the 'sonar.projectKey' and 'sonar.organization' properties, or contact the project administrator to verify the token's permissions.
[INFO] Check ALM binding of project 'pdfbox-reactor'
[WARNING] Failed to check if project 'pdfbox-reactor' is bound
[INFO] Detected project binding: ERROR
[INFO] Check ALM binding of project 'pdfbox-reactor' (done) | time=159ms
[INFO] Load branch configuration
[INFO] Load branch configuration (done) | time=5ms
[INFO] Create analysis
[ERROR] Not authorized or project not found. Please check the 'SONAR_TOKEN' environment variable, the 'sonar.projectKey' and 'sonar.organization' properties, or contact the project administrator to verify the token's permissions.
---------------------------------------------------------------------
To unsubscribe, e-mail: dev-unsubscribe@pdfbox.apache.org
For additional commands, e-mail: dev-help@pdfbox.apache.org
Jenkins build is back to normal : PDFBox » PDFBox-sonar2 » pdfbox-reactor #2147
Posted by Apache Jenkins Server <je...@builds.apache.org>.
See <https://ci-builds.apache.org/job/PDFBox/job/PDFBox-sonar2/org.apache.pdfbox$pdfbox-reactor/2147/display/redirect>
---------------------------------------------------------------------
To unsubscribe, e-mail: dev-unsubscribe@pdfbox.apache.org
For additional commands, e-mail: dev-help@pdfbox.apache.org
Build failed in Jenkins: PDFBox » PDFBox-sonar2 » pdfbox-reactor #2146
Posted by Apache Jenkins Server <je...@builds.apache.org>.
See <https://ci-builds.apache.org/job/PDFBox/job/PDFBox-sonar2/org.apache.pdfbox$pdfbox-reactor/2146/display/redirect>
Changes:
------------------------------------------
[INFO]
[INFO] ------------------< org.apache.pdfbox:pdfbox-reactor >------------------
[INFO] Building pdfbox-reactor 4.0.0-SNAPSHOT [11/11]
[INFO] from pom.xml
[INFO] --------------------------------[ pom ]---------------------------------
[INFO]
[INFO] --- enforcer:3.6.3:enforce (default) @ pdfbox-reactor ---
[INFO]
[INFO] --- enforcer:3.6.3:enforce (enforce-maven-version) @ pdfbox-reactor ---
[INFO]
[INFO] --- enforcer:3.6.3:enforce (enforce-java-version) @ pdfbox-reactor ---
[INFO]
[INFO] --- checkstyle:3.6.0:check (check) @ pdfbox-reactor ---
[INFO] Starting audit...
Audit done.
[INFO] You have 0 Checkstyle violations.
[INFO]
[INFO] --- jacoco:0.8.15:prepare-agent (default) @ pdfbox-reactor ---
[INFO] surefireArgLine set to -javaagent:/home/jenkins/.m2/repository/org/jacoco/org.jacoco.agent/0.8.15/org.jacoco.agent-0.8.15-runtime.jar=destfile=<https://ci-builds.apache.org/job/PDFBox/job/PDFBox-sonar2/org.apache.pdfbox$pdfbox-reactor/ws/target/jacoco.exec>
[INFO]
[INFO] --- remote-resources:3.3.0:process (process-resource-bundles) @ pdfbox-reactor ---
[INFO] Preparing remote bundle org.apache.apache.resources:apache-jar-resource-bundle:1.8
[INFO] Copying 3 resources from 1 bundle.
[INFO]
[INFO] --- jacoco:0.8.15:report (report) @ pdfbox-reactor ---
[INFO] Skipping JaCoCo execution due to missing execution data file.
[INFO]
[INFO] --- source:3.4.0:jar-no-fork (attach-sources) @ pdfbox-reactor ---
[INFO]
[INFO] ------------------< org.apache.pdfbox:pdfbox-reactor >------------------
[INFO] Building pdfbox-reactor 4.0.0-SNAPSHOT [12/11]
[INFO] from pom.xml
[INFO] --------------------------------[ pom ]---------------------------------
[INFO]
[INFO] --- sonar:5.7.0.6970:sonar (default-cli) @ pdfbox-reactor ---
[INFO] Downloading from central: https://repo.maven.apache.org/maven2/org/sonarsource/scanner/lib/sonar-scanner-java-library/4.1.1.1633/sonar-scanner-java-library-4.1.1.1633.pom
[INFO] Downloaded from central: https://repo.maven.apache.org/maven2/org/sonarsource/scanner/lib/sonar-scanner-java-library/4.1.1.1633/sonar-scanner-java-library-4.1.1.1633.pom (5.2 kB at 260 kB/s)
[INFO] Downloading from central: https://repo.maven.apache.org/maven2/org/sonarsource/scanner/lib/sonar-scanner-java-library-parent/4.1.1.1633/sonar-scanner-java-library-parent-4.1.1.1633.pom
[INFO] Downloaded from central: https://repo.maven.apache.org/maven2/org/sonarsource/scanner/lib/sonar-scanner-java-library-parent/4.1.1.1633/sonar-scanner-java-library-parent-4.1.1.1633.pom (4.2 kB at 220 kB/s)
[INFO] Downloading from central: https://repo.maven.apache.org/maven2/org/sonarsource/scanner/lib/sonar-scanner-download-cache/4.1.1.1633/sonar-scanner-download-cache-4.1.1.1633.pom
[INFO] Downloaded from central: https://repo.maven.apache.org/maven2/org/sonarsource/scanner/lib/sonar-scanner-download-cache/4.1.1.1633/sonar-scanner-download-cache-4.1.1.1633.pom (2.1 kB at 121 kB/s)
[INFO] Downloading from central: https://repo.maven.apache.org/maven2/org/sonarsource/scanner/lib/sonar-scanner-java-library-batch-interface/4.1.1.1633/sonar-scanner-java-library-batch-interface-4.1.1.1633.pom
[INFO] Downloaded from central: https://repo.maven.apache.org/maven2/org/sonarsource/scanner/lib/sonar-scanner-java-library-batch-interface/4.1.1.1633/sonar-scanner-java-library-batch-interface-4.1.1.1633.pom (554 B at 33 kB/s)
[INFO] Downloading from central: https://repo.maven.apache.org/maven2/io/github/hakky54/ayza/10.0.3/ayza-10.0.3.pom
[INFO] Downloaded from central: https://repo.maven.apache.org/maven2/io/github/hakky54/ayza/10.0.3/ayza-10.0.3.pom (5.0 kB at 215 kB/s)
[INFO] Downloading from central: https://repo.maven.apache.org/maven2/io/github/hakky54/ayza-parent/10.0.3/ayza-parent-10.0.3.pom
[INFO] Downloaded from central: https://repo.maven.apache.org/maven2/io/github/hakky54/ayza-parent/10.0.3/ayza-parent-10.0.3.pom (14 kB at 782 kB/s)
[INFO] Downloading from central: https://repo.maven.apache.org/maven2/io/github/hakky54/ayza-bom/10.0.3/ayza-bom-10.0.3.pom
[INFO] Downloaded from central: https://repo.maven.apache.org/maven2/io/github/hakky54/ayza-bom/10.0.3/ayza-bom-10.0.3.pom (6.5 kB at 408 kB/s)
[INFO] Downloading from central: https://repo.maven.apache.org/maven2/io/github/hakky54/sude/2.0.2/sude-2.0.2.pom
[INFO] Downloaded from central: https://repo.maven.apache.org/maven2/io/github/hakky54/sude/2.0.2/sude-2.0.2.pom (13 kB at 759 kB/s)
[INFO] Downloading from central: https://repo.maven.apache.org/maven2/de/siegmar/fastcsv/3.7.0/fastcsv-3.7.0.pom
[INFO] Downloaded from central: https://repo.maven.apache.org/maven2/de/siegmar/fastcsv/3.7.0/fastcsv-3.7.0.pom (1.4 kB at 82 kB/s)
[INFO] Downloading from central: https://repo.maven.apache.org/maven2/org/sonarsource/scanner/lib/sonar-scanner-java-library/4.1.1.1633/sonar-scanner-java-library-4.1.1.1633.jar
[INFO] Downloaded from central: https://repo.maven.apache.org/maven2/org/sonarsource/scanner/lib/sonar-scanner-java-library/4.1.1.1633/sonar-scanner-java-library-4.1.1.1633.jar (129 kB at 8.0 MB/s)
[INFO] Downloading from central: https://repo.maven.apache.org/maven2/com/google/code/gson/gson/2.13.2/gson-2.13.2.jar
[INFO] Downloading from central: https://repo.maven.apache.org/maven2/org/sonarsource/scanner/lib/sonar-scanner-download-cache/4.1.1.1633/sonar-scanner-download-cache-4.1.1.1633.jar
[INFO] Downloading from central: https://repo.maven.apache.org/maven2/org/sonarsource/scanner/lib/sonar-scanner-java-library-batch-interface/4.1.1.1633/sonar-scanner-java-library-batch-interface-4.1.1.1633.jar
[INFO] Downloading from central: https://repo.maven.apache.org/maven2/io/github/hakky54/ayza/10.0.3/ayza-10.0.3.jar
[INFO] Downloading from central: https://repo.maven.apache.org/maven2/io/github/hakky54/sude/2.0.2/sude-2.0.2.jar
[INFO] Downloaded from central: https://repo.maven.apache.org/maven2/com/google/code/gson/gson/2.13.2/gson-2.13.2.jar (290 kB at 14 MB/s)
[INFO] Downloading from central: https://repo.maven.apache.org/maven2/de/siegmar/fastcsv/3.7.0/fastcsv-3.7.0.jar
[INFO] Downloaded from central: https://repo.maven.apache.org/maven2/org/sonarsource/scanner/lib/sonar-scanner-java-library-batch-interface/4.1.1.1633/sonar-scanner-java-library-batch-interface-4.1.1.1633.jar (4.7 kB at 224 kB/s)
[INFO] Downloaded from central: https://repo.maven.apache.org/maven2/io/github/hakky54/ayza/10.0.3/ayza-10.0.3.jar (204 kB at 9.3 MB/s)
[INFO] Downloaded from central: https://repo.maven.apache.org/maven2/io/github/hakky54/sude/2.0.2/sude-2.0.2.jar (8.6 kB at 372 kB/s)
[INFO] Downloaded from central: https://repo.maven.apache.org/maven2/org/sonarsource/scanner/lib/sonar-scanner-download-cache/4.1.1.1633/sonar-scanner-download-cache-4.1.1.1633.jar (9.5 kB at 298 kB/s)
[INFO] Downloaded from central: https://repo.maven.apache.org/maven2/de/siegmar/fastcsv/3.7.0/fastcsv-3.7.0.jar (82 kB at 2.6 MB/s)
[WARNING] Using an unspecified version instead of an explicit plugin version may introduce breaking analysis changes at an unwanted time. It is highly recommended to use an explicit version, e.g. 'org.sonarsource.scanner.maven:sonar-maven-plugin:5.7.0.6970'.
[INFO] Java 17.0.12 Eclipse Adoptium (64-bit)
[INFO] Linux 6.8.0-1024-aws (amd64)
[INFO] Communicating with SonarQube Cloud
[INFO] JRE provisioning: os[linux], arch[x86_64]
[INFO] Starting SonarScanner Engine...
[INFO] Java 21.0.9 Eclipse Adoptium (64-bit)
[INFO] Load global settings
[INFO] Load global settings (done) | time=3098ms
[INFO] Server id: 1BD809FA-AWHW8ct9-T_TB3XqouNu
[INFO] Loading required plugins
[INFO] Load plugins index
[INFO] Load plugins index (done) | time=2433ms
[INFO] Load/download plugins
[INFO] Load/download plugins (done) | time=73ms
[INFO] Loaded core extensions: sca, a3s, architecture
[INFO] Process project properties
[INFO] Project key: pdfbox-reactor
[INFO] Base dir: <https://ci-builds.apache.org/job/PDFBox/job/PDFBox-sonar2/org.apache.pdfbox$pdfbox-reactor/ws/>
[INFO] Working dir: <https://ci-builds.apache.org/job/PDFBox/job/PDFBox-sonar2/org.apache.pdfbox$pdfbox-reactor/ws/target/sonar>
[INFO] Load project settings for component key: 'pdfbox-reactor'
[INFO] Load project settings for component key: 'pdfbox-reactor' (done) | time=181ms
[INFO] Found an active CI vendor: 'Jenkins'
[ERROR] Error retrieving feature flags, using default analyzer behavior
Not authorized or project not found. Please check the 'SONAR_TOKEN' environment variable, the 'sonar.projectKey' and 'sonar.organization' properties, or contact the project administrator to verify the token's permissions.
[INFO] Check ALM binding of project 'pdfbox-reactor'
[WARNING] Failed to check if project 'pdfbox-reactor' is bound
[INFO] Detected project binding: ERROR
[INFO] Check ALM binding of project 'pdfbox-reactor' (done) | time=28ms
[INFO] Load branch configuration
[INFO] Load branch configuration (done) | time=3ms
[INFO] Create analysis
[ERROR] Not authorized or project not found. Please check the 'SONAR_TOKEN' environment variable, the 'sonar.projectKey' and 'sonar.organization' properties, or contact the project administrator to verify the token's permissions.
---------------------------------------------------------------------
To unsubscribe, e-mail: dev-unsubscribe@pdfbox.apache.org
For additional commands, e-mail: dev-help@pdfbox.apache.org
Build failed in Jenkins: PDFBox » PDFBox-sonar2 » pdfbox-reactor #2145
Posted by Apache Jenkins Server <je...@builds.apache.org>.
See <https://ci-builds.apache.org/job/PDFBox/job/PDFBox-sonar2/org.apache.pdfbox$pdfbox-reactor/2145/display/redirect>
Changes:
------------------------------------------
[INFO]
[INFO] ------------------< org.apache.pdfbox:pdfbox-reactor >------------------
[INFO] Building pdfbox-reactor 4.0.0-SNAPSHOT [11/11]
[INFO] from pom.xml
[INFO] --------------------------------[ pom ]---------------------------------
[INFO]
[INFO] --- enforcer:3.6.3:enforce (default) @ pdfbox-reactor ---
[INFO]
[INFO] --- enforcer:3.6.3:enforce (enforce-maven-version) @ pdfbox-reactor ---
[INFO]
[INFO] --- enforcer:3.6.3:enforce (enforce-java-version) @ pdfbox-reactor ---
[INFO]
[INFO] --- checkstyle:3.6.0:check (check) @ pdfbox-reactor ---
[INFO] Starting audit...
Audit done.
[INFO] You have 0 Checkstyle violations.
[INFO]
[INFO] --- jacoco:0.8.15:prepare-agent (default) @ pdfbox-reactor ---
[INFO] surefireArgLine set to -javaagent:/home/jenkins/.m2/repository/org/jacoco/org.jacoco.agent/0.8.15/org.jacoco.agent-0.8.15-runtime.jar=destfile=<https://ci-builds.apache.org/job/PDFBox/job/PDFBox-sonar2/org.apache.pdfbox$pdfbox-reactor/ws/target/jacoco.exec>
[INFO]
[INFO] --- remote-resources:3.3.0:process (process-resource-bundles) @ pdfbox-reactor ---
[INFO] Preparing remote bundle org.apache.apache.resources:apache-jar-resource-bundle:1.8
[INFO] Copying 3 resources from 1 bundle.
[INFO]
[INFO] --- jacoco:0.8.15:report (report) @ pdfbox-reactor ---
[INFO] Skipping JaCoCo execution due to missing execution data file.
[INFO]
[INFO] --- source:3.4.0:jar-no-fork (attach-sources) @ pdfbox-reactor ---
[INFO]
[INFO] ------------------< org.apache.pdfbox:pdfbox-reactor >------------------
[INFO] Building pdfbox-reactor 4.0.0-SNAPSHOT [12/11]
[INFO] from pom.xml
[INFO] --------------------------------[ pom ]---------------------------------
[INFO]
[INFO] --- sonar:5.7.0.6970:sonar (default-cli) @ pdfbox-reactor ---
[WARNING] Using an unspecified version instead of an explicit plugin version may introduce breaking analysis changes at an unwanted time. It is highly recommended to use an explicit version, e.g. 'org.sonarsource.scanner.maven:sonar-maven-plugin:5.7.0.6970'.
[INFO] Java 17.0.12 Eclipse Adoptium (64-bit)
[INFO] Linux 5.15.0-179-generic (amd64)
[INFO] Communicating with SonarQube Cloud
[INFO] JRE provisioning: os[linux], arch[x86_64]
[INFO] Starting SonarScanner Engine...
[INFO] Java 21.0.9 Eclipse Adoptium (64-bit)
[INFO] Load global settings
[INFO] Load global settings (done) | time=594ms
[INFO] Server id: 1BD809FA-AWHW8ct9-T_TB3XqouNu
[INFO] Loading required plugins
[INFO] Load plugins index
[INFO] Load plugins index (done) | time=179ms
[INFO] Load/download plugins
[INFO] Load/download plugins (done) | time=110ms
[INFO] Loaded core extensions: sca, architecture, a3s
[INFO] Process project properties
[INFO] Project key: pdfbox-reactor
[INFO] Base dir: <https://ci-builds.apache.org/job/PDFBox/job/PDFBox-sonar2/org.apache.pdfbox$pdfbox-reactor/ws/>
[INFO] Working dir: <https://ci-builds.apache.org/job/PDFBox/job/PDFBox-sonar2/org.apache.pdfbox$pdfbox-reactor/ws/target/sonar>
[INFO] Load project settings for component key: 'pdfbox-reactor'
[INFO] Load project settings for component key: 'pdfbox-reactor' (done) | time=246ms
[INFO] Found an active CI vendor: 'Jenkins'
[ERROR] Error retrieving feature flags, using default analyzer behavior
Not authorized or project not found. Please check the 'SONAR_TOKEN' environment variable, the 'sonar.projectKey' and 'sonar.organization' properties, or contact the project administrator to verify the token's permissions.
[INFO] Check ALM binding of project 'pdfbox-reactor'
[WARNING] Failed to check if project 'pdfbox-reactor' is bound
[INFO] Detected project binding: ERROR
[INFO] Check ALM binding of project 'pdfbox-reactor' (done) | time=163ms
[INFO] Load branch configuration
[INFO] Load branch configuration (done) | time=3ms
[INFO] Create analysis
[ERROR] Not authorized or project not found. Please check the 'SONAR_TOKEN' environment variable, the 'sonar.projectKey' and 'sonar.organization' properties, or contact the project administrator to verify the token's permissions.
---------------------------------------------------------------------
To unsubscribe, e-mail: dev-unsubscribe@pdfbox.apache.org
For additional commands, e-mail: dev-help@pdfbox.apache.org
Build failed in Jenkins: PDFBox » PDFBox-sonar2 » pdfbox-reactor #2144
Posted by Apache Jenkins Server <je...@builds.apache.org>.
See <https://ci-builds.apache.org/job/PDFBox/job/PDFBox-sonar2/org.apache.pdfbox$pdfbox-reactor/2144/display/redirect>
Changes:
------------------------------------------
[INFO]
[INFO] ------------------< org.apache.pdfbox:pdfbox-reactor >------------------
[INFO] Building pdfbox-reactor 4.0.0-SNAPSHOT [11/11]
[INFO] from pom.xml
[INFO] --------------------------------[ pom ]---------------------------------
[INFO]
[INFO] --- enforcer:3.6.3:enforce (default) @ pdfbox-reactor ---
[INFO]
[INFO] --- enforcer:3.6.3:enforce (enforce-maven-version) @ pdfbox-reactor ---
[INFO]
[INFO] --- enforcer:3.6.3:enforce (enforce-java-version) @ pdfbox-reactor ---
[INFO]
[INFO] --- checkstyle:3.6.0:check (check) @ pdfbox-reactor ---
[INFO] Starting audit...
Audit done.
[INFO] You have 0 Checkstyle violations.
[INFO]
[INFO] --- jacoco:0.8.15:prepare-agent (default) @ pdfbox-reactor ---
[INFO] surefireArgLine set to -javaagent:/home/jenkins/.m2/repository/org/jacoco/org.jacoco.agent/0.8.15/org.jacoco.agent-0.8.15-runtime.jar=destfile=<https://ci-builds.apache.org/job/PDFBox/job/PDFBox-sonar2/org.apache.pdfbox$pdfbox-reactor/ws/target/jacoco.exec>
[INFO]
[INFO] --- remote-resources:3.3.0:process (process-resource-bundles) @ pdfbox-reactor ---
[INFO] Preparing remote bundle org.apache.apache.resources:apache-jar-resource-bundle:1.8
[INFO] Copying 3 resources from 1 bundle.
[INFO]
[INFO] --- jacoco:0.8.15:report (report) @ pdfbox-reactor ---
[INFO] Skipping JaCoCo execution due to missing execution data file.
[INFO]
[INFO] --- source:3.4.0:jar-no-fork (attach-sources) @ pdfbox-reactor ---
[INFO]
[INFO] ------------------< org.apache.pdfbox:pdfbox-reactor >------------------
[INFO] Building pdfbox-reactor 4.0.0-SNAPSHOT [12/11]
[INFO] from pom.xml
[INFO] --------------------------------[ pom ]---------------------------------
[INFO]
[INFO] --- sonar:5.7.0.6970:sonar (default-cli) @ pdfbox-reactor ---
[WARNING] Using an unspecified version instead of an explicit plugin version may introduce breaking analysis changes at an unwanted time. It is highly recommended to use an explicit version, e.g. 'org.sonarsource.scanner.maven:sonar-maven-plugin:5.7.0.6970'.
[INFO] Java 17.0.12 Eclipse Adoptium (64-bit)
[INFO] Linux 5.15.0-164-generic (amd64)
[INFO] Communicating with SonarQube Cloud
[INFO] JRE provisioning: os[linux], arch[x86_64]
[INFO] Starting SonarScanner Engine...
[INFO] Java 21.0.9 Eclipse Adoptium (64-bit)
[INFO] Load global settings
[INFO] Load global settings (done) | time=866ms
[INFO] Server id: 1BD809FA-AWHW8ct9-T_TB3XqouNu
[INFO] Loading required plugins
[INFO] Load plugins index
[INFO] Load plugins index (done) | time=230ms
[INFO] Load/download plugins
[INFO] Load/download plugins (done) | time=1900ms
[INFO] Loaded core extensions: a3s, sca, architecture
[INFO] Process project properties
[INFO] Project key: pdfbox-reactor
[INFO] Base dir: <https://ci-builds.apache.org/job/PDFBox/job/PDFBox-sonar2/org.apache.pdfbox$pdfbox-reactor/ws/>
[INFO] Working dir: <https://ci-builds.apache.org/job/PDFBox/job/PDFBox-sonar2/org.apache.pdfbox$pdfbox-reactor/ws/target/sonar>
[INFO] Load project settings for component key: 'pdfbox-reactor'
[INFO] Load project settings for component key: 'pdfbox-reactor' (done) | time=641ms
[INFO] Found an active CI vendor: 'Jenkins'
[ERROR] Error retrieving feature flags, using default analyzer behavior
Not authorized or project not found. Please check the 'SONAR_TOKEN' environment variable, the 'sonar.projectKey' and 'sonar.organization' properties, or contact the project administrator to verify the token's permissions.
[INFO] Check ALM binding of project 'pdfbox-reactor'
[WARNING] Failed to check if project 'pdfbox-reactor' is bound
[INFO] Detected project binding: ERROR
[INFO] Check ALM binding of project 'pdfbox-reactor' (done) | time=164ms
[INFO] Load branch configuration
[INFO] Load branch configuration (done) | time=6ms
[INFO] Create analysis
[ERROR] Not authorized or project not found. Please check the 'SONAR_TOKEN' environment variable, the 'sonar.projectKey' and 'sonar.organization' properties, or contact the project administrator to verify the token's permissions.
---------------------------------------------------------------------
To unsubscribe, e-mail: dev-unsubscribe@pdfbox.apache.org
For additional commands, e-mail: dev-help@pdfbox.apache.org
Build failed in Jenkins: PDFBox » PDFBox-sonar2 » pdfbox-reactor #2143
Posted by Apache Jenkins Server <je...@builds.apache.org>.
See <https://ci-builds.apache.org/job/PDFBox/job/PDFBox-sonar2/org.apache.pdfbox$pdfbox-reactor/2143/display/redirect>
Changes:
------------------------------------------
[INFO]
[INFO] ------------------< org.apache.pdfbox:pdfbox-reactor >------------------
[INFO] Building pdfbox-reactor 4.0.0-SNAPSHOT [11/11]
[INFO] from pom.xml
[INFO] --------------------------------[ pom ]---------------------------------
[INFO]
[INFO] --- enforcer:3.6.3:enforce (default) @ pdfbox-reactor ---
[INFO]
[INFO] --- enforcer:3.6.3:enforce (enforce-maven-version) @ pdfbox-reactor ---
[INFO]
[INFO] --- enforcer:3.6.3:enforce (enforce-java-version) @ pdfbox-reactor ---
[INFO]
[INFO] --- checkstyle:3.6.0:check (check) @ pdfbox-reactor ---
[INFO] Starting audit...
Audit done.
[INFO] You have 0 Checkstyle violations.
[INFO]
[INFO] --- jacoco:0.8.15:prepare-agent (default) @ pdfbox-reactor ---
[INFO] surefireArgLine set to -javaagent:/home/jenkins/.m2/repository/org/jacoco/org.jacoco.agent/0.8.15/org.jacoco.agent-0.8.15-runtime.jar=destfile=<https://ci-builds.apache.org/job/PDFBox/job/PDFBox-sonar2/org.apache.pdfbox$pdfbox-reactor/ws/target/jacoco.exec>
[INFO]
[INFO] --- remote-resources:3.3.0:process (process-resource-bundles) @ pdfbox-reactor ---
[INFO] Preparing remote bundle org.apache.apache.resources:apache-jar-resource-bundle:1.8
[INFO] Copying 3 resources from 1 bundle.
[INFO]
[INFO] --- jacoco:0.8.15:report (report) @ pdfbox-reactor ---
[INFO] Skipping JaCoCo execution due to missing execution data file.
[INFO]
[INFO] --- source:3.4.0:jar-no-fork (attach-sources) @ pdfbox-reactor ---
[INFO]
[INFO] ------------------< org.apache.pdfbox:pdfbox-reactor >------------------
[INFO] Building pdfbox-reactor 4.0.0-SNAPSHOT [12/11]
[INFO] from pom.xml
[INFO] --------------------------------[ pom ]---------------------------------
[INFO]
[INFO] --- sonar:5.7.0.6970:sonar (default-cli) @ pdfbox-reactor ---
[INFO] Downloading from central: https://repo.maven.apache.org/maven2/org/codehaus/plexus/plexus-sec-dispatcher/2.0/plexus-sec-dispatcher-2.0.pom
[INFO] Downloaded from central: https://repo.maven.apache.org/maven2/org/codehaus/plexus/plexus-sec-dispatcher/2.0/plexus-sec-dispatcher-2.0.pom (3.2 kB at 129 kB/s)
[INFO] Downloading from central: https://repo.maven.apache.org/maven2/org/codehaus/plexus/plexus-cipher/2.0/plexus-cipher-2.0.pom
[INFO] Downloaded from central: https://repo.maven.apache.org/maven2/org/codehaus/plexus/plexus-cipher/2.0/plexus-cipher-2.0.pom (4.4 kB at 147 kB/s)
[INFO] Downloading from central: https://repo.maven.apache.org/maven2/org/sonarsource/scanner/lib/sonar-scanner-java-library/4.1.1.1633/sonar-scanner-java-library-4.1.1.1633.pom
[INFO] Downloaded from central: https://repo.maven.apache.org/maven2/org/sonarsource/scanner/lib/sonar-scanner-java-library/4.1.1.1633/sonar-scanner-java-library-4.1.1.1633.pom (5.2 kB at 179 kB/s)
[INFO] Downloading from central: https://repo.maven.apache.org/maven2/org/sonarsource/scanner/lib/sonar-scanner-java-library-parent/4.1.1.1633/sonar-scanner-java-library-parent-4.1.1.1633.pom
[INFO] Downloaded from central: https://repo.maven.apache.org/maven2/org/sonarsource/scanner/lib/sonar-scanner-java-library-parent/4.1.1.1633/sonar-scanner-java-library-parent-4.1.1.1633.pom (4.2 kB at 167 kB/s)
[INFO] Downloading from central: https://repo.maven.apache.org/maven2/org/junit/junit-bom/6.0.3/junit-bom-6.0.3.pom
[INFO] Downloaded from central: https://repo.maven.apache.org/maven2/org/junit/junit-bom/6.0.3/junit-bom-6.0.3.pom (5.1 kB at 233 kB/s)
[INFO] Downloading from central: https://repo.maven.apache.org/maven2/com/google/code/gson/gson/2.13.2/gson-2.13.2.pom
[INFO] Downloaded from central: https://repo.maven.apache.org/maven2/com/google/code/gson/gson/2.13.2/gson-2.13.2.pom (13 kB at 562 kB/s)
[INFO] Downloading from central: https://repo.maven.apache.org/maven2/com/google/code/gson/gson-parent/2.13.2/gson-parent-2.13.2.pom
[INFO] Downloaded from central: https://repo.maven.apache.org/maven2/com/google/code/gson/gson-parent/2.13.2/gson-parent-2.13.2.pom (27 kB at 1.2 MB/s)
[INFO] Downloading from central: https://repo.maven.apache.org/maven2/com/google/errorprone/error_prone_annotations/2.41.0/error_prone_annotations-2.41.0.pom
[INFO] Downloaded from central: https://repo.maven.apache.org/maven2/com/google/errorprone/error_prone_annotations/2.41.0/error_prone_annotations-2.41.0.pom (4.3 kB at 185 kB/s)
[INFO] Downloading from central: https://repo.maven.apache.org/maven2/com/google/errorprone/error_prone_parent/2.41.0/error_prone_parent-2.41.0.pom
[INFO] Downloaded from central: https://repo.maven.apache.org/maven2/com/google/errorprone/error_prone_parent/2.41.0/error_prone_parent-2.41.0.pom (16 kB at 692 kB/s)
[INFO] Downloading from central: https://repo.maven.apache.org/maven2/org/sonarsource/scanner/lib/sonar-scanner-download-cache/4.1.1.1633/sonar-scanner-download-cache-4.1.1.1633.pom
[INFO] Downloaded from central: https://repo.maven.apache.org/maven2/org/sonarsource/scanner/lib/sonar-scanner-download-cache/4.1.1.1633/sonar-scanner-download-cache-4.1.1.1633.pom (2.1 kB at 82 kB/s)
[INFO] Downloading from central: https://repo.maven.apache.org/maven2/org/sonarsource/scanner/lib/sonar-scanner-java-library-batch-interface/4.1.1.1633/sonar-scanner-java-library-batch-interface-4.1.1.1633.pom
[INFO] Downloaded from central: https://repo.maven.apache.org/maven2/org/sonarsource/scanner/lib/sonar-scanner-java-library-batch-interface/4.1.1.1633/sonar-scanner-java-library-batch-interface-4.1.1.1633.pom (554 B at 21 kB/s)
[INFO] Downloading from central: https://repo.maven.apache.org/maven2/io/github/hakky54/ayza/10.0.3/ayza-10.0.3.pom
[INFO] Downloaded from central: https://repo.maven.apache.org/maven2/io/github/hakky54/ayza/10.0.3/ayza-10.0.3.pom (5.0 kB at 198 kB/s)
[INFO] Downloading from central: https://repo.maven.apache.org/maven2/io/github/hakky54/ayza-parent/10.0.3/ayza-parent-10.0.3.pom
[INFO] Downloaded from central: https://repo.maven.apache.org/maven2/io/github/hakky54/ayza-parent/10.0.3/ayza-parent-10.0.3.pom (14 kB at 563 kB/s)
[INFO] Downloading from central: https://repo.maven.apache.org/maven2/io/github/hakky54/ayza-bom/10.0.3/ayza-bom-10.0.3.pom
[INFO] Downloaded from central: https://repo.maven.apache.org/maven2/io/github/hakky54/ayza-bom/10.0.3/ayza-bom-10.0.3.pom (6.5 kB at 284 kB/s)
[INFO] Downloading from central: https://repo.maven.apache.org/maven2/io/github/hakky54/sude/2.0.2/sude-2.0.2.pom
[INFO] Downloaded from central: https://repo.maven.apache.org/maven2/io/github/hakky54/sude/2.0.2/sude-2.0.2.pom (13 kB at 561 kB/s)
[INFO] Downloading from central: https://repo.maven.apache.org/maven2/de/siegmar/fastcsv/3.7.0/fastcsv-3.7.0.pom
[INFO] Downloaded from central: https://repo.maven.apache.org/maven2/de/siegmar/fastcsv/3.7.0/fastcsv-3.7.0.pom (1.4 kB at 52 kB/s)
[INFO] Downloading from central: https://repo.maven.apache.org/maven2/org/codehaus/plexus/plexus-sec-dispatcher/2.0/plexus-sec-dispatcher-2.0.jar
[INFO] Downloaded from central: https://repo.maven.apache.org/maven2/org/codehaus/plexus/plexus-sec-dispatcher/2.0/plexus-sec-dispatcher-2.0.jar (24 kB at 1.1 MB/s)
[INFO] Downloading from central: https://repo.maven.apache.org/maven2/org/codehaus/plexus/plexus-utils/3.4.1/plexus-utils-3.4.1.jar
[INFO] Downloading from central: https://repo.maven.apache.org/maven2/org/sonarsource/scanner/lib/sonar-scanner-java-library/4.1.1.1633/sonar-scanner-java-library-4.1.1.1633.jar
[INFO] Downloading from central: https://repo.maven.apache.org/maven2/org/codehaus/plexus/plexus-cipher/2.0/plexus-cipher-2.0.jar
[INFO] Downloading from central: https://repo.maven.apache.org/maven2/com/google/code/gson/gson/2.13.2/gson-2.13.2.jar
[INFO] Downloading from central: https://repo.maven.apache.org/maven2/com/google/errorprone/error_prone_annotations/2.41.0/error_prone_annotations-2.41.0.jar
[INFO] Downloaded from central: https://repo.maven.apache.org/maven2/org/sonarsource/scanner/lib/sonar-scanner-java-library/4.1.1.1633/sonar-scanner-java-library-4.1.1.1633.jar (129 kB at 6.4 MB/s)
[INFO] Downloaded from central: https://repo.maven.apache.org/maven2/org/codehaus/plexus/plexus-cipher/2.0/plexus-cipher-2.0.jar (13 kB at 650 kB/s)
[INFO] Downloading from central: https://repo.maven.apache.org/maven2/commons-io/commons-io/2.20.0/commons-io-2.20.0.jar
[INFO] Downloading from central: https://repo.maven.apache.org/maven2/org/sonarsource/scanner/lib/sonar-scanner-download-cache/4.1.1.1633/sonar-scanner-download-cache-4.1.1.1633.jar
[INFO] Downloaded from central: https://repo.maven.apache.org/maven2/com/google/code/gson/gson/2.13.2/gson-2.13.2.jar (290 kB at 12 MB/s)
[INFO] Downloading from central: https://repo.maven.apache.org/maven2/org/sonarsource/scanner/lib/sonar-scanner-java-library-batch-interface/4.1.1.1633/sonar-scanner-java-library-batch-interface-4.1.1.1633.jar
[INFO] Downloaded from central: https://repo.maven.apache.org/maven2/org/codehaus/plexus/plexus-utils/3.4.1/plexus-utils-3.4.1.jar (264 kB at 9.8 MB/s)
[INFO] Downloading from central: https://repo.maven.apache.org/maven2/io/github/hakky54/ayza/10.0.3/ayza-10.0.3.jar
[INFO] Downloaded from central: https://repo.maven.apache.org/maven2/com/google/errorprone/error_prone_annotations/2.41.0/error_prone_annotations-2.41.0.jar (20 kB at 600 kB/s)
[INFO] Downloading from central: https://repo.maven.apache.org/maven2/io/github/hakky54/sude/2.0.2/sude-2.0.2.jar
[INFO] Downloaded from central: https://repo.maven.apache.org/maven2/org/sonarsource/scanner/lib/sonar-scanner-download-cache/4.1.1.1633/sonar-scanner-download-cache-4.1.1.1633.jar (9.5 kB at 272 kB/s)
[INFO] Downloading from central: https://repo.maven.apache.org/maven2/de/siegmar/fastcsv/3.7.0/fastcsv-3.7.0.jar
[INFO] Downloaded from central: https://repo.maven.apache.org/maven2/org/sonarsource/scanner/lib/sonar-scanner-java-library-batch-interface/4.1.1.1633/sonar-scanner-java-library-batch-interface-4.1.1.1633.jar (4.7 kB at 109 kB/s)
[INFO] Downloaded from central: https://repo.maven.apache.org/maven2/commons-io/commons-io/2.20.0/commons-io-2.20.0.jar (564 kB at 13 MB/s)
[INFO] Downloaded from central: https://repo.maven.apache.org/maven2/io/github/hakky54/ayza/10.0.3/ayza-10.0.3.jar (204 kB at 4.2 MB/s)
[INFO] Downloaded from central: https://repo.maven.apache.org/maven2/io/github/hakky54/sude/2.0.2/sude-2.0.2.jar (8.6 kB at 171 kB/s)
[INFO] Downloaded from central: https://repo.maven.apache.org/maven2/de/siegmar/fastcsv/3.7.0/fastcsv-3.7.0.jar (82 kB at 1.5 MB/s)
[WARNING] Using an unspecified version instead of an explicit plugin version may introduce breaking analysis changes at an unwanted time. It is highly recommended to use an explicit version, e.g. 'org.sonarsource.scanner.maven:sonar-maven-plugin:5.7.0.6970'.
[INFO] Java 17.0.12 Eclipse Adoptium (64-bit)
[INFO] Linux 6.8.0-1024-aws (amd64)
[INFO] Communicating with SonarQube Cloud
[INFO] JRE provisioning: os[linux], arch[x86_64]
[INFO] Starting SonarScanner Engine...
[INFO] Java 21.0.9 Eclipse Adoptium (64-bit)
[INFO] Load global settings
[INFO] Load global settings (done) | time=514ms
[INFO] Server id: 1BD809FA-AWHW8ct9-T_TB3XqouNu
[INFO] Loading required plugins
[INFO] Load plugins index
[INFO] Load plugins index (done) | time=67ms
[INFO] Load/download plugins
[INFO] Load/download plugins (done) | time=1604ms
[INFO] Loaded core extensions: sca, architecture, a3s
[INFO] Process project properties
[INFO] Project key: pdfbox-reactor
[INFO] Base dir: <https://ci-builds.apache.org/job/PDFBox/job/PDFBox-sonar2/org.apache.pdfbox$pdfbox-reactor/ws/>
[INFO] Working dir: <https://ci-builds.apache.org/job/PDFBox/job/PDFBox-sonar2/org.apache.pdfbox$pdfbox-reactor/ws/target/sonar>
[INFO] Load project settings for component key: 'pdfbox-reactor'
[INFO] Load project settings for component key: 'pdfbox-reactor' (done) | time=131ms
[INFO] Found an active CI vendor: 'Jenkins'
[ERROR] Error retrieving feature flags, using default analyzer behavior
Not authorized or project not found. Please check the 'SONAR_TOKEN' environment variable, the 'sonar.projectKey' and 'sonar.organization' properties, or contact the project administrator to verify the token's permissions.
[INFO] Check ALM binding of project 'pdfbox-reactor'
[WARNING] Failed to check if project 'pdfbox-reactor' is bound
[INFO] Detected project binding: ERROR
[INFO] Check ALM binding of project 'pdfbox-reactor' (done) | time=49ms
[INFO] Load branch configuration
[INFO] Load branch configuration (done) | time=3ms
[INFO] Create analysis
[ERROR] Not authorized or project not found. Please check the 'SONAR_TOKEN' environment variable, the 'sonar.projectKey' and 'sonar.organization' properties, or contact the project administrator to verify the token's permissions.
---------------------------------------------------------------------
To unsubscribe, e-mail: dev-unsubscribe@pdfbox.apache.org
For additional commands, e-mail: dev-help@pdfbox.apache.org