You are viewing a plain text version of this content. The canonical link for it is here.
Posted to builds@hbase.apache.org by Apache Jenkins Server <je...@builds.apache.org> on 2015/10/27 13:49:04 UTC

Build failed in Jenkins: HBase-1.2 » latest1.7,Hadoop #311

See <https://builds.apache.org/job/HBase-1.2/jdk=latest1.7,label=Hadoop/311/changes>

Changes:

[anoopsamjohn] HBASE-14257 Periodic flusher only handles hbase:meta, not other system

------------------------------------------
[...truncated 45108 lines...]
[INFO] Using configured provider org.apache.maven.surefire.junitcore.JUnitCoreProvider
[INFO] parallel='none', perCoreThreadCount=true, threadCount=0, useUnlimitedThreads=false, threadCountSuites=0, threadCountClasses=0, threadCountMethods=0, parallelOptimized=true

-------------------------------------------------------
 T E S T S
-------------------------------------------------------
Running org.apache.hadoop.hbase.thrift2.TestThriftHBaseServiceHandlerWithLabels
Tests run: 6, Failures: 0, Errors: 0, Skipped: 0, Time elapsed: 1.768 sec - in org.apache.hadoop.hbase.thrift2.TestThriftHBaseServiceHandlerWithLabels
Running org.apache.hadoop.hbase.thrift2.TestThriftHBaseServiceHandler
Tests run: 21, Failures: 0, Errors: 0, Skipped: 0, Time elapsed: 2.246 sec - in org.apache.hadoop.hbase.thrift2.TestThriftHBaseServiceHandler
Running org.apache.hadoop.hbase.thrift.TestThriftServerCmdLine
Tests run: 32, Failures: 0, Errors: 0, Skipped: 0, Time elapsed: 51.377 sec - in org.apache.hadoop.hbase.thrift.TestThriftServerCmdLine
Running org.apache.hadoop.hbase.thrift.TestThriftServer
Tests run: 1, Failures: 0, Errors: 0, Skipped: 0, Time elapsed: 79.114 sec - in org.apache.hadoop.hbase.thrift.TestThriftServer
Running org.apache.hadoop.hbase.thrift.TestCallQueue
Tests run: 18, Failures: 0, Errors: 0, Skipped: 0, Time elapsed: 0.462 sec - in org.apache.hadoop.hbase.thrift.TestCallQueue
Running org.apache.hadoop.hbase.thrift.TestThriftHttpServer
Tests run: 2, Failures: 0, Errors: 0, Skipped: 0, Time elapsed: 4.949 sec - in org.apache.hadoop.hbase.thrift.TestThriftHttpServer

Results :

Tests run: 80, Failures: 0, Errors: 0, Skipped: 0

[INFO] 
[INFO] --- maven-surefire-plugin:2.18.1:test (secondPartTestsExecution) @ hbase-thrift ---
[INFO] Tests are skipped.
[INFO] 
[INFO] --- maven-source-plugin:2.2.1:jar-no-fork (attach-sources) @ hbase-thrift ---
[INFO] Building jar: <https://builds.apache.org/job/HBase-1.2/jdk=latest1.7,label=Hadoop/ws/hbase-thrift/target/hbase-thrift-1.2.0-SNAPSHOT-sources.jar>
[INFO] 
[INFO] --- maven-jar-plugin:2.4:test-jar (default) @ hbase-thrift ---
[INFO] Building jar: <https://builds.apache.org/job/HBase-1.2/jdk=latest1.7,label=Hadoop/ws/hbase-thrift/target/hbase-thrift-1.2.0-SNAPSHOT-tests.jar>
[INFO] 
[INFO] --- maven-jar-plugin:2.4:jar (default-jar) @ hbase-thrift ---
[INFO] Building jar: <https://builds.apache.org/job/HBase-1.2/jdk=latest1.7,label=Hadoop/ws/hbase-thrift/target/hbase-thrift-1.2.0-SNAPSHOT.jar>
[INFO] 
[INFO] --- maven-install-plugin:2.3.1:install (default-install) @ hbase-thrift ---
[INFO] Installing <https://builds.apache.org/job/HBase-1.2/jdk=latest1.7,label=Hadoop/ws/hbase-thrift/target/hbase-thrift-1.2.0-SNAPSHOT.jar> to <https://builds.apache.org/job/HBase-1.2/jdk=latest1.7,label=Hadoop/ws/.repository/org/apache/hbase/hbase-thrift/1.2.0-SNAPSHOT/hbase-thrift-1.2.0-SNAPSHOT.jar>
[INFO] Installing <https://builds.apache.org/job/HBase-1.2/jdk=latest1.7,label=Hadoop/ws/hbase-thrift/pom.xml> to <https://builds.apache.org/job/HBase-1.2/jdk=latest1.7,label=Hadoop/ws/.repository/org/apache/hbase/hbase-thrift/1.2.0-SNAPSHOT/hbase-thrift-1.2.0-SNAPSHOT.pom>
[INFO] Installing <https://builds.apache.org/job/HBase-1.2/jdk=latest1.7,label=Hadoop/ws/hbase-thrift/target/hbase-thrift-1.2.0-SNAPSHOT-sources.jar> to <https://builds.apache.org/job/HBase-1.2/jdk=latest1.7,label=Hadoop/ws/.repository/org/apache/hbase/hbase-thrift/1.2.0-SNAPSHOT/hbase-thrift-1.2.0-SNAPSHOT-sources.jar>
[INFO] Installing <https://builds.apache.org/job/HBase-1.2/jdk=latest1.7,label=Hadoop/ws/hbase-thrift/target/hbase-thrift-1.2.0-SNAPSHOT-tests.jar> to <https://builds.apache.org/job/HBase-1.2/jdk=latest1.7,label=Hadoop/ws/.repository/org/apache/hbase/hbase-thrift/1.2.0-SNAPSHOT/hbase-thrift-1.2.0-SNAPSHOT-tests.jar>
[INFO]                                                                         
[INFO] ------------------------------------------------------------------------
[INFO] Building Apache HBase - Rest 1.2.0-SNAPSHOT
[INFO] ------------------------------------------------------------------------
[INFO] 
[INFO] --- maven-enforcer-plugin:1.0.1:enforce (enforce) @ hbase-rest ---
[INFO] 
[INFO] --- buildnumber-maven-plugin:1.3:create-timestamp (default) @ hbase-rest ---
[INFO] 
[INFO] --- maven-antrun-plugin:1.6:run (generate) @ hbase-rest ---
[INFO] Executing tasks

main:
    [mkdir] Created dir: <https://builds.apache.org/job/HBase-1.2/jdk=latest1.7,label=Hadoop/ws/hbase-rest/target/hbase-webapps>
     [copy] Copying 1 file to <https://builds.apache.org/job/HBase-1.2/jdk=latest1.7,label=Hadoop/ws/hbase-rest/target/hbase-webapps>
log4j:WARN No appenders could be found for logger (org.mortbay.log).
log4j:WARN Please initialize the log4j system properly.
log4j:WARN See http://logging.apache.org/log4j/1.2/faq.html#noconfig for more info.
    [mkdir] Created dir: <https://builds.apache.org/job/HBase-1.2/jdk=latest1.7,label=Hadoop/ws/hbase-rest/target/hbase-webapps/rest/WEB-INF>
[INFO] Executed tasks
[INFO] 
[INFO] --- build-helper-maven-plugin:1.9.1:add-source (jspcSource-packageInfo-source) @ hbase-rest ---
[INFO] Source directory: <https://builds.apache.org/job/HBase-1.2/jdk=latest1.7,label=Hadoop/ws/hbase-rest/target/generated-sources/java> added.
[INFO] 
[INFO] --- maven-remote-resources-plugin:1.5:process (default) @ hbase-rest ---
[INFO] 
[INFO] --- maven-resources-plugin:2.6:resources (default-resources) @ hbase-rest ---
[INFO] Using 'UTF-8' encoding to copy filtered resources.
[INFO] Copying 2 resources
[INFO] Copying 3 resources
[INFO] 
[INFO] --- maven-compiler-plugin:2.5.1:compile (default-compile) @ hbase-rest ---
[INFO] Compiling 71 source files to <https://builds.apache.org/job/HBase-1.2/jdk=latest1.7,label=Hadoop/ws/hbase-rest/target/classes>
[INFO] 
[INFO] --- maven-resources-plugin:2.6:testResources (default-testResources) @ hbase-rest ---
[INFO] Using 'UTF-8' encoding to copy filtered resources.
[INFO] Copying 6 resources
[INFO] Copying 3 resources
[INFO] 
[INFO] --- maven-compiler-plugin:2.5.1:testCompile (default-testCompile) @ hbase-rest ---
[INFO] Compiling 38 source files to <https://builds.apache.org/job/HBase-1.2/jdk=latest1.7,label=Hadoop/ws/hbase-rest/target/test-classes>
[INFO] 
[INFO] --- maven-surefire-plugin:2.18.1:test (default-test) @ hbase-rest ---
[INFO] Surefire report directory: <https://builds.apache.org/job/HBase-1.2/jdk=latest1.7,label=Hadoop/ws/hbase-rest/target/surefire-reports>
[INFO] Using configured provider org.apache.maven.surefire.junitcore.JUnitCoreProvider
[INFO] parallel='none', perCoreThreadCount=true, threadCount=0, useUnlimitedThreads=false, threadCountSuites=0, threadCountClasses=0, threadCountMethods=0, parallelOptimized=true

-------------------------------------------------------
 T E S T S
-------------------------------------------------------
Running org.apache.hadoop.hbase.rest.TestDeleteRow
Tests run: 2, Failures: 0, Errors: 0, Skipped: 0, Time elapsed: 10.86 sec - in org.apache.hadoop.hbase.rest.TestDeleteRow
Running org.apache.hadoop.hbase.rest.TestTableResource
Tests run: 8, Failures: 0, Errors: 0, Skipped: 0, Time elapsed: 4.502 sec - in org.apache.hadoop.hbase.rest.TestTableResource
Running org.apache.hadoop.hbase.rest.TestScannersWithLabels
Tests run: 2, Failures: 0, Errors: 0, Skipped: 0, Time elapsed: 3.089 sec - in org.apache.hadoop.hbase.rest.TestScannersWithLabels
Running org.apache.hadoop.hbase.rest.TestTableScan
Tests run: 10, Failures: 0, Errors: 0, Skipped: 0, Time elapsed: 14.754 sec - in org.apache.hadoop.hbase.rest.TestTableScan
Running org.apache.hadoop.hbase.rest.TestSchemaResource
Tests run: 2, Failures: 0, Errors: 0, Skipped: 0, Time elapsed: 11.735 sec - in org.apache.hadoop.hbase.rest.TestSchemaResource
Running org.apache.hadoop.hbase.rest.TestNamespacesResource
Tests run: 2, Failures: 0, Errors: 0, Skipped: 0, Time elapsed: 3.067 sec - in org.apache.hadoop.hbase.rest.TestNamespacesResource
Running org.apache.hadoop.hbase.rest.TestGetAndPutResource
Running org.apache.hadoop.hbase.rest.TestStatusResource
Tests run: 2, Failures: 0, Errors: 0, Skipped: 0, Time elapsed: 3.567 sec - in org.apache.hadoop.hbase.rest.TestStatusResource
Running org.apache.hadoop.hbase.rest.TestGZIPResponseWrapper
Tests run: 4, Failures: 0, Errors: 0, Skipped: 0, Time elapsed: 0.57 sec - in org.apache.hadoop.hbase.rest.TestGZIPResponseWrapper
Running org.apache.hadoop.hbase.rest.TestResourceFilter
Tests run: 1, Failures: 0, Errors: 0, Skipped: 0, Time elapsed: 2.129 sec - in org.apache.hadoop.hbase.rest.TestResourceFilter
Running org.apache.hadoop.hbase.rest.client.TestRemoteAdminRetries
Tests run: 7, Failures: 0, Errors: 0, Skipped: 0, Time elapsed: 1.702 sec - in org.apache.hadoop.hbase.rest.client.TestRemoteAdminRetries
Running org.apache.hadoop.hbase.rest.client.TestRemoteTable
Tests run: 9, Failures: 0, Errors: 0, Skipped: 0, Time elapsed: 40.873 sec - in org.apache.hadoop.hbase.rest.client.TestRemoteTable
Running org.apache.hadoop.hbase.rest.client.TestRemoteHTableRetries
Tests run: 7, Failures: 0, Errors: 0, Skipped: 0, Time elapsed: 1.709 sec - in org.apache.hadoop.hbase.rest.client.TestRemoteHTableRetries
Running org.apache.hadoop.hbase.rest.model.TestNamespacesModel
Tests run: 5, Failures: 0, Errors: 0, Skipped: 0, Time elapsed: 0.627 sec - in org.apache.hadoop.hbase.rest.model.TestNamespacesModel
Running org.apache.hadoop.hbase.rest.model.TestVersionModel
Tests run: 5, Failures: 0, Errors: 0, Skipped: 0, Time elapsed: 1.24 sec - in org.apache.hadoop.hbase.rest.model.TestVersionModel
Running org.apache.hadoop.hbase.rest.model.TestNamespacesInstanceModel
Tests run: 5, Failures: 0, Errors: 0, Skipped: 0, Time elapsed: 0.646 sec - in org.apache.hadoop.hbase.rest.model.TestNamespacesInstanceModel
Running org.apache.hadoop.hbase.rest.model.TestStorageClusterVersionModel
Tests run: 5, Failures: 0, Errors: 0, Skipped: 0, Time elapsed: 0.584 sec - in org.apache.hadoop.hbase.rest.model.TestStorageClusterVersionModel
Running org.apache.hadoop.hbase.rest.model.TestColumnSchemaModel
Tests run: 5, Failures: 0, Errors: 0, Skipped: 0, Time elapsed: 0.608 sec - in org.apache.hadoop.hbase.rest.model.TestColumnSchemaModel
Running org.apache.hadoop.hbase.rest.model.TestCellModel
Tests run: 5, Failures: 0, Errors: 0, Skipped: 0, Time elapsed: 1.194 sec - in org.apache.hadoop.hbase.rest.model.TestCellModel
Running org.apache.hadoop.hbase.rest.model.TestTableListModel
Tests run: 5, Failures: 0, Errors: 0, Skipped: 0, Time elapsed: 1.303 sec - in org.apache.hadoop.hbase.rest.model.TestTableListModel
Running org.apache.hadoop.hbase.rest.model.TestStorageClusterStatusModel
Tests run: 5, Failures: 0, Errors: 0, Skipped: 0, Time elapsed: 1.44 sec - in org.apache.hadoop.hbase.rest.model.TestStorageClusterStatusModel
Running org.apache.hadoop.hbase.rest.model.TestScannerModel
Tests run: 5, Failures: 0, Errors: 0, Skipped: 0, Time elapsed: 1.272 sec - in org.apache.hadoop.hbase.rest.model.TestScannerModel
Running org.apache.hadoop.hbase.rest.model.TestTableSchemaModel
Tests run: 5, Failures: 0, Errors: 0, Skipped: 0, Time elapsed: 1.301 sec - in org.apache.hadoop.hbase.rest.model.TestTableSchemaModel
Running org.apache.hadoop.hbase.rest.model.TestTableInfoModel
Tests run: 5, Failures: 0, Errors: 0, Skipped: 0, Time elapsed: 1.27 sec - in org.apache.hadoop.hbase.rest.model.TestTableInfoModel
Running org.apache.hadoop.hbase.rest.model.TestTableRegionModel
Tests run: 7, Failures: 0, Errors: 0, Skipped: 0, Time elapsed: 0.637 sec - in org.apache.hadoop.hbase.rest.model.TestTableRegionModel
Running org.apache.hadoop.hbase.rest.model.TestRowModel
Tests run: 5, Failures: 0, Errors: 0, Skipped: 0, Time elapsed: 0.559 sec - in org.apache.hadoop.hbase.rest.model.TestRowModel
Running org.apache.hadoop.hbase.rest.model.TestCellSetModel
Tests run: 5, Failures: 0, Errors: 0, Skipped: 0, Time elapsed: 1.242 sec - in org.apache.hadoop.hbase.rest.model.TestCellSetModel
Running org.apache.hadoop.hbase.rest.TestVersionResource
Tests run: 7, Failures: 0, Errors: 0, Skipped: 0, Time elapsed: 2.86 sec - in org.apache.hadoop.hbase.rest.TestVersionResource
Running org.apache.hadoop.hbase.rest.TestScannersWithFilters
Tests run: 10, Failures: 0, Errors: 0, Skipped: 0, Time elapsed: 5.541 sec - in org.apache.hadoop.hbase.rest.TestScannersWithFilters
Running org.apache.hadoop.hbase.rest.TestMultiRowResource
Tests run: 3, Failures: 0, Errors: 0, Skipped: 0, Time elapsed: 3.252 sec - in org.apache.hadoop.hbase.rest.TestMultiRowResource
Running org.apache.hadoop.hbase.rest.TestGzipFilter
Tests run: 2, Failures: 0, Errors: 0, Skipped: 0, Time elapsed: 3.332 sec - in org.apache.hadoop.hbase.rest.TestGzipFilter
Running org.apache.hadoop.hbase.rest.TestScannerResource
Tests run: 5, Failures: 0, Errors: 0, Skipped: 0, Time elapsed: 5.735 sec - in org.apache.hadoop.hbase.rest.TestScannerResource
Running org.apache.hadoop.hbase.rest.TestNamespacesInstanceResource
Tests run: 5, Failures: 0, Errors: 0, Skipped: 0, Time elapsed: 6.146 sec - in org.apache.hadoop.hbase.rest.TestNamespacesInstanceResource

Results :

Tests run: 160, Failures: 0, Errors: 0, Skipped: 0

[INFO] ------------------------------------------------------------------------
[INFO] Reactor Summary:
[INFO] 
[INFO] Apache HBase ...................................... SUCCESS [1:06.795s]
[INFO] Apache HBase - Checkstyle ......................... SUCCESS [7.074s]
[INFO] Apache HBase - Resource Bundle .................... SUCCESS [0.358s]
[INFO] Apache HBase - Annotations ........................ SUCCESS [1.715s]
[INFO] Apache HBase - Protocol ........................... SUCCESS [27.417s]
[INFO] Apache HBase - Common ............................. SUCCESS [4:25.369s]
[INFO] Apache HBase - Procedure .......................... SUCCESS [1:54.341s]
[INFO] Apache HBase - Client ............................. SUCCESS [1:37.909s]
[INFO] Apache HBase - Hadoop Compatibility ............... SUCCESS [8.392s]
[INFO] Apache HBase - Hadoop Two Compatibility ........... SUCCESS [12.353s]
[INFO] Apache HBase - Prefix Tree ........................ SUCCESS [11.474s]
[INFO] Apache HBase - Server ............................. SUCCESS [1:40:31.417s]
[INFO] Apache HBase - Testing Util ....................... SUCCESS [10.543s]
[INFO] Apache HBase - Thrift ............................. SUCCESS [3:25.378s]
[INFO] Apache HBase - Rest ............................... FAILURE [20:41.692s]
[INFO] Apache HBase - Shell .............................. SKIPPED
[INFO] Apache HBase - Integration Tests .................. SKIPPED
[INFO] Apache HBase - Examples ........................... SKIPPED
[INFO] Apache HBase - External Block Cache ............... SKIPPED
[INFO] Apache HBase - Assembly ........................... SKIPPED
[INFO] Apache HBase - Shaded ............................. SKIPPED
[INFO] Apache HBase - Shaded - Client .................... SKIPPED
[INFO] Apache HBase - Shaded - Server .................... SKIPPED
[INFO] ------------------------------------------------------------------------
[INFO] BUILD FAILURE
[INFO] ------------------------------------------------------------------------
[INFO] Total time: 2:15:22.404s
[INFO] Finished at: Tue Oct 27 12:47:35 UTC 2015
[INFO] Final Memory: 115M/568M
[INFO] ------------------------------------------------------------------------
[ERROR] Failed to execute goal org.apache.maven.plugins:maven-surefire-plugin:2.18.1:test (default-test) on project hbase-rest: There was a timeout or other error in the fork -> [Help 1]
[ERROR] 
[ERROR] To see the full stack trace of the errors, re-run Maven with the -e switch.
[ERROR] Re-run Maven using the -X switch to enable full debug logging.
[ERROR] 
[ERROR] For more information about the errors and possible solutions, please read the following articles:
[ERROR] [Help 1] http://cwiki.apache.org/confluence/display/MAVEN/MojoFailureException
[ERROR] 
[ERROR] After correcting the problems, you can resume the build with the command
[ERROR]   mvn <goals> -rf :hbase-rest
Build step 'Invoke top-level Maven targets' marked build as failure
Performing Post build task...
Match found for :.* : True
Logical operation result is TRUE
Running script  :     ZOMBIE_TESTS_COUNT=`jps -v | grep surefirebooter | grep '-Dhbase.test' | wc -l`
  if [[ $ZOMBIE_TESTS_COUNT != 0 ]] ; then
    #It seems sometimes the tests are not dying immediately. Let's give them 30s
    echo "Suspicious java process found - waiting 30s to see if there are just slow to stop"
    sleep 30
    ZOMBIE_TESTS_COUNT=`jps -v | grep surefirebooter | grep '-Dhbase.test' | wc -l`
    if [[ $ZOMBIE_TESTS_COUNT != 0 ]] ; then
      echo "There are $ZOMBIE_TESTS_COUNT zombie tests, they should have been killed by surefire but survived"
      echo "************ zombies jps listing"
      jps -v
      jps -v | grep surefirebooter | grep '-Dhbase.test'
      echo "************ BEGIN zombies jstack extract"
      # HBase tests have been flagged with an innocuous '-Dhbase.test' just so they can
      # be identified as hbase in a process listing.
      ZB_STACK=`jps -v | grep surefirebooter | grep '-Dhbase.test' | cut -d ' ' -f 1 | xargs -n 1 jstack | grep ".test" | grep "\.java"`
      jps -v | grep surefirebooter | grep '-Dhbase.test' | cut -d ' ' -f 1 | xargs -n 1 jstack
      echo "************ END  zombies jstack extract"
      JIRA_COMMENT="$JIRA_COMMENT

     {color:red}-1 core zombie tests{color}.  There are ${ZOMBIE_TESTS_COUNT} zombie test(s): ${ZB_STACK}"
      BAD=1
      # Killing these zombies
      echo 'Killing ZOMBIES!!!'
      jps -v
      jps -v | grep surefirebooter | grep '-Dhbase.test' | cut -d ' ' -f 1 | xargs kill -9
    else
      echo "We're ok: there is no zombie test, but some tests took some time to stop"
    fi
[Hadoop] $ /bin/bash -xe /tmp/hudson173364596171928183.sh
++ jps -v
++ grep surefirebooter
++ grep -Dhbase.test
++ wc -l
grep: unknown devices method
grep: write error: Broken pipe
+ ZOMBIE_TESTS_COUNT=0
/tmp/hudson173364596171928183.sh: line 30: syntax error: unexpected end of file
POST BUILD TASK : FAILURE
END OF POST BUILD TASK : 0
Archiving artifacts
Recording test results

Jenkins build is back to normal : HBase-1.2 » latest1.7,Hadoop #312

Posted by Apache Jenkins Server <je...@builds.apache.org>.
See <https://builds.apache.org/job/HBase-1.2/jdk=latest1.7,label=Hadoop/312/>