You are viewing a plain text version of this content. The canonical link for it is here.
Posted to scm@geronimo.apache.org by db...@apache.org on 2004/08/26 11:40:00 UTC
[status] build: SUCCESSFUL, test: FAILED | SunOS 5.8, 2004-08-26
NIGHTLY BUILD/TEST
Date: Thu Aug 26 01:30:00 PDT 2004
Kernel: SunOS 5.8
Host: nagoya
Java: 1.4.2_04-b05, mixed mode
Maven: 1.0
CHECKOUT: incubator-geronimo
BUILDING: incubator-geronimo
[junit] [ERROR] TEST org.apache.geronimo.network.protocol.ProtocolStackTest FAILED
BUILD SUCCESSFUL
Total time: 40 minutes 19 seconds
Finished at: Thu Aug 26 02:12:45 PDT 2004