You are viewing a plain text version of this content. The canonical link for it is here.
Posted to dev@cloudstack.apache.org by je...@cloudstack.org on 2014/10/13 09:02:23 UTC
Build failed in Jenkins: build-4.5 #7
See <http://jenkins.buildacloud.org/job/build-4.5/7/>
------------------------------------------
Started by an SCM change
[EnvInject] - Loading node environment variables.
Building remotely on windows-buildslave-001 (windows) in workspace <http://jenkins.buildacloud.org/job/build-4.5/ws/>
Cloning the remote Git repository
Cloning repository https://git-wip-us.apache.org/repos/asf/cloudstack.git
Fetching upstream changes from https://git-wip-us.apache.org/repos/asf/cloudstack.git
ERROR: Error cloning remote repo 'origin'
hudson.plugins.git.GitException: Error performing command: git fetch --tags --progress https://git-wip-us.apache.org/repos/asf/cloudstack.git +refs/heads/*:refs/remotes/origin/*
at org.jenkinsci.plugins.gitclient.CliGitAPIImpl.launchCommandIn(CliGitAPIImpl.java:1093)
at org.jenkinsci.plugins.gitclient.CliGitAPIImpl.launchCommandWithCredentials(CliGitAPIImpl.java:968)
at org.jenkinsci.plugins.gitclient.CliGitAPIImpl.access$200(CliGitAPIImpl.java:71)
at org.jenkinsci.plugins.gitclient.CliGitAPIImpl$1.execute(CliGitAPIImpl.java:197)
at org.jenkinsci.plugins.gitclient.CliGitAPIImpl$2.execute(CliGitAPIImpl.java:329)
at org.jenkinsci.plugins.gitclient.RemoteGitImpl$CommandInvocationHandler$1.call(RemoteGitImpl.java:152)
at org.jenkinsci.plugins.gitclient.RemoteGitImpl$CommandInvocationHandler$1.call(RemoteGitImpl.java:145)
at hudson.remoting.UserRequest.perform(UserRequest.java:118)
at hudson.remoting.UserRequest.perform(UserRequest.java:48)
at hudson.remoting.Request$2.run(Request.java:328)
at hudson.remoting.InterceptingExecutorService$1.call(InterceptingExecutorService.java:72)
at java.util.concurrent.FutureTask.run(Unknown Source)
at java.util.concurrent.ThreadPoolExecutor.runWorker(Unknown Source)
at java.util.concurrent.ThreadPoolExecutor$Worker.run(Unknown Source)
at hudson.remoting.Engine$1$1.run(Engine.java:63)
at java.lang.Thread.run(Unknown Source)
Caused by: java.io.IOException: Cannot run program "/usr/bin/git" (in directory "workspace\build-4.5"): CreateProcess error=2, The system cannot find the file specified
at java.lang.ProcessBuilder.start(Unknown Source)
at hudson.Proc$LocalProc.<init>(Proc.java:244)
at hudson.Proc$LocalProc.<init>(Proc.java:216)
at hudson.Launcher$LocalLauncher.launch(Launcher.java:773)
at hudson.Launcher$ProcStarter.start(Launcher.java:353)
at org.jenkinsci.plugins.gitclient.CliGitAPIImpl.launchCommandIn(CliGitAPIImpl.java:1082)
... 15 more
Caused by: java.io.IOException: CreateProcess error=2, The system cannot find the file specified
at java.lang.ProcessImpl.create(Native Method)
at java.lang.ProcessImpl.<init>(Unknown Source)
at java.lang.ProcessImpl.start(Unknown Source)
... 21 more
ERROR: null
Recording test results
Jenkins build is back to normal : build-4.5 #25
Posted by je...@cloudstack.org.
See <http://jenkins.buildacloud.org/job/build-4.5/25/changes>
Build failed in Jenkins: build-4.5 #24
Posted by je...@cloudstack.org.
See <http://jenkins.buildacloud.org/job/build-4.5/24/changes>
Changes:
[jayapal] CLOUDSTACK-7728: Removed duplicate import
------------------------------------------
[...truncated 1689 lines...]
[INFO]
[INFO] --- maven-remote-resources-plugin:1.3:process (default) @ cloud-usage ---
[INFO]
[INFO] --- maven-resources-plugin:2.5:resources (default-resources) @ cloud-engine-network ---
[debug] execute contextualize
[INFO] Using 'UTF-8' encoding to copy filtered resources.
[INFO] skip non existing resourceDirectory <http://jenkins.buildacloud.org/job/build-4.5/ws/engine/network/resources>
[INFO] Copying 3 resources
[INFO]
[INFO] --- maven-compiler-plugin:2.5.1:compile (default-compile) @ cloud-engine-network ---
[INFO] Compiling 1 source file to <http://jenkins.buildacloud.org/job/build-4.5/ws/engine/network/target/classes>
[INFO] Starting audit...
Audit done.
[INFO]
[INFO] --- maven-remote-resources-plugin:1.3:process (default) @ cloud-engine-orchestration ---
[INFO]
[INFO] --- maven-antrun-plugin:1.7:run (generate-resource) @ cloud-usage ---
[INFO]
[INFO] --- maven-resources-plugin:2.5:resources (default-resources) @ cloud-engine-orchestration ---
[debug] execute contextualize
[INFO] Using 'UTF-8' encoding to copy filtered resources.
[INFO] Copying 1 resource
[INFO] Copying 3 resources
[INFO]
[INFO] --- maven-compiler-plugin:2.5.1:compile (default-compile) @ cloud-engine-orchestration ---
[INFO] Compiling 68 source files to <http://jenkins.buildacloud.org/job/build-4.5/ws/engine/orchestration/target/classes>
[INFO] Executing tasks
main:
[copy] Copying 2 files to <http://jenkins.buildacloud.org/job/build-4.5/ws/usage/target/transformed>
[INFO] Executed tasks
[INFO]
[INFO] --- maven-resources-plugin:2.5:resources (default-resources) @ cloud-usage ---
[debug] execute contextualize
[INFO] Using 'UTF-8' encoding to copy filtered resources.
[INFO] Copying 1 resource
[INFO] Copying 3 resources
[INFO]
[INFO] --- maven-compiler-plugin:2.5.1:compile (default-compile) @ cloud-usage ---
[INFO] Compiling 19 source files to <http://jenkins.buildacloud.org/job/build-4.5/ws/usage/target/classes>
[INFO]
[INFO] --- maven-resources-plugin:2.5:testResources (default-testResources) @ cloud-engine-network ---
[debug] execute contextualize
[INFO] Using 'UTF-8' encoding to copy filtered resources.
[INFO] skip non existing resourceDirectory <http://jenkins.buildacloud.org/job/build-4.5/ws/engine/network/test/resources>
[INFO] Copying 3 resources
[INFO]
[INFO] --- maven-compiler-plugin:2.5.1:testCompile (default-testCompile) @ cloud-engine-network ---
[INFO] No sources to compile
[INFO]
[INFO] --- maven-surefire-plugin:2.12:test (default-test) @ cloud-engine-network ---
[INFO] Surefire report directory: <http://jenkins.buildacloud.org/job/build-4.5/ws/engine/network/target/surefire-reports>
-------------------------------------------------------
T E S T S
-------------------------------------------------------
Results :
Tests run: 0, Failures: 0, Errors: 0, Skipped: 0
[INFO] Starting audit...
Audit done.
[INFO]
[INFO] --- maven-remote-resources-plugin:1.3:process (default) @ cloud-server ---
[INFO]
[INFO] --- maven-resources-plugin:2.5:testResources (default-testResources) @ cloud-usage ---
[debug] execute contextualize
[INFO] Using 'UTF-8' encoding to copy filtered resources.
[INFO] Copying 8 resources
[INFO] Copying 3 resources
[INFO]
[INFO] --- maven-compiler-plugin:2.5.1:testCompile (default-testCompile) @ cloud-usage ---
[INFO] Compiling 4 source files to <http://jenkins.buildacloud.org/job/build-4.5/ws/usage/target/test-classes>
[INFO]
[INFO] --- maven-antrun-plugin:1.7:run (generate-resource) @ cloud-server ---
[INFO] Executing tasks
main:
[copy] Copying 3 files to <http://jenkins.buildacloud.org/job/build-4.5/ws/server/target/conf>
[copy] Copying 1 file to <http://jenkins.buildacloud.org/job/build-4.5/ws/server/target/conf>
[INFO] Executed tasks
[INFO]
[INFO] --- maven-resources-plugin:2.5:resources (default-resources) @ cloud-server ---
[debug] execute contextualize
[INFO] Using 'UTF-8' encoding to copy filtered resources.
[INFO] Copying 30 resources
[INFO] Copying 3 resources
[INFO]
[INFO] --- maven-compiler-plugin:2.5.1:compile (default-compile) @ cloud-server ---
[INFO] Compiling 367 source files to <http://jenkins.buildacloud.org/job/build-4.5/ws/server/target/classes>
[INFO]
[INFO] --- maven-surefire-plugin:2.12:test (default-test) @ cloud-usage ---
[INFO] Surefire report directory: <http://jenkins.buildacloud.org/job/build-4.5/ws/usage/target/surefire-reports>
-------------------------------------------------------
T E S T S
-------------------------------------------------------
Running com.cloud.usage.UsageSanityCheckerTest
[INFO]
[INFO] --- maven-resources-plugin:2.5:testResources (default-testResources) @ cloud-engine-orchestration ---
[debug] execute contextualize
[INFO] Using 'UTF-8' encoding to copy filtered resources.
[INFO] skip non existing resourceDirectory <http://jenkins.buildacloud.org/job/build-4.5/ws/engine/orchestration/test/resources>
[INFO] Copying 3 resources
[INFO]
[INFO] --- maven-compiler-plugin:2.5.1:testCompile (default-testCompile) @ cloud-engine-orchestration ---
[INFO] Compiling 5 source files to <http://jenkins.buildacloud.org/job/build-4.5/ws/engine/orchestration/target/test-classes>
Tests run: 1, Failures: 0, Errors: 0, Skipped: 0, Time elapsed: 5.104 sec
Results :
Tests run: 1, Failures: 0, Errors: 0, Skipped: 0
[INFO]
[INFO] --- maven-surefire-plugin:2.12:test (default-test) @ cloud-engine-orchestration ---
[INFO] Tests are skipped.
[INFO] -------------------------------------------------------------
[ERROR] COMPILATION ERROR :
[INFO] -------------------------------------------------------------
[ERROR] <http://jenkins.buildacloud.org/job/build-4.5/ws/server/src/com/cloud/resource/ResourceManagerImpl.java>:[1649,34] error: variable ssCmd is already defined in method createHostVO(StartupCommand[],ServerResource,Map<String,String>,List<String>,Event)
[ERROR] <http://jenkins.buildacloud.org/job/build-4.5/ws/server/src/com/cloud/resource/ResourceManagerImpl.java>:[1650,25] error: variable implicitHostTags is already defined in method createHostVO(StartupCommand[],ServerResource,Map<String,String>,List<String>,Event)
[INFO] 2 errors
[INFO] -------------------------------------------------------------
[INFO] ------------------------------------------------------------------------
[INFO] Reactor Summary:
[INFO]
[INFO] Apache CloudStack Developer Tools - Checkstyle Configuration SUCCESS [3.387s]
[INFO] Apache CloudStack ................................. SUCCESS [3.961s]
[INFO] Apache CloudStack Maven Conventions Parent ........ SUCCESS [8.588s]
[INFO] Apache CloudStack Framework - Managed Context ..... SUCCESS [17.264s]
[INFO] Apache CloudStack Utils ........................... SUCCESS [53.089s]
[INFO] Apache CloudStack Framework ....................... SUCCESS [0.930s]
[INFO] Apache CloudStack Framework - Event Notification .. SUCCESS [48.340s]
[INFO] Apache CloudStack Framework - Configuration ....... SUCCESS [18.080s]
[INFO] Apache CloudStack API ............................. SUCCESS [1:06.411s]
[INFO] Apache CloudStack Framework - REST ................ SUCCESS [26.518s]
[INFO] Apache CloudStack Framework - IPC ................. SUCCESS [38.250s]
[INFO] Apache CloudStack Cloud Engine .................... SUCCESS [0.897s]
[INFO] Apache CloudStack Cloud Engine API ................ SUCCESS [26.373s]
[INFO] Apache CloudStack Framework - Security ............ SUCCESS [15.677s]
[INFO] Apache CloudStack Core ............................ SUCCESS [1:13.978s]
[INFO] Apache CloudStack Agents .......................... SUCCESS [36.681s]
[INFO] Apache CloudStack Framework - Clustering .......... SUCCESS [20.504s]
[INFO] Apache CloudStack Framework - Event Notification .. SUCCESS [15.733s]
[INFO] Apache CloudStack Cloud Engine Schema Component ... SUCCESS [1:30.968s]
[INFO] Apache CloudStack Framework - Jobs ................ SUCCESS [30.285s]
[INFO] Apache CloudStack Cloud Engine Internal Components API SUCCESS [16.970s]
[INFO] Apache CloudStack Server .......................... FAILURE [1:48.944s]
[INFO] Apache CloudStack Usage Server .................... SUCCESS [56.012s]
[INFO] Apache CloudStack Cloud Engine Orchestration Component SUCCESS [1:08.685s]
[INFO] Apache CloudStack Cloud Services .................. SUCCESS [0.926s]
[INFO] Apache CloudStack Secondary Storage ............... SUCCESS [36.113s]
[INFO] Apache CloudStack Secondary Storage Service ....... SKIPPED
[INFO] Apache CloudStack Engine Storage Component ........ SKIPPED
[INFO] Apache CloudStack Engine Storage Volume Component . SKIPPED
[INFO] Apache CloudStack Engine Storage Image Component .. SKIPPED
[INFO] Apache CloudStack Engine Storage Data Motion Component SKIPPED
[INFO] Apache CloudStack Engine Storage Cache Component .. SKIPPED
[INFO] Apache CloudStack Engine Storage Snapshot Component SKIPPED
[INFO] Apache CloudStack Cloud Engine API ................ SUCCESS [18.389s]
[INFO] Apache CloudStack Cloud Engine Service ............ SKIPPED
[INFO] Apache CloudStack Plugin POM ...................... SKIPPED
[INFO] Apache CloudStack Plugin - API Rate Limit ......... SKIPPED
[INFO] Apache CloudStack Plugin - Storage Volume default provider SKIPPED
[INFO] Apache CloudStack Plugin - Storage Volume SolidFire Provider SKIPPED
[INFO] Apache CloudStack Plugin - API SolidFire .......... SKIPPED
[INFO] Apache CloudStack Plugin - API Discovery .......... SKIPPED
[INFO] Apache CloudStack Plugin - ACL Static Role Based .. SKIPPED
[INFO] Apache CloudStack Plugin - Host Anti-Affinity Processor SKIPPED
[INFO] Apache CloudStack Plugin - Explicit Dedication Processor SKIPPED
[INFO] Apache CloudStack Plugin - User Concentrated Pod Deployment Planner SKIPPED
[INFO] Apache CloudStack Plugin - User Dispersing Deployment Planner SKIPPED
[INFO] Apache CloudStack Plugin - Implicit Dedication Planner SKIPPED
[INFO] Apache CloudStack Plugin - Skip Heurestics Planner SKIPPED
[INFO] Apache CloudStack Plugin - Host Allocator Random .. SKIPPED
[INFO] Apache CloudStack Plugin - Dedicated Resources .... SKIPPED
[INFO] Apache CloudStack Plugin - Hypervisor OracleVM .... SKIPPED
[INFO] Apache CloudStack Plugin - Open vSwitch ........... SKIPPED
[INFO] Apache CloudStack Plugin - Hypervisor XenServer ... SKIPPED
[INFO] Apache CloudStack Plugin - Hypervisor KVM ......... SKIPPED
[INFO] Apache CloudStack Plugin - RabbitMQ Event Bus ..... SKIPPED
[INFO] Apache CloudStack Plugin - In Memory Event Bus .... SKIPPED
[INFO] Apache CloudStack Plugin - Hypervisor Baremetal ... SKIPPED
[INFO] Apache CloudStack Plugin - Hypervisor UCS ......... SKIPPED
[INFO] Apache CloudStack Plugin - Hypervisor Hyper-V ..... SKIPPED
[INFO] Apache CloudStack Plugin - Network Elastic Load Balancer SKIPPED
[INFO] Apache CloudStack Plugin - Network Internal Load Balancer SKIPPED
[INFO] Apache CloudStack Framework - Spring Life Cycle ... SUCCESS [14.537s]
[INFO] Apache CloudStack Plugin - Network Juniper Contrail SKIPPED
[INFO] Apache CloudStack Plugin - Palo Alto .............. SKIPPED
[INFO] Apache CloudStack Plugin - Network Netscaler ...... SKIPPED
[INFO] Apache CloudStack Plugin - Network Nicira NVP ..... SKIPPED
[INFO] Apache CloudStack Plugin - BigSwitch Virtual Network Segment SKIPPED
[INFO] Apache CloudStack Plugin - Network Brocade VCS .... SKIPPED
[INFO] Apache CloudStack Plugin - Midokura Midonet ....... SKIPPED
[INFO] Apache CloudStack Plugin - Stratosphere SSP ....... SKIPPED
[INFO] Apache CloudStack Plugin - Network Opendaylight ... SKIPPED
[INFO] Apache CloudStack Plugin - Storage Allocator Random SKIPPED
[INFO] Apache CloudStack Plugin - User Authenticator LDAP SKIPPED
[INFO] Apache CloudStack Plugin - User Authenticator MD5 . SKIPPED
[INFO] Apache CloudStack Plugin - User Authenticator Plain Text SKIPPED
[INFO] Apache CloudStack Plugin - User Authenticator SAML2 SKIPPED
[INFO] Apache CloudStack Plugin - User Authenticator SHA256 Salted SKIPPED
[INFO] Apache CloudStack Plugin - Dns Notifier Example ... SKIPPED
[INFO] Apache CloudStack Plugin - Storage Image S3 ....... SKIPPED
[INFO] Apache CloudStack Plugin - Storage Image Swift provider SKIPPED
[INFO] Apache CloudStack Plugin - Storage Image default provider SKIPPED
[INFO] Apache CloudStack Plugin - Storage Image sample provider SKIPPED
[INFO] Apache CloudStack Plugin - Storage Volume Nexenta Provider SKIPPED
[INFO] Apache CloudStack Plugin - Storage Volume CloudByte Provider SKIPPED
[INFO] Apache CloudStack Plugin - Storage Volume sample provider SKIPPED
[INFO] Apache CloudStack Plugin - SNMP Alerts ............ SKIPPED
[INFO] Apache CloudStack Plugin - Syslog Alerts .......... SKIPPED
[INFO] Apache CloudStack Plugin - Network VXLAN .......... SKIPPED
[INFO] Apache CloudStack Plugin - GloboDNS ............... SKIPPED
[INFO] Apache CloudStack Framework - Spring Module ....... SUCCESS [47.458s]
[INFO] Apache CloudStack Secondary Storage Controller .... SKIPPED
[INFO] Apache CloudStack Console Proxy - RDP Client ...... SUCCESS [1:23.834s]
[INFO] Apache CloudStack Console Proxy ................... SUCCESS [35.333s]
[INFO] Apache CloudStack Console Proxy - Server .......... SUCCESS [37.744s]
[INFO] Apache CloudStack System VM ....................... SKIPPED
[INFO] Apache CloudStack Client UI ....................... SKIPPED
[INFO] Apache CloudStack Framework - QuickCloud .......... SUCCESS [3.424s]
[INFO] Apache CloudStack AWS API Bridge .................. SKIPPED
[INFO] ------------------------------------------------------------------------
[INFO] BUILD FAILURE
[INFO] ------------------------------------------------------------------------
[INFO] Total time: 9:27.539s (Wall Clock)
[INFO] Finished at: Thu Oct 16 00:52:23 EDT 2014
[INFO] Final Memory: 50M/283M
[INFO] ------------------------------------------------------------------------
[ERROR] Failed to execute goal org.apache.maven.plugins:maven-compiler-plugin:2.5.1:compile (default-compile) on project cloud-server: Compilation failure: Compilation failure:
[ERROR] <http://jenkins.buildacloud.org/job/build-4.5/ws/server/src/com/cloud/resource/ResourceManagerImpl.java>:[1649,34] error: variable ssCmd is already defined in method createHostVO(StartupCommand[],ServerResource,Map<String,String>,List<String>,Event)
[ERROR] <http://jenkins.buildacloud.org/job/build-4.5/ws/server/src/com/cloud/resource/ResourceManagerImpl.java>:[1650,25] error: variable implicitHostTags is already defined in method createHostVO(StartupCommand[],ServerResource,Map<String,String>,List<String>,Event)
[ERROR] -> [Help 1]
[ERROR]
[ERROR] To see the full stack trace of the errors, re-run Maven with the -e switch.
[ERROR] Re-run Maven using the -X switch to enable full debug logging.
[ERROR]
[ERROR] For more information about the errors and possible solutions, please read the following articles:
[ERROR] [Help 1] http://cwiki.apache.org/confluence/display/MAVEN/MojoFailureException
[ERROR]
[ERROR] After correcting the problems, you can resume the build with the command
[ERROR] mvn <goals> -rf :cloud-server
Build step 'Invoke top-level Maven targets' marked build as failure
Recording test results
Build failed in Jenkins: build-4.5 #23
Posted by je...@cloudstack.org.
See <http://jenkins.buildacloud.org/job/build-4.5/23/changes>
Changes:
[jayapal] CLOUDSTACK-7536 user vm can get a gateway ip when gateway ip is a part of the guest ip range.
[jayapal] CLOUDSTACK-7728: Fixed adding icmp rules with different types and codes
[jayapal] CLOUDSTACK-7728: Fixed adding iptables rules for egress allow on VR reboot
------------------------------------------
[...truncated 1650 lines...]
[INFO]
[INFO] ------------------------------------------------------------------------
[INFO] Building Apache CloudStack Cloud Engine API 4.5.0-SNAPSHOT
[INFO] ------------------------------------------------------------------------
[INFO] Building Apache CloudStack Cloud Engine Orchestration Component 4.5.0-SNAPSHOT
[INFO] ------------------------------------------------------------------------
[INFO] ------------------------------------------------------------------------
[INFO]
[INFO] --- maven-clean-plugin:2.5:clean (default-clean) @ cloud-engine-orchestration ---
[INFO]
[INFO] --- maven-clean-plugin:2.5:clean (default-clean) @ cloud-engine-network ---
[INFO]
[INFO] --- maven-clean-plugin:2.5:clean (default-clean) @ cloud-server ---
[INFO] Deleting <http://jenkins.buildacloud.org/job/build-4.5/ws/engine/network/target> (includes = [**/*], excludes = [])
[INFO] Deleting <http://jenkins.buildacloud.org/job/build-4.5/ws/engine/orchestration/target> (includes = [**/*], excludes = [])
[INFO] Deleting <http://jenkins.buildacloud.org/job/build-4.5/ws/server/target> (includes = [**/*], excludes = [])
[INFO]
[INFO] --- maven-clean-plugin:2.5:clean (default-clean) @ cloud-usage ---
[INFO] Deleting <http://jenkins.buildacloud.org/job/build-4.5/ws/usage/target> (includes = [**/*], excludes = [])
[INFO] Deleting <http://jenkins.buildacloud.org/job/build-4.5/ws/engine/network> (includes = [target, dist], excludes = [])
[INFO]
[INFO] --- maven-checkstyle-plugin:2.11:check (cloudstack-checkstyle) @ cloud-engine-network ---
[INFO] Deleting <http://jenkins.buildacloud.org/job/build-4.5/ws/usage> (includes = [target, dist], excludes = [])
[INFO]
[INFO] --- maven-checkstyle-plugin:2.11:check (cloudstack-checkstyle) @ cloud-usage ---
[INFO] Deleting <http://jenkins.buildacloud.org/job/build-4.5/ws/engine/orchestration> (includes = [target, dist], excludes = [])
[INFO]
[INFO] --- maven-checkstyle-plugin:2.11:check (cloudstack-checkstyle) @ cloud-engine-orchestration ---
[INFO] Deleting <http://jenkins.buildacloud.org/job/build-4.5/ws/server> (includes = [target, dist], excludes = [])
[INFO]
[INFO] --- maven-checkstyle-plugin:2.11:check (cloudstack-checkstyle) @ cloud-server ---
[INFO] Starting audit...
Audit done.
[INFO]
[INFO] --- maven-remote-resources-plugin:1.3:process (default) @ cloud-engine-network ---
[INFO] Starting audit...
Audit done.
[INFO]
[INFO] --- maven-remote-resources-plugin:1.3:process (default) @ cloud-usage ---
[INFO]
[INFO] --- maven-resources-plugin:2.5:resources (default-resources) @ cloud-engine-network ---
[debug] execute contextualize
[INFO] Using 'UTF-8' encoding to copy filtered resources.
[INFO] skip non existing resourceDirectory <http://jenkins.buildacloud.org/job/build-4.5/ws/engine/network/resources>
[INFO] Copying 3 resources
[INFO]
[INFO] --- maven-compiler-plugin:2.5.1:compile (default-compile) @ cloud-engine-network ---
[INFO] Compiling 1 source file to <http://jenkins.buildacloud.org/job/build-4.5/ws/engine/network/target/classes>
[INFO]
[INFO] --- maven-antrun-plugin:1.7:run (generate-resource) @ cloud-usage ---
[INFO] Executing tasks
main:
[copy] Copying 2 files to <http://jenkins.buildacloud.org/job/build-4.5/ws/usage/target/transformed>
[INFO] Executed tasks
[INFO]
[INFO] --- maven-resources-plugin:2.5:resources (default-resources) @ cloud-usage ---
[debug] execute contextualize
[INFO] Using 'UTF-8' encoding to copy filtered resources.
[INFO] Copying 1 resource
[INFO] Copying 3 resources
[INFO]
[INFO] --- maven-compiler-plugin:2.5.1:compile (default-compile) @ cloud-usage ---
[INFO] Compiling 19 source files to <http://jenkins.buildacloud.org/job/build-4.5/ws/usage/target/classes>
[INFO] Starting audit...
Audit done.
[INFO]
[INFO] --- maven-remote-resources-plugin:1.3:process (default) @ cloud-engine-orchestration ---
[INFO]
[INFO] --- maven-resources-plugin:2.5:testResources (default-testResources) @ cloud-engine-network ---
[debug] execute contextualize
[INFO] Using 'UTF-8' encoding to copy filtered resources.
[INFO] skip non existing resourceDirectory <http://jenkins.buildacloud.org/job/build-4.5/ws/engine/network/test/resources>
[INFO] Copying 3 resources
[INFO]
[INFO] --- maven-compiler-plugin:2.5.1:testCompile (default-testCompile) @ cloud-engine-network ---
[INFO] No sources to compile
[INFO]
[INFO] --- maven-surefire-plugin:2.12:test (default-test) @ cloud-engine-network ---
[INFO] Surefire report directory: <http://jenkins.buildacloud.org/job/build-4.5/ws/engine/network/target/surefire-reports>
-------------------------------------------------------
T E S T S
-------------------------------------------------------
[INFO]
[INFO] --- maven-resources-plugin:2.5:resources (default-resources) @ cloud-engine-orchestration ---
[debug] execute contextualize
[INFO] Using 'UTF-8' encoding to copy filtered resources.
[INFO] Copying 1 resource
[INFO] Copying 3 resources
[INFO]
[INFO] --- maven-compiler-plugin:2.5.1:compile (default-compile) @ cloud-engine-orchestration ---
[INFO] Compiling 68 source files to <http://jenkins.buildacloud.org/job/build-4.5/ws/engine/orchestration/target/classes>
Results :
Tests run: 0, Failures: 0, Errors: 0, Skipped: 0
[INFO]
[INFO] --- maven-resources-plugin:2.5:testResources (default-testResources) @ cloud-usage ---
[debug] execute contextualize
[INFO] Using 'UTF-8' encoding to copy filtered resources.
[INFO] Copying 8 resources
[INFO] Copying 3 resources
[INFO]
[INFO] --- maven-compiler-plugin:2.5.1:testCompile (default-testCompile) @ cloud-usage ---
[INFO] Compiling 4 source files to <http://jenkins.buildacloud.org/job/build-4.5/ws/usage/target/test-classes>
[INFO] Starting audit...
<http://jenkins.buildacloud.org/job/build-4.5/ws/server/src/com/cloud/network/router/VirtualNetworkApplianceManagerImpl.java>:173:1: Duplicate import to line 166 - com.cloud.network.rules.FirewallRuleVO.
<http://jenkins.buildacloud.org/job/build-4.5/ws/server/src/com/cloud/network/router/VirtualNetworkApplianceManagerImpl.java>:179:1: Duplicate import to line 178 - com.cloud.offerings.NetworkOfferingVO.
Audit done.
[INFO]
[INFO] --- maven-surefire-plugin:2.12:test (default-test) @ cloud-usage ---
[INFO] Surefire report directory: <http://jenkins.buildacloud.org/job/build-4.5/ws/usage/target/surefire-reports>
-------------------------------------------------------
T E S T S
-------------------------------------------------------
Running com.cloud.usage.UsageSanityCheckerTest
[INFO] ------------------------------------------------------------------------
[INFO] Reactor Summary:
[INFO]
[INFO] Apache CloudStack Developer Tools - Checkstyle Configuration SUCCESS [4.589s]
[INFO] Apache CloudStack ................................. SUCCESS [5.020s]
[INFO] Apache CloudStack Maven Conventions Parent ........ SUCCESS [9.712s]
[INFO] Apache CloudStack Framework - Managed Context ..... SUCCESS [16.388s]
[INFO] Apache CloudStack Utils ........................... SUCCESS [1:01.365s]
[INFO] Apache CloudStack Framework ....................... SUCCESS [1.675s]
[INFO] Apache CloudStack Framework - Event Notification .. SUCCESS [49.273s]
[INFO] Apache CloudStack Framework - Configuration ....... SUCCESS [17.577s]
[INFO] Apache CloudStack API ............................. SUCCESS [1:00.434s]
[INFO] Apache CloudStack Framework - REST ................ SUCCESS [24.340s]
[INFO] Apache CloudStack Framework - IPC ................. SUCCESS [24.504s]
[INFO] Apache CloudStack Cloud Engine .................... SUCCESS [1.568s]
[INFO] Apache CloudStack Cloud Engine API ................ SUCCESS [17.861s]
[INFO] Apache CloudStack Framework - Security ............ SUCCESS [10.284s]
[INFO] Apache CloudStack Core ............................ SUCCESS [55.582s]
[INFO] Apache CloudStack Agents .......................... SUCCESS [25.941s]
[INFO] Apache CloudStack Framework - Clustering .......... SUCCESS [15.021s]
[INFO] Apache CloudStack Framework - Event Notification .. SUCCESS [24.466s]
[INFO] Apache CloudStack Cloud Engine Schema Component ... SUCCESS [1:13.562s]
[INFO] Apache CloudStack Framework - Jobs ................ SUCCESS [20.027s]
[INFO] Apache CloudStack Cloud Engine Internal Components API SUCCESS [11.429s]
[INFO] Apache CloudStack Server .......................... FAILURE [28.358s]
[INFO] Apache CloudStack Usage Server .................... SKIPPED
[INFO] Apache CloudStack Cloud Engine Orchestration Component SKIPPED
[INFO] Apache CloudStack Cloud Services .................. SUCCESS [1.454s]
[INFO] Apache CloudStack Secondary Storage ............... SUCCESS [26.737s]
[INFO] Apache CloudStack Secondary Storage Service ....... SKIPPED
[INFO] Apache CloudStack Engine Storage Component ........ SKIPPED
[INFO] Apache CloudStack Engine Storage Volume Component . SKIPPED
[INFO] Apache CloudStack Engine Storage Image Component .. SKIPPED
[INFO] Apache CloudStack Engine Storage Data Motion Component SKIPPED
[INFO] Apache CloudStack Engine Storage Cache Component .. SKIPPED
[INFO] Apache CloudStack Engine Storage Snapshot Component SKIPPED
[INFO] Apache CloudStack Cloud Engine API ................ SUCCESS [10.032s]
[INFO] Apache CloudStack Cloud Engine Service ............ SKIPPED
[INFO] Apache CloudStack Plugin POM ...................... SKIPPED
[INFO] Apache CloudStack Plugin - API Rate Limit ......... SKIPPED
[INFO] Apache CloudStack Plugin - Storage Volume default provider SKIPPED
[INFO] Apache CloudStack Plugin - Storage Volume SolidFire Provider SKIPPED
[INFO] Apache CloudStack Plugin - API SolidFire .......... SKIPPED
[INFO] Apache CloudStack Plugin - API Discovery .......... SKIPPED
[INFO] Apache CloudStack Plugin - ACL Static Role Based .. SKIPPED
[INFO] Apache CloudStack Plugin - Host Anti-Affinity Processor SKIPPED
[INFO] Apache CloudStack Plugin - Explicit Dedication Processor SKIPPED
[INFO] Apache CloudStack Plugin - User Concentrated Pod Deployment Planner SKIPPED
[INFO] Apache CloudStack Plugin - User Dispersing Deployment Planner SKIPPED
[INFO] Apache CloudStack Plugin - Implicit Dedication Planner SKIPPED
[INFO] Apache CloudStack Plugin - Skip Heurestics Planner SKIPPED
[INFO] Apache CloudStack Plugin - Host Allocator Random .. SKIPPED
[INFO] Apache CloudStack Plugin - Dedicated Resources .... SKIPPED
[INFO] Apache CloudStack Plugin - Hypervisor OracleVM .... SKIPPED
[INFO] Apache CloudStack Plugin - Open vSwitch ........... SKIPPED
[INFO] Apache CloudStack Plugin - Hypervisor XenServer ... SKIPPED
[INFO] Apache CloudStack Plugin - Hypervisor KVM ......... SKIPPED
[INFO] Apache CloudStack Plugin - RabbitMQ Event Bus ..... SKIPPED
[INFO] Apache CloudStack Plugin - In Memory Event Bus .... SKIPPED
[INFO] Apache CloudStack Plugin - Hypervisor Baremetal ... SKIPPED
[INFO] Apache CloudStack Plugin - Hypervisor UCS ......... SKIPPED
[INFO] Apache CloudStack Plugin - Hypervisor Hyper-V ..... SKIPPED
[INFO] Apache CloudStack Plugin - Network Elastic Load Balancer SKIPPED
[INFO] Apache CloudStack Plugin - Network Internal Load Balancer SKIPPED
[INFO] Apache CloudStack Framework - Spring Life Cycle ... SUCCESS [12.523s]
[INFO] Apache CloudStack Plugin - Network Juniper Contrail SKIPPED
[INFO] Apache CloudStack Plugin - Palo Alto .............. SKIPPED
[INFO] Apache CloudStack Plugin - Network Netscaler ...... SKIPPED
[INFO] Apache CloudStack Plugin - Network Nicira NVP ..... SKIPPED
[INFO] Apache CloudStack Plugin - BigSwitch Virtual Network Segment SKIPPED
[INFO] Apache CloudStack Plugin - Network Brocade VCS .... SKIPPED
[INFO] Apache CloudStack Plugin - Midokura Midonet ....... SKIPPED
[INFO] Apache CloudStack Plugin - Stratosphere SSP ....... SKIPPED
[INFO] Apache CloudStack Plugin - Network Opendaylight ... SKIPPED
[INFO] Apache CloudStack Plugin - Storage Allocator Random SKIPPED
[INFO] Apache CloudStack Plugin - User Authenticator LDAP SKIPPED
[INFO] Apache CloudStack Plugin - User Authenticator MD5 . SKIPPED
[INFO] Apache CloudStack Plugin - User Authenticator Plain Text SKIPPED
[INFO] Apache CloudStack Plugin - User Authenticator SAML2 SKIPPED
[INFO] Apache CloudStack Plugin - User Authenticator SHA256 Salted SKIPPED
[INFO] Apache CloudStack Plugin - Dns Notifier Example ... SKIPPED
[INFO] Apache CloudStack Plugin - Storage Image S3 ....... SKIPPED
[INFO] Apache CloudStack Plugin - Storage Image Swift provider SKIPPED
[INFO] Apache CloudStack Plugin - Storage Image default provider SKIPPED
[INFO] Apache CloudStack Plugin - Storage Image sample provider SKIPPED
[INFO] Apache CloudStack Plugin - Storage Volume Nexenta Provider SKIPPED
[INFO] Apache CloudStack Plugin - Storage Volume CloudByte Provider SKIPPED
[INFO] Apache CloudStack Plugin - Storage Volume sample provider SKIPPED
[INFO] Apache CloudStack Plugin - SNMP Alerts ............ SKIPPED
[INFO] Apache CloudStack Plugin - Syslog Alerts .......... SKIPPED
[INFO] Apache CloudStack Plugin - Network VXLAN .......... SKIPPED
[INFO] Apache CloudStack Plugin - GloboDNS ............... SKIPPED
[INFO] Apache CloudStack Framework - Spring Module ....... SUCCESS [51.517s]
[INFO] Apache CloudStack Secondary Storage Controller .... SKIPPED
[INFO] Apache CloudStack Console Proxy - RDP Client ...... SUCCESS [1:22.898s]
[INFO] Apache CloudStack Console Proxy ................... SUCCESS [25.757s]
[INFO] Apache CloudStack Console Proxy - Server .......... SUCCESS [39.101s]
[INFO] Apache CloudStack System VM ....................... SKIPPED
[INFO] Apache CloudStack Client UI ....................... SKIPPED
[INFO] Apache CloudStack Framework - QuickCloud .......... SUCCESS [4.635s]
[INFO] Apache CloudStack AWS API Bridge .................. SKIPPED
[INFO] ------------------------------------------------------------------------
[INFO] BUILD FAILURE
[INFO] ------------------------------------------------------------------------
[INFO] Total time: 7:13.549s (Wall Clock)
[INFO] Finished at: Thu Oct 16 00:20:16 EDT 2014
[INFO] Final Memory: 50M/272M
[INFO] ------------------------------------------------------------------------
Tests run: 1, Failures: 0, Errors: 0, Skipped: 0, Time elapsed: 5.747 sec
Results :
Tests run: 1, Failures: 0, Errors: 0, Skipped: 0
[ERROR] Failed to execute goal org.apache.maven.plugins:maven-checkstyle-plugin:2.11:check (cloudstack-checkstyle) on project cloud-server: Failed during checkstyle execution: There are 2 checkstyle errors. -> [Help 1]
[ERROR]
[ERROR] To see the full stack trace of the errors, re-run Maven with the -e switch.
[ERROR] Re-run Maven using the -X switch to enable full debug logging.
[ERROR]
[ERROR] For more information about the errors and possible solutions, please read the following articles:
[ERROR] [Help 1] http://cwiki.apache.org/confluence/display/MAVEN/MojoExecutionException
[ERROR]
[ERROR] After correcting the problems, you can resume the build with the command
[ERROR] mvn <goals> -rf :cloud-server
Build step 'Invoke top-level Maven targets' marked build as failure
Recording test results
Build failed in Jenkins: build-4.5 #22
Posted by je...@cloudstack.org.
See <http://jenkins.buildacloud.org/job/build-4.5/22/changes>
Changes:
[nitin.mehta] CLOUDSTACK-7532: Template status is not shown in UI/API response for non-default account users. Show it if the owner of the template is the caller
------------------------------------------
[...truncated 1689 lines...]
[INFO]
[INFO] --- maven-remote-resources-plugin:1.3:process (default) @ cloud-usage ---
[INFO]
[INFO] --- maven-resources-plugin:2.5:resources (default-resources) @ cloud-engine-network ---
[debug] execute contextualize
[INFO] Using 'UTF-8' encoding to copy filtered resources.
[INFO] skip non existing resourceDirectory <http://jenkins.buildacloud.org/job/build-4.5/ws/engine/network/resources>
[INFO] Copying 3 resources
[INFO]
[INFO] --- maven-compiler-plugin:2.5.1:compile (default-compile) @ cloud-engine-network ---
[INFO] Compiling 1 source file to <http://jenkins.buildacloud.org/job/build-4.5/ws/engine/network/target/classes>
[INFO] Starting audit...
Audit done.
[INFO]
[INFO] --- maven-remote-resources-plugin:1.3:process (default) @ cloud-engine-orchestration ---
[INFO]
[INFO] --- maven-antrun-plugin:1.7:run (generate-resource) @ cloud-usage ---
[INFO] Executing tasks
main:
[copy] Copying 2 files to <http://jenkins.buildacloud.org/job/build-4.5/ws/usage/target/transformed>
[INFO] Executed tasks
[INFO]
[INFO] --- maven-resources-plugin:2.5:resources (default-resources) @ cloud-usage ---
[debug] execute contextualize
[INFO] Using 'UTF-8' encoding to copy filtered resources.
[INFO] Copying 1 resource
[INFO] Copying 3 resources
[INFO]
[INFO] --- maven-compiler-plugin:2.5.1:compile (default-compile) @ cloud-usage ---
[INFO] Compiling 19 source files to <http://jenkins.buildacloud.org/job/build-4.5/ws/usage/target/classes>
[INFO]
[INFO] --- maven-resources-plugin:2.5:resources (default-resources) @ cloud-engine-orchestration ---
[debug] execute contextualize
[INFO] Using 'UTF-8' encoding to copy filtered resources.
[INFO] Copying 1 resource
[INFO] Copying 3 resources
[INFO]
[INFO] --- maven-compiler-plugin:2.5.1:compile (default-compile) @ cloud-engine-orchestration ---
[INFO] Compiling 68 source files to <http://jenkins.buildacloud.org/job/build-4.5/ws/engine/orchestration/target/classes>
[INFO]
[INFO] --- maven-resources-plugin:2.5:testResources (default-testResources) @ cloud-engine-network ---
[debug] execute contextualize
[INFO] Using 'UTF-8' encoding to copy filtered resources.
[INFO] skip non existing resourceDirectory <http://jenkins.buildacloud.org/job/build-4.5/ws/engine/network/test/resources>
[INFO] Copying 3 resources
[INFO]
[INFO] --- maven-compiler-plugin:2.5.1:testCompile (default-testCompile) @ cloud-engine-network ---
[INFO] No sources to compile
[INFO]
[INFO] --- maven-surefire-plugin:2.12:test (default-test) @ cloud-engine-network ---
[INFO] Surefire report directory: <http://jenkins.buildacloud.org/job/build-4.5/ws/engine/network/target/surefire-reports>
-------------------------------------------------------
T E S T S
-------------------------------------------------------
Results :
Tests run: 0, Failures: 0, Errors: 0, Skipped: 0
[INFO] Starting audit...
Audit done.
[INFO]
[INFO] --- maven-remote-resources-plugin:1.3:process (default) @ cloud-server ---
[INFO]
[INFO] --- maven-resources-plugin:2.5:testResources (default-testResources) @ cloud-usage ---
[debug] execute contextualize
[INFO] Using 'UTF-8' encoding to copy filtered resources.
[INFO] Copying 8 resources
[INFO] Copying 3 resources
[INFO]
[INFO] --- maven-compiler-plugin:2.5.1:testCompile (default-testCompile) @ cloud-usage ---
[INFO] Compiling 4 source files to <http://jenkins.buildacloud.org/job/build-4.5/ws/usage/target/test-classes>
[INFO]
[INFO] --- maven-antrun-plugin:1.7:run (generate-resource) @ cloud-server ---
[INFO] Executing tasks
main:
[copy] Copying 3 files to <http://jenkins.buildacloud.org/job/build-4.5/ws/server/target/conf>
[copy] Copying 1 file to <http://jenkins.buildacloud.org/job/build-4.5/ws/server/target/conf>
[INFO] Executed tasks
[INFO]
[INFO] --- maven-resources-plugin:2.5:resources (default-resources) @ cloud-server ---
[debug] execute contextualize
[INFO] Using 'UTF-8' encoding to copy filtered resources.
[INFO] Copying 30 resources
[INFO] Copying 3 resources
[INFO]
[INFO] --- maven-compiler-plugin:2.5.1:compile (default-compile) @ cloud-server ---
[INFO] Compiling 367 source files to <http://jenkins.buildacloud.org/job/build-4.5/ws/server/target/classes>
[INFO]
[INFO] --- maven-surefire-plugin:2.12:test (default-test) @ cloud-usage ---
[INFO] Surefire report directory: <http://jenkins.buildacloud.org/job/build-4.5/ws/usage/target/surefire-reports>
-------------------------------------------------------
T E S T S
-------------------------------------------------------
Running com.cloud.usage.UsageSanityCheckerTest
Tests run: 1, Failures: 0, Errors: 0, Skipped: 0, Time elapsed: 4.6 sec
Results :
Tests run: 1, Failures: 0, Errors: 0, Skipped: 0
[INFO]
[INFO] --- maven-resources-plugin:2.5:testResources (default-testResources) @ cloud-engine-orchestration ---
[debug] execute contextualize
[INFO] Using 'UTF-8' encoding to copy filtered resources.
[INFO] skip non existing resourceDirectory <http://jenkins.buildacloud.org/job/build-4.5/ws/engine/orchestration/test/resources>
[INFO] Copying 3 resources
[INFO]
[INFO] --- maven-compiler-plugin:2.5.1:testCompile (default-testCompile) @ cloud-engine-orchestration ---
[INFO] Compiling 5 source files to <http://jenkins.buildacloud.org/job/build-4.5/ws/engine/orchestration/target/test-classes>
[INFO]
[INFO] --- maven-surefire-plugin:2.12:test (default-test) @ cloud-engine-orchestration ---
[INFO] Tests are skipped.
[INFO] -------------------------------------------------------------
[ERROR] COMPILATION ERROR :
[INFO] -------------------------------------------------------------
[ERROR] <http://jenkins.buildacloud.org/job/build-4.5/ws/server/src/com/cloud/resource/ResourceManagerImpl.java>:[1649,34] error: variable ssCmd is already defined in method createHostVO(StartupCommand[],ServerResource,Map<String,String>,List<String>,Event)
[ERROR] <http://jenkins.buildacloud.org/job/build-4.5/ws/server/src/com/cloud/resource/ResourceManagerImpl.java>:[1650,25] error: variable implicitHostTags is already defined in method createHostVO(StartupCommand[],ServerResource,Map<String,String>,List<String>,Event)
[INFO] 2 errors
[INFO] -------------------------------------------------------------
[INFO] ------------------------------------------------------------------------
[INFO] Reactor Summary:
[INFO]
[INFO] Apache CloudStack Developer Tools - Checkstyle Configuration SUCCESS [4.655s]
[INFO] Apache CloudStack ................................. SUCCESS [4.205s]
[INFO] Apache CloudStack Maven Conventions Parent ........ SUCCESS [10.282s]
[INFO] Apache CloudStack Framework - Managed Context ..... SUCCESS [18.800s]
[INFO] Apache CloudStack Utils ........................... SUCCESS [54.014s]
[INFO] Apache CloudStack Framework ....................... SUCCESS [0.889s]
[INFO] Apache CloudStack Framework - Event Notification .. SUCCESS [46.877s]
[INFO] Apache CloudStack Framework - Configuration ....... SUCCESS [14.707s]
[INFO] Apache CloudStack API ............................. SUCCESS [53.839s]
[INFO] Apache CloudStack Framework - REST ................ SUCCESS [34.026s]
[INFO] Apache CloudStack Framework - IPC ................. SUCCESS [28.211s]
[INFO] Apache CloudStack Cloud Engine .................... SUCCESS [0.925s]
[INFO] Apache CloudStack Cloud Engine API ................ SUCCESS [20.789s]
[INFO] Apache CloudStack Framework - Security ............ SUCCESS [12.294s]
[INFO] Apache CloudStack Core ............................ SUCCESS [59.544s]
[INFO] Apache CloudStack Agents .......................... SUCCESS [30.655s]
[INFO] Apache CloudStack Framework - Clustering .......... SUCCESS [16.995s]
[INFO] Apache CloudStack Framework - Event Notification .. SUCCESS [16.042s]
[INFO] Apache CloudStack Cloud Engine Schema Component ... SUCCESS [1:14.123s]
[INFO] Apache CloudStack Framework - Jobs ................ SUCCESS [25.121s]
[INFO] Apache CloudStack Cloud Engine Internal Components API SUCCESS [12.076s]
[INFO] Apache CloudStack Server .......................... FAILURE [1:20.380s]
[INFO] Apache CloudStack Usage Server .................... SUCCESS [44.195s]
[INFO] Apache CloudStack Cloud Engine Orchestration Component SUCCESS [58.048s]
[INFO] Apache CloudStack Cloud Services .................. SUCCESS [0.911s]
[INFO] Apache CloudStack Secondary Storage ............... SUCCESS [42.152s]
[INFO] Apache CloudStack Secondary Storage Service ....... SKIPPED
[INFO] Apache CloudStack Engine Storage Component ........ SKIPPED
[INFO] Apache CloudStack Engine Storage Volume Component . SKIPPED
[INFO] Apache CloudStack Engine Storage Image Component .. SKIPPED
[INFO] Apache CloudStack Engine Storage Data Motion Component SKIPPED
[INFO] Apache CloudStack Engine Storage Cache Component .. SKIPPED
[INFO] Apache CloudStack Engine Storage Snapshot Component SKIPPED
[INFO] Apache CloudStack Cloud Engine API ................ SUCCESS [16.190s]
[INFO] Apache CloudStack Cloud Engine Service ............ SKIPPED
[INFO] Apache CloudStack Plugin POM ...................... SKIPPED
[INFO] Apache CloudStack Plugin - API Rate Limit ......... SKIPPED
[INFO] Apache CloudStack Plugin - Storage Volume default provider SKIPPED
[INFO] Apache CloudStack Plugin - Storage Volume SolidFire Provider SKIPPED
[INFO] Apache CloudStack Plugin - API SolidFire .......... SKIPPED
[INFO] Apache CloudStack Plugin - API Discovery .......... SKIPPED
[INFO] Apache CloudStack Plugin - ACL Static Role Based .. SKIPPED
[INFO] Apache CloudStack Plugin - Host Anti-Affinity Processor SKIPPED
[INFO] Apache CloudStack Plugin - Explicit Dedication Processor SKIPPED
[INFO] Apache CloudStack Plugin - User Concentrated Pod Deployment Planner SKIPPED
[INFO] Apache CloudStack Plugin - User Dispersing Deployment Planner SKIPPED
[INFO] Apache CloudStack Plugin - Implicit Dedication Planner SKIPPED
[INFO] Apache CloudStack Plugin - Skip Heurestics Planner SKIPPED
[INFO] Apache CloudStack Plugin - Host Allocator Random .. SKIPPED
[INFO] Apache CloudStack Plugin - Dedicated Resources .... SKIPPED
[INFO] Apache CloudStack Plugin - Hypervisor OracleVM .... SKIPPED
[INFO] Apache CloudStack Plugin - Open vSwitch ........... SKIPPED
[INFO] Apache CloudStack Plugin - Hypervisor XenServer ... SKIPPED
[INFO] Apache CloudStack Plugin - Hypervisor KVM ......... SKIPPED
[INFO] Apache CloudStack Plugin - RabbitMQ Event Bus ..... SKIPPED
[INFO] Apache CloudStack Plugin - In Memory Event Bus .... SKIPPED
[INFO] Apache CloudStack Plugin - Hypervisor Baremetal ... SKIPPED
[INFO] Apache CloudStack Plugin - Hypervisor UCS ......... SKIPPED
[INFO] Apache CloudStack Plugin - Hypervisor Hyper-V ..... SKIPPED
[INFO] Apache CloudStack Plugin - Network Elastic Load Balancer SKIPPED
[INFO] Apache CloudStack Plugin - Network Internal Load Balancer SKIPPED
[INFO] Apache CloudStack Framework - Spring Life Cycle ... SUCCESS [11.787s]
[INFO] Apache CloudStack Plugin - Network Juniper Contrail SKIPPED
[INFO] Apache CloudStack Plugin - Palo Alto .............. SKIPPED
[INFO] Apache CloudStack Plugin - Network Netscaler ...... SKIPPED
[INFO] Apache CloudStack Plugin - Network Nicira NVP ..... SKIPPED
[INFO] Apache CloudStack Plugin - BigSwitch Virtual Network Segment SKIPPED
[INFO] Apache CloudStack Plugin - Network Brocade VCS .... SKIPPED
[INFO] Apache CloudStack Plugin - Midokura Midonet ....... SKIPPED
[INFO] Apache CloudStack Plugin - Stratosphere SSP ....... SKIPPED
[INFO] Apache CloudStack Plugin - Network Opendaylight ... SKIPPED
[INFO] Apache CloudStack Plugin - Storage Allocator Random SKIPPED
[INFO] Apache CloudStack Plugin - User Authenticator LDAP SKIPPED
[INFO] Apache CloudStack Plugin - User Authenticator MD5 . SKIPPED
[INFO] Apache CloudStack Plugin - User Authenticator Plain Text SKIPPED
[INFO] Apache CloudStack Plugin - User Authenticator SAML2 SKIPPED
[INFO] Apache CloudStack Plugin - User Authenticator SHA256 Salted SKIPPED
[INFO] Apache CloudStack Plugin - Dns Notifier Example ... SKIPPED
[INFO] Apache CloudStack Plugin - Storage Image S3 ....... SKIPPED
[INFO] Apache CloudStack Plugin - Storage Image Swift provider SKIPPED
[INFO] Apache CloudStack Plugin - Storage Image default provider SKIPPED
[INFO] Apache CloudStack Plugin - Storage Image sample provider SKIPPED
[INFO] Apache CloudStack Plugin - Storage Volume Nexenta Provider SKIPPED
[INFO] Apache CloudStack Plugin - Storage Volume CloudByte Provider SKIPPED
[INFO] Apache CloudStack Plugin - Storage Volume sample provider SKIPPED
[INFO] Apache CloudStack Plugin - SNMP Alerts ............ SKIPPED
[INFO] Apache CloudStack Plugin - Syslog Alerts .......... SKIPPED
[INFO] Apache CloudStack Plugin - Network VXLAN .......... SKIPPED
[INFO] Apache CloudStack Plugin - GloboDNS ............... SKIPPED
[INFO] Apache CloudStack Framework - Spring Module ....... SUCCESS [45.175s]
[INFO] Apache CloudStack Secondary Storage Controller .... SKIPPED
[INFO] Apache CloudStack Console Proxy - RDP Client ...... SUCCESS [1:27.787s]
[INFO] Apache CloudStack Console Proxy ................... SUCCESS [32.513s]
[INFO] Apache CloudStack Console Proxy - Server .......... SUCCESS [35.877s]
[INFO] Apache CloudStack System VM ....................... SKIPPED
[INFO] Apache CloudStack Client UI ....................... SKIPPED
[INFO] Apache CloudStack Framework - QuickCloud .......... SUCCESS [2.667s]
[INFO] Apache CloudStack AWS API Bridge .................. SKIPPED
[INFO] ------------------------------------------------------------------------
[INFO] BUILD FAILURE
[INFO] ------------------------------------------------------------------------
[INFO] Total time: 8:05.240s (Wall Clock)
[INFO] Finished at: Wed Oct 15 17:13:51 EDT 2014
[INFO] Final Memory: 50M/296M
[INFO] ------------------------------------------------------------------------
[ERROR] Failed to execute goal org.apache.maven.plugins:maven-compiler-plugin:2.5.1:compile (default-compile) on project cloud-server: Compilation failure: Compilation failure:
[ERROR] <http://jenkins.buildacloud.org/job/build-4.5/ws/server/src/com/cloud/resource/ResourceManagerImpl.java>:[1649,34] error: variable ssCmd is already defined in method createHostVO(StartupCommand[],ServerResource,Map<String,String>,List<String>,Event)
[ERROR] <http://jenkins.buildacloud.org/job/build-4.5/ws/server/src/com/cloud/resource/ResourceManagerImpl.java>:[1650,25] error: variable implicitHostTags is already defined in method createHostVO(StartupCommand[],ServerResource,Map<String,String>,List<String>,Event)
[ERROR] -> [Help 1]
[ERROR]
[ERROR] To see the full stack trace of the errors, re-run Maven with the -e switch.
[ERROR] Re-run Maven using the -X switch to enable full debug logging.
[ERROR]
[ERROR] For more information about the errors and possible solutions, please read the following articles:
[ERROR] [Help 1] http://cwiki.apache.org/confluence/display/MAVEN/MojoFailureException
[ERROR]
[ERROR] After correcting the problems, you can resume the build with the command
[ERROR] mvn <goals> -rf :cloud-server
Build step 'Invoke top-level Maven targets' marked build as failure
Recording test results
Build failed in Jenkins: build-4.5 #21
Posted by je...@cloudstack.org.
See <http://jenkins.buildacloud.org/job/build-4.5/21/changes>
Changes:
[talluri] CLOUDSTACK-7693: Fixing pep8 issues
[talluri] CLOUDSTACK-7690: Added missing unittest import to test_escalations_volumes.py
------------------------------------------
[...truncated 1689 lines...]
[INFO]
[INFO] --- maven-remote-resources-plugin:1.3:process (default) @ cloud-usage ---
[INFO]
[INFO] --- maven-resources-plugin:2.5:resources (default-resources) @ cloud-engine-network ---
[debug] execute contextualize
[INFO] Using 'UTF-8' encoding to copy filtered resources.
[INFO] skip non existing resourceDirectory <http://jenkins.buildacloud.org/job/build-4.5/ws/engine/network/resources>
[INFO] Copying 3 resources
[INFO]
[INFO] --- maven-compiler-plugin:2.5.1:compile (default-compile) @ cloud-engine-network ---
[INFO] Compiling 1 source file to <http://jenkins.buildacloud.org/job/build-4.5/ws/engine/network/target/classes>
[INFO] Starting audit...
Audit done.
[INFO]
[INFO] --- maven-remote-resources-plugin:1.3:process (default) @ cloud-engine-orchestration ---
[INFO]
[INFO] --- maven-antrun-plugin:1.7:run (generate-resource) @ cloud-usage ---
[INFO] Executing tasks
main:
[copy] Copying 2 files to <http://jenkins.buildacloud.org/job/build-4.5/ws/usage/target/transformed>
[INFO] Executed tasks
[INFO]
[INFO] --- maven-resources-plugin:2.5:resources (default-resources) @ cloud-usage ---
[debug] execute contextualize
[INFO] Using 'UTF-8' encoding to copy filtered resources.
[INFO] Copying 1 resource
[INFO] Copying 3 resources
[INFO]
[INFO] --- maven-compiler-plugin:2.5.1:compile (default-compile) @ cloud-usage ---
[INFO] Compiling 19 source files to <http://jenkins.buildacloud.org/job/build-4.5/ws/usage/target/classes>
[INFO]
[INFO] --- maven-resources-plugin:2.5:resources (default-resources) @ cloud-engine-orchestration ---
[debug] execute contextualize
[INFO] Using 'UTF-8' encoding to copy filtered resources.
[INFO] Copying 1 resource
[INFO] Copying 3 resources
[INFO]
[INFO] --- maven-compiler-plugin:2.5.1:compile (default-compile) @ cloud-engine-orchestration ---
[INFO] Compiling 68 source files to <http://jenkins.buildacloud.org/job/build-4.5/ws/engine/orchestration/target/classes>
[INFO]
[INFO] --- maven-resources-plugin:2.5:testResources (default-testResources) @ cloud-engine-network ---
[debug] execute contextualize
[INFO] Using 'UTF-8' encoding to copy filtered resources.
[INFO] skip non existing resourceDirectory <http://jenkins.buildacloud.org/job/build-4.5/ws/engine/network/test/resources>
[INFO] Copying 3 resources
[INFO]
[INFO] --- maven-compiler-plugin:2.5.1:testCompile (default-testCompile) @ cloud-engine-network ---
[INFO] No sources to compile
[INFO]
[INFO] --- maven-surefire-plugin:2.12:test (default-test) @ cloud-engine-network ---
[INFO] Surefire report directory: <http://jenkins.buildacloud.org/job/build-4.5/ws/engine/network/target/surefire-reports>
-------------------------------------------------------
T E S T S
-------------------------------------------------------
Results :
Tests run: 0, Failures: 0, Errors: 0, Skipped: 0
[INFO] Starting audit...
Audit done.
[INFO]
[INFO] --- maven-remote-resources-plugin:1.3:process (default) @ cloud-server ---
[INFO]
[INFO] --- maven-resources-plugin:2.5:testResources (default-testResources) @ cloud-usage ---
[debug] execute contextualize
[INFO] Using 'UTF-8' encoding to copy filtered resources.
[INFO] Copying 8 resources
[INFO] Copying 3 resources
[INFO]
[INFO] --- maven-compiler-plugin:2.5.1:testCompile (default-testCompile) @ cloud-usage ---
[INFO] Compiling 4 source files to <http://jenkins.buildacloud.org/job/build-4.5/ws/usage/target/test-classes>
[INFO]
[INFO] --- maven-antrun-plugin:1.7:run (generate-resource) @ cloud-server ---
[INFO] Executing tasks
main:
[copy] Copying 3 files to <http://jenkins.buildacloud.org/job/build-4.5/ws/server/target/conf>
[copy] Copying 1 file to <http://jenkins.buildacloud.org/job/build-4.5/ws/server/target/conf>
[INFO] Executed tasks
[INFO]
[INFO] --- maven-resources-plugin:2.5:resources (default-resources) @ cloud-server ---
[debug] execute contextualize
[INFO] Using 'UTF-8' encoding to copy filtered resources.
[INFO] Copying 30 resources
[INFO] Copying 3 resources
[INFO]
[INFO] --- maven-compiler-plugin:2.5.1:compile (default-compile) @ cloud-server ---
[INFO] Compiling 367 source files to <http://jenkins.buildacloud.org/job/build-4.5/ws/server/target/classes>
[INFO]
[INFO] --- maven-surefire-plugin:2.12:test (default-test) @ cloud-usage ---
[INFO] Surefire report directory: <http://jenkins.buildacloud.org/job/build-4.5/ws/usage/target/surefire-reports>
-------------------------------------------------------
T E S T S
-------------------------------------------------------
[INFO]
[INFO] --- maven-resources-plugin:2.5:testResources (default-testResources) @ cloud-engine-orchestration ---
[debug] execute contextualize
[INFO] Using 'UTF-8' encoding to copy filtered resources.
[INFO] skip non existing resourceDirectory <http://jenkins.buildacloud.org/job/build-4.5/ws/engine/orchestration/test/resources>
[INFO] Copying 3 resources
[INFO]
[INFO] --- maven-compiler-plugin:2.5.1:testCompile (default-testCompile) @ cloud-engine-orchestration ---
[INFO] Compiling 5 source files to <http://jenkins.buildacloud.org/job/build-4.5/ws/engine/orchestration/target/test-classes>
Running com.cloud.usage.UsageSanityCheckerTest
Tests run: 1, Failures: 0, Errors: 0, Skipped: 0, Time elapsed: 4.407 sec
Results :
Tests run: 1, Failures: 0, Errors: 0, Skipped: 0
[INFO]
[INFO] --- maven-surefire-plugin:2.12:test (default-test) @ cloud-engine-orchestration ---
[INFO] Tests are skipped.
[INFO] -------------------------------------------------------------
[ERROR] COMPILATION ERROR :
[INFO] -------------------------------------------------------------
[ERROR] <http://jenkins.buildacloud.org/job/build-4.5/ws/server/src/com/cloud/resource/ResourceManagerImpl.java>:[1649,34] error: variable ssCmd is already defined in method createHostVO(StartupCommand[],ServerResource,Map<String,String>,List<String>,Event)
[ERROR] <http://jenkins.buildacloud.org/job/build-4.5/ws/server/src/com/cloud/resource/ResourceManagerImpl.java>:[1650,25] error: variable implicitHostTags is already defined in method createHostVO(StartupCommand[],ServerResource,Map<String,String>,List<String>,Event)
[INFO] 2 errors
[INFO] -------------------------------------------------------------
[INFO] ------------------------------------------------------------------------
[INFO] Reactor Summary:
[INFO]
[INFO] Apache CloudStack Developer Tools - Checkstyle Configuration SUCCESS [2.374s]
[INFO] Apache CloudStack ................................. SUCCESS [3.086s]
[INFO] Apache CloudStack Maven Conventions Parent ........ SUCCESS [6.432s]
[INFO] Apache CloudStack Framework - Managed Context ..... SUCCESS [13.554s]
[INFO] Apache CloudStack Utils ........................... SUCCESS [40.107s]
[INFO] Apache CloudStack Framework ....................... SUCCESS [0.747s]
[INFO] Apache CloudStack Framework - Event Notification .. SUCCESS [44.970s]
[INFO] Apache CloudStack Framework - Configuration ....... SUCCESS [19.201s]
[INFO] Apache CloudStack API ............................. SUCCESS [1:10.474s]
[INFO] Apache CloudStack Framework - REST ................ SUCCESS [26.250s]
[INFO] Apache CloudStack Framework - IPC ................. SUCCESS [27.989s]
[INFO] Apache CloudStack Cloud Engine .................... SUCCESS [0.769s]
[INFO] Apache CloudStack Cloud Engine API ................ SUCCESS [20.623s]
[INFO] Apache CloudStack Framework - Security ............ SUCCESS [13.287s]
[INFO] Apache CloudStack Core ............................ SUCCESS [1:01.028s]
[INFO] Apache CloudStack Agents .......................... SUCCESS [32.940s]
[INFO] Apache CloudStack Framework - Clustering .......... SUCCESS [15.042s]
[INFO] Apache CloudStack Framework - Event Notification .. SUCCESS [13.904s]
[INFO] Apache CloudStack Cloud Engine Schema Component ... SUCCESS [1:29.421s]
[INFO] Apache CloudStack Framework - Jobs ................ SUCCESS [19.828s]
[INFO] Apache CloudStack Cloud Engine Internal Components API SUCCESS [11.716s]
[INFO] Apache CloudStack Server .......................... FAILURE [1:20.413s]
[INFO] Apache CloudStack Usage Server .................... SUCCESS [44.736s]
[INFO] Apache CloudStack Cloud Engine Orchestration Component SUCCESS [51.632s]
[INFO] Apache CloudStack Cloud Services .................. SUCCESS [0.763s]
[INFO] Apache CloudStack Secondary Storage ............... SUCCESS [24.369s]
[INFO] Apache CloudStack Secondary Storage Service ....... SKIPPED
[INFO] Apache CloudStack Engine Storage Component ........ SKIPPED
[INFO] Apache CloudStack Engine Storage Volume Component . SKIPPED
[INFO] Apache CloudStack Engine Storage Image Component .. SKIPPED
[INFO] Apache CloudStack Engine Storage Data Motion Component SKIPPED
[INFO] Apache CloudStack Engine Storage Cache Component .. SKIPPED
[INFO] Apache CloudStack Engine Storage Snapshot Component SKIPPED
[INFO] Apache CloudStack Cloud Engine API ................ SUCCESS [14.269s]
[INFO] Apache CloudStack Cloud Engine Service ............ SKIPPED
[INFO] Apache CloudStack Plugin POM ...................... SKIPPED
[INFO] Apache CloudStack Plugin - API Rate Limit ......... SKIPPED
[INFO] Apache CloudStack Plugin - Storage Volume default provider SKIPPED
[INFO] Apache CloudStack Plugin - Storage Volume SolidFire Provider SKIPPED
[INFO] Apache CloudStack Plugin - API SolidFire .......... SKIPPED
[INFO] Apache CloudStack Plugin - API Discovery .......... SKIPPED
[INFO] Apache CloudStack Plugin - ACL Static Role Based .. SKIPPED
[INFO] Apache CloudStack Plugin - Host Anti-Affinity Processor SKIPPED
[INFO] Apache CloudStack Plugin - Explicit Dedication Processor SKIPPED
[INFO] Apache CloudStack Plugin - User Concentrated Pod Deployment Planner SKIPPED
[INFO] Apache CloudStack Plugin - User Dispersing Deployment Planner SKIPPED
[INFO] Apache CloudStack Plugin - Implicit Dedication Planner SKIPPED
[INFO] Apache CloudStack Plugin - Skip Heurestics Planner SKIPPED
[INFO] Apache CloudStack Plugin - Host Allocator Random .. SKIPPED
[INFO] Apache CloudStack Plugin - Dedicated Resources .... SKIPPED
[INFO] Apache CloudStack Plugin - Hypervisor OracleVM .... SKIPPED
[INFO] Apache CloudStack Plugin - Open vSwitch ........... SKIPPED
[INFO] Apache CloudStack Plugin - Hypervisor XenServer ... SKIPPED
[INFO] Apache CloudStack Plugin - Hypervisor KVM ......... SKIPPED
[INFO] Apache CloudStack Plugin - RabbitMQ Event Bus ..... SKIPPED
[INFO] Apache CloudStack Plugin - In Memory Event Bus .... SKIPPED
[INFO] Apache CloudStack Plugin - Hypervisor Baremetal ... SKIPPED
[INFO] Apache CloudStack Plugin - Hypervisor UCS ......... SKIPPED
[INFO] Apache CloudStack Plugin - Hypervisor Hyper-V ..... SKIPPED
[INFO] Apache CloudStack Plugin - Network Elastic Load Balancer SKIPPED
[INFO] Apache CloudStack Plugin - Network Internal Load Balancer SKIPPED
[INFO] Apache CloudStack Framework - Spring Life Cycle ... SUCCESS [10.570s]
[INFO] Apache CloudStack Plugin - Network Juniper Contrail SKIPPED
[INFO] Apache CloudStack Plugin - Palo Alto .............. SKIPPED
[INFO] Apache CloudStack Plugin - Network Netscaler ...... SKIPPED
[INFO] Apache CloudStack Plugin - Network Nicira NVP ..... SKIPPED
[INFO] Apache CloudStack Plugin - BigSwitch Virtual Network Segment SKIPPED
[INFO] Apache CloudStack Plugin - Network Brocade VCS .... SKIPPED
[INFO] Apache CloudStack Plugin - Midokura Midonet ....... SKIPPED
[INFO] Apache CloudStack Plugin - Stratosphere SSP ....... SKIPPED
[INFO] Apache CloudStack Plugin - Network Opendaylight ... SKIPPED
[INFO] Apache CloudStack Plugin - Storage Allocator Random SKIPPED
[INFO] Apache CloudStack Plugin - User Authenticator LDAP SKIPPED
[INFO] Apache CloudStack Plugin - User Authenticator MD5 . SKIPPED
[INFO] Apache CloudStack Plugin - User Authenticator Plain Text SKIPPED
[INFO] Apache CloudStack Plugin - User Authenticator SAML2 SKIPPED
[INFO] Apache CloudStack Plugin - User Authenticator SHA256 Salted SKIPPED
[INFO] Apache CloudStack Plugin - Dns Notifier Example ... SKIPPED
[INFO] Apache CloudStack Plugin - Storage Image S3 ....... SKIPPED
[INFO] Apache CloudStack Plugin - Storage Image Swift provider SKIPPED
[INFO] Apache CloudStack Plugin - Storage Image default provider SKIPPED
[INFO] Apache CloudStack Plugin - Storage Image sample provider SKIPPED
[INFO] Apache CloudStack Plugin - Storage Volume Nexenta Provider SKIPPED
[INFO] Apache CloudStack Plugin - Storage Volume CloudByte Provider SKIPPED
[INFO] Apache CloudStack Plugin - Storage Volume sample provider SKIPPED
[INFO] Apache CloudStack Plugin - SNMP Alerts ............ SKIPPED
[INFO] Apache CloudStack Plugin - Syslog Alerts .......... SKIPPED
[INFO] Apache CloudStack Plugin - Network VXLAN .......... SKIPPED
[INFO] Apache CloudStack Plugin - GloboDNS ............... SKIPPED
[INFO] Apache CloudStack Framework - Spring Module ....... SUCCESS [44.648s]
[INFO] Apache CloudStack Secondary Storage Controller .... SKIPPED
[INFO] Apache CloudStack Console Proxy - RDP Client ...... SUCCESS [57.519s]
[INFO] Apache CloudStack Console Proxy ................... SUCCESS [18.628s]
[INFO] Apache CloudStack Console Proxy - Server .......... SUCCESS [35.256s]
[INFO] Apache CloudStack System VM ....................... SKIPPED
[INFO] Apache CloudStack Client UI ....................... SKIPPED
[INFO] Apache CloudStack Framework - QuickCloud .......... SUCCESS [2.803s]
[INFO] Apache CloudStack AWS API Bridge .................. SKIPPED
[INFO] ------------------------------------------------------------------------
[INFO] BUILD FAILURE
[INFO] ------------------------------------------------------------------------
[INFO] Total time: 7:56.533s (Wall Clock)
[INFO] Finished at: Wed Oct 15 01:40:59 EDT 2014
[INFO] Final Memory: 50M/256M
[INFO] ------------------------------------------------------------------------
[ERROR] Failed to execute goal org.apache.maven.plugins:maven-compiler-plugin:2.5.1:compile (default-compile) on project cloud-server: Compilation failure: Compilation failure:
[ERROR] <http://jenkins.buildacloud.org/job/build-4.5/ws/server/src/com/cloud/resource/ResourceManagerImpl.java>:[1649,34] error: variable ssCmd is already defined in method createHostVO(StartupCommand[],ServerResource,Map<String,String>,List<String>,Event)
[ERROR] <http://jenkins.buildacloud.org/job/build-4.5/ws/server/src/com/cloud/resource/ResourceManagerImpl.java>:[1650,25] error: variable implicitHostTags is already defined in method createHostVO(StartupCommand[],ServerResource,Map<String,String>,List<String>,Event)
[ERROR] -> [Help 1]
[ERROR]
[ERROR] To see the full stack trace of the errors, re-run Maven with the -e switch.
[ERROR] Re-run Maven using the -X switch to enable full debug logging.
[ERROR]
[ERROR] For more information about the errors and possible solutions, please read the following articles:
[ERROR] [Help 1] http://cwiki.apache.org/confluence/display/MAVEN/MojoFailureException
[ERROR]
[ERROR] After correcting the problems, you can resume the build with the command
[ERROR] mvn <goals> -rf :cloud-server
Build step 'Invoke top-level Maven targets' marked build as failure
Recording test results
Build failed in Jenkins: build-4.5 #20
Posted by je...@cloudstack.org.
See <http://jenkins.buildacloud.org/job/build-4.5/20/changes>
Changes:
[amogh.vasekar] Fixing possible formatting issue with license header, causing builds to fail. Works well locally
------------------------------------------
[...truncated 1682 lines...]
[INFO]
[INFO] --- maven-remote-resources-plugin:1.3:process (default) @ cloud-usage ---
[INFO]
[INFO] --- maven-resources-plugin:2.5:resources (default-resources) @ cloud-engine-network ---
[debug] execute contextualize
[INFO] Using 'UTF-8' encoding to copy filtered resources.
[INFO] skip non existing resourceDirectory <http://jenkins.buildacloud.org/job/build-4.5/ws/engine/network/resources>
[INFO] Copying 3 resources
[INFO]
[INFO] --- maven-compiler-plugin:2.5.1:compile (default-compile) @ cloud-engine-network ---
[INFO] Compiling 1 source file to <http://jenkins.buildacloud.org/job/build-4.5/ws/engine/network/target/classes>
[INFO] Starting audit...
Audit done.
[INFO]
[INFO] --- maven-remote-resources-plugin:1.3:process (default) @ cloud-engine-orchestration ---
[INFO]
[INFO] --- maven-antrun-plugin:1.7:run (generate-resource) @ cloud-usage ---
[INFO] Executing tasks
main:
[copy] Copying 2 files to <http://jenkins.buildacloud.org/job/build-4.5/ws/usage/target/transformed>
[INFO] Executed tasks
[INFO]
[INFO] --- maven-resources-plugin:2.5:resources (default-resources) @ cloud-usage ---
[debug] execute contextualize
[INFO] Using 'UTF-8' encoding to copy filtered resources.
[INFO] Copying 1 resource
[INFO] Copying 3 resources
[INFO]
[INFO] --- maven-compiler-plugin:2.5.1:compile (default-compile) @ cloud-usage ---
[INFO] Compiling 19 source files to <http://jenkins.buildacloud.org/job/build-4.5/ws/usage/target/classes>
[INFO]
[INFO] --- maven-resources-plugin:2.5:resources (default-resources) @ cloud-engine-orchestration ---
[debug] execute contextualize
[INFO] Using 'UTF-8' encoding to copy filtered resources.
[INFO] Copying 1 resource
[INFO] Copying 3 resources
[INFO]
[INFO] --- maven-compiler-plugin:2.5.1:compile (default-compile) @ cloud-engine-orchestration ---
[INFO] Compiling 68 source files to <http://jenkins.buildacloud.org/job/build-4.5/ws/engine/orchestration/target/classes>
[INFO]
[INFO] --- maven-resources-plugin:2.5:testResources (default-testResources) @ cloud-engine-network ---
[debug] execute contextualize
[INFO] Using 'UTF-8' encoding to copy filtered resources.
[INFO] skip non existing resourceDirectory <http://jenkins.buildacloud.org/job/build-4.5/ws/engine/network/test/resources>
[INFO] Copying 3 resources
[INFO]
[INFO] --- maven-compiler-plugin:2.5.1:testCompile (default-testCompile) @ cloud-engine-network ---
[INFO] No sources to compile
[INFO]
[INFO] --- maven-surefire-plugin:2.12:test (default-test) @ cloud-engine-network ---
[INFO] Surefire report directory: <http://jenkins.buildacloud.org/job/build-4.5/ws/engine/network/target/surefire-reports>
-------------------------------------------------------
T E S T S
-------------------------------------------------------
Results :
Tests run: 0, Failures: 0, Errors: 0, Skipped: 0
[INFO] Starting audit...
Audit done.
[INFO]
[INFO] --- maven-remote-resources-plugin:1.3:process (default) @ cloud-server ---
[INFO]
[INFO] --- maven-resources-plugin:2.5:testResources (default-testResources) @ cloud-usage ---
[debug] execute contextualize
[INFO] Using 'UTF-8' encoding to copy filtered resources.
[INFO] Copying 8 resources
[INFO] Copying 3 resources
[INFO]
[INFO] --- maven-compiler-plugin:2.5.1:testCompile (default-testCompile) @ cloud-usage ---
[INFO] Compiling 4 source files to <http://jenkins.buildacloud.org/job/build-4.5/ws/usage/target/test-classes>
[INFO]
[INFO] --- maven-antrun-plugin:1.7:run (generate-resource) @ cloud-server ---
[INFO] Executing tasks
main:
[copy] Copying 3 files to <http://jenkins.buildacloud.org/job/build-4.5/ws/server/target/conf>
[copy] Copying 1 file to <http://jenkins.buildacloud.org/job/build-4.5/ws/server/target/conf>
[INFO] Executed tasks
[INFO]
[INFO] --- maven-resources-plugin:2.5:resources (default-resources) @ cloud-server ---
[debug] execute contextualize
[INFO] Using 'UTF-8' encoding to copy filtered resources.
[INFO] Copying 30 resources
[INFO] Copying 3 resources
[INFO]
[INFO] --- maven-compiler-plugin:2.5.1:compile (default-compile) @ cloud-server ---
[INFO] Compiling 367 source files to <http://jenkins.buildacloud.org/job/build-4.5/ws/server/target/classes>
[INFO]
[INFO] --- maven-surefire-plugin:2.12:test (default-test) @ cloud-usage ---
[INFO] Surefire report directory: <http://jenkins.buildacloud.org/job/build-4.5/ws/usage/target/surefire-reports>
-------------------------------------------------------
T E S T S
-------------------------------------------------------
Running com.cloud.usage.UsageSanityCheckerTest
[INFO]
[INFO] --- maven-resources-plugin:2.5:testResources (default-testResources) @ cloud-engine-orchestration ---
[debug] execute contextualize
[INFO] Using 'UTF-8' encoding to copy filtered resources.
[INFO] skip non existing resourceDirectory <http://jenkins.buildacloud.org/job/build-4.5/ws/engine/orchestration/test/resources>
[INFO] Copying 3 resources
[INFO]
[INFO] --- maven-compiler-plugin:2.5.1:testCompile (default-testCompile) @ cloud-engine-orchestration ---
[INFO] Compiling 5 source files to <http://jenkins.buildacloud.org/job/build-4.5/ws/engine/orchestration/target/test-classes>
Tests run: 1, Failures: 0, Errors: 0, Skipped: 0, Time elapsed: 5.758 sec
Results :
Tests run: 1, Failures: 0, Errors: 0, Skipped: 0
[INFO]
[INFO] --- maven-surefire-plugin:2.12:test (default-test) @ cloud-engine-orchestration ---
[INFO] Tests are skipped.
[INFO] -------------------------------------------------------------
[ERROR] COMPILATION ERROR :
[INFO] -------------------------------------------------------------
[ERROR] <http://jenkins.buildacloud.org/job/build-4.5/ws/server/src/com/cloud/resource/ResourceManagerImpl.java>:[1649,34] error: variable ssCmd is already defined in method createHostVO(StartupCommand[],ServerResource,Map<String,String>,List<String>,Event)
[ERROR] <http://jenkins.buildacloud.org/job/build-4.5/ws/server/src/com/cloud/resource/ResourceManagerImpl.java>:[1650,25] error: variable implicitHostTags is already defined in method createHostVO(StartupCommand[],ServerResource,Map<String,String>,List<String>,Event)
[INFO] 2 errors
[INFO] -------------------------------------------------------------
[INFO] ------------------------------------------------------------------------
[INFO] Reactor Summary:
[INFO]
[INFO] Apache CloudStack Developer Tools - Checkstyle Configuration SUCCESS [2.789s]
[INFO] Apache CloudStack ................................. SUCCESS [4.552s]
[INFO] Apache CloudStack Maven Conventions Parent ........ SUCCESS [9.379s]
[INFO] Apache CloudStack Framework - Managed Context ..... SUCCESS [18.852s]
[INFO] Apache CloudStack Utils ........................... SUCCESS [1:05.584s]
[INFO] Apache CloudStack Framework ....................... SUCCESS [0.993s]
[INFO] Apache CloudStack Framework - Event Notification .. SUCCESS [57.259s]
[INFO] Apache CloudStack Framework - Configuration ....... SUCCESS [22.453s]
[INFO] Apache CloudStack API ............................. SUCCESS [1:15.938s]
[INFO] Apache CloudStack Framework - REST ................ SUCCESS [27.951s]
[INFO] Apache CloudStack Framework - IPC ................. SUCCESS [37.065s]
[INFO] Apache CloudStack Cloud Engine .................... SUCCESS [1.007s]
[INFO] Apache CloudStack Cloud Engine API ................ SUCCESS [26.997s]
[INFO] Apache CloudStack Framework - Security ............ SUCCESS [15.182s]
[INFO] Apache CloudStack Core ............................ SUCCESS [1:17.218s]
[INFO] Apache CloudStack Agents .......................... SUCCESS [36.479s]
[INFO] Apache CloudStack Framework - Clustering .......... SUCCESS [19.612s]
[INFO] Apache CloudStack Framework - Event Notification .. SUCCESS [20.544s]
[INFO] Apache CloudStack Cloud Engine Schema Component ... SUCCESS [1:38.982s]
[INFO] Apache CloudStack Framework - Jobs ................ SUCCESS [28.597s]
[INFO] Apache CloudStack Cloud Engine Internal Components API SUCCESS [15.475s]
[INFO] Apache CloudStack Server .......................... FAILURE [1:41.478s]
[INFO] Apache CloudStack Usage Server .................... SUCCESS [52.709s]
[INFO] Apache CloudStack Cloud Engine Orchestration Component SUCCESS [1:07.097s]
[INFO] Apache CloudStack Cloud Services .................. SUCCESS [0.980s]
[INFO] Apache CloudStack Secondary Storage ............... SUCCESS [36.883s]
[INFO] Apache CloudStack Secondary Storage Service ....... SKIPPED
[INFO] Apache CloudStack Engine Storage Component ........ SKIPPED
[INFO] Apache CloudStack Engine Storage Volume Component . SKIPPED
[INFO] Apache CloudStack Engine Storage Image Component .. SKIPPED
[INFO] Apache CloudStack Engine Storage Data Motion Component SKIPPED
[INFO] Apache CloudStack Engine Storage Cache Component .. SKIPPED
[INFO] Apache CloudStack Engine Storage Snapshot Component SKIPPED
[INFO] Apache CloudStack Cloud Engine API ................ SUCCESS [17.598s]
[INFO] Apache CloudStack Cloud Engine Service ............ SKIPPED
[INFO] Apache CloudStack Plugin POM ...................... SKIPPED
[INFO] Apache CloudStack Plugin - API Rate Limit ......... SKIPPED
[INFO] Apache CloudStack Plugin - Storage Volume default provider SKIPPED
[INFO] Apache CloudStack Plugin - Storage Volume SolidFire Provider SKIPPED
[INFO] Apache CloudStack Plugin - API SolidFire .......... SKIPPED
[INFO] Apache CloudStack Plugin - API Discovery .......... SKIPPED
[INFO] Apache CloudStack Plugin - ACL Static Role Based .. SKIPPED
[INFO] Apache CloudStack Plugin - Host Anti-Affinity Processor SKIPPED
[INFO] Apache CloudStack Plugin - Explicit Dedication Processor SKIPPED
[INFO] Apache CloudStack Plugin - User Concentrated Pod Deployment Planner SKIPPED
[INFO] Apache CloudStack Plugin - User Dispersing Deployment Planner SKIPPED
[INFO] Apache CloudStack Plugin - Implicit Dedication Planner SKIPPED
[INFO] Apache CloudStack Plugin - Skip Heurestics Planner SKIPPED
[INFO] Apache CloudStack Plugin - Host Allocator Random .. SKIPPED
[INFO] Apache CloudStack Plugin - Dedicated Resources .... SKIPPED
[INFO] Apache CloudStack Plugin - Hypervisor OracleVM .... SKIPPED
[INFO] Apache CloudStack Plugin - Open vSwitch ........... SKIPPED
[INFO] Apache CloudStack Plugin - Hypervisor XenServer ... SKIPPED
[INFO] Apache CloudStack Plugin - Hypervisor KVM ......... SKIPPED
[INFO] Apache CloudStack Plugin - RabbitMQ Event Bus ..... SKIPPED
[INFO] Apache CloudStack Plugin - In Memory Event Bus .... SKIPPED
[INFO] Apache CloudStack Plugin - Hypervisor Baremetal ... SKIPPED
[INFO] Apache CloudStack Plugin - Hypervisor UCS ......... SKIPPED
[INFO] Apache CloudStack Plugin - Hypervisor Hyper-V ..... SKIPPED
[INFO] Apache CloudStack Plugin - Network Elastic Load Balancer SKIPPED
[INFO] Apache CloudStack Plugin - Network Internal Load Balancer SKIPPED
[INFO] Apache CloudStack Framework - Spring Life Cycle ... SUCCESS [16.078s]
[INFO] Apache CloudStack Plugin - Network Juniper Contrail SKIPPED
[INFO] Apache CloudStack Plugin - Palo Alto .............. SKIPPED
[INFO] Apache CloudStack Plugin - Network Netscaler ...... SKIPPED
[INFO] Apache CloudStack Plugin - Network Nicira NVP ..... SKIPPED
[INFO] Apache CloudStack Plugin - BigSwitch Virtual Network Segment SKIPPED
[INFO] Apache CloudStack Plugin - Network Brocade VCS .... SKIPPED
[INFO] Apache CloudStack Plugin - Midokura Midonet ....... SKIPPED
[INFO] Apache CloudStack Plugin - Stratosphere SSP ....... SKIPPED
[INFO] Apache CloudStack Plugin - Network Opendaylight ... SKIPPED
[INFO] Apache CloudStack Plugin - Storage Allocator Random SKIPPED
[INFO] Apache CloudStack Plugin - User Authenticator LDAP SKIPPED
[INFO] Apache CloudStack Plugin - User Authenticator MD5 . SKIPPED
[INFO] Apache CloudStack Plugin - User Authenticator Plain Text SKIPPED
[INFO] Apache CloudStack Plugin - User Authenticator SAML2 SKIPPED
[INFO] Apache CloudStack Plugin - User Authenticator SHA256 Salted SKIPPED
[INFO] Apache CloudStack Plugin - Dns Notifier Example ... SKIPPED
[INFO] Apache CloudStack Plugin - Storage Image S3 ....... SKIPPED
[INFO] Apache CloudStack Plugin - Storage Image Swift provider SKIPPED
[INFO] Apache CloudStack Plugin - Storage Image default provider SKIPPED
[INFO] Apache CloudStack Plugin - Storage Image sample provider SKIPPED
[INFO] Apache CloudStack Plugin - Storage Volume Nexenta Provider SKIPPED
[INFO] Apache CloudStack Plugin - Storage Volume CloudByte Provider SKIPPED
[INFO] Apache CloudStack Plugin - Storage Volume sample provider SKIPPED
[INFO] Apache CloudStack Plugin - SNMP Alerts ............ SKIPPED
[INFO] Apache CloudStack Plugin - Syslog Alerts .......... SKIPPED
[INFO] Apache CloudStack Plugin - Network VXLAN .......... SKIPPED
[INFO] Apache CloudStack Plugin - GloboDNS ............... SKIPPED
[INFO] Apache CloudStack Framework - Spring Module ....... SUCCESS [57.000s]
[INFO] Apache CloudStack Secondary Storage Controller .... SKIPPED
[INFO] Apache CloudStack Console Proxy - RDP Client ...... SUCCESS [1:30.088s]
[INFO] Apache CloudStack Console Proxy ................... SUCCESS [35.833s]
[INFO] Apache CloudStack Console Proxy - Server .......... SUCCESS [45.842s]
[INFO] Apache CloudStack System VM ....................... SKIPPED
[INFO] Apache CloudStack Client UI ....................... SKIPPED
[INFO] Apache CloudStack Framework - QuickCloud .......... SUCCESS [3.485s]
[INFO] Apache CloudStack AWS API Bridge .................. SKIPPED
[INFO] ------------------------------------------------------------------------
[INFO] BUILD FAILURE
[INFO] ------------------------------------------------------------------------
[INFO] Total time: 10:04.002s (Wall Clock)
[INFO] Finished at: Tue Oct 14 17:52:59 EDT 2014
[INFO] Final Memory: 50M/256M
[INFO] ------------------------------------------------------------------------
[ERROR] Failed to execute goal org.apache.maven.plugins:maven-compiler-plugin:2.5.1:compile (default-compile) on project cloud-server: Compilation failure: Compilation failure:
[ERROR] <http://jenkins.buildacloud.org/job/build-4.5/ws/server/src/com/cloud/resource/ResourceManagerImpl.java>:[1649,34] error: variable ssCmd is already defined in method createHostVO(StartupCommand[],ServerResource,Map<String,String>,List<String>,Event)
[ERROR] <http://jenkins.buildacloud.org/job/build-4.5/ws/server/src/com/cloud/resource/ResourceManagerImpl.java>:[1650,25] error: variable implicitHostTags is already defined in method createHostVO(StartupCommand[],ServerResource,Map<String,String>,List<String>,Event)
[ERROR] -> [Help 1]
[ERROR]
[ERROR] To see the full stack trace of the errors, re-run Maven with the -e switch.
[ERROR] Re-run Maven using the -X switch to enable full debug logging.
[ERROR]
[ERROR] For more information about the errors and possible solutions, please read the following articles:
[ERROR] [Help 1] http://cwiki.apache.org/confluence/display/MAVEN/MojoFailureException
[ERROR]
[ERROR] After correcting the problems, you can resume the build with the command
[ERROR] mvn <goals> -rf :cloud-server
Build step 'Invoke top-level Maven targets' marked build as failure
Recording test results
Build failed in Jenkins: build-4.5 #19
Posted by je...@cloudstack.org.
See <http://jenkins.buildacloud.org/job/build-4.5/19/changes>
Changes:
[jessicawang] CLOUDSTACK-7723: UI > Storage > detail view > add Disk Offering field.
------------------------------------------
[...truncated 1271 lines...]
[INFO] Deleting <http://jenkins.buildacloud.org/job/build-4.5/ws/engine/api> (includes = [target, dist], excludes = [])
[INFO]
[INFO] --- maven-checkstyle-plugin:2.11:check (cloudstack-checkstyle) @ cloud-engine-api ---
[INFO] Starting audit...
Audit done.
[INFO]
[INFO] --- maven-remote-resources-plugin:1.3:process (default) @ cloud-framework-security ---
[INFO] Starting audit...
Audit done.
[INFO]
[INFO] --- maven-remote-resources-plugin:1.3:process (default) @ cloud-engine-api ---
[INFO]
[INFO] --- maven-resources-plugin:2.5:resources (default-resources) @ cloud-framework-security ---
[debug] execute contextualize
[INFO] Using 'UTF-8' encoding to copy filtered resources.
[INFO] Copying 1 resource
[INFO] Copying 3 resources
[INFO]
[INFO] --- maven-compiler-plugin:2.5.1:compile (default-compile) @ cloud-framework-security ---
[INFO] Compiling 7 source files to <http://jenkins.buildacloud.org/job/build-4.5/ws/framework/security/target/classes>
[INFO]
[INFO] --- maven-resources-plugin:2.5:resources (default-resources) @ cloud-engine-api ---
[debug] execute contextualize
[INFO] Using 'UTF-8' encoding to copy filtered resources.
[INFO] Copying 1 resource
[INFO] Copying 3 resources
[INFO]
[INFO] --- maven-compiler-plugin:2.5.1:compile (default-compile) @ cloud-engine-api ---
[INFO] Compiling 107 source files to <http://jenkins.buildacloud.org/job/build-4.5/ws/engine/api/target/classes>
[INFO]
[INFO] --- maven-resources-plugin:2.5:testResources (default-testResources) @ cloud-framework-security ---
[debug] execute contextualize
[INFO] Using 'UTF-8' encoding to copy filtered resources.
[INFO] skip non existing resourceDirectory <http://jenkins.buildacloud.org/job/build-4.5/ws/framework/security/test/resources>
[INFO] Copying 3 resources
[INFO]
[INFO] --- maven-compiler-plugin:2.5.1:testCompile (default-testCompile) @ cloud-framework-security ---
[INFO] No sources to compile
[INFO]
[INFO] --- maven-surefire-plugin:2.12:test (default-test) @ cloud-framework-security ---
[INFO] Surefire report directory: <http://jenkins.buildacloud.org/job/build-4.5/ws/framework/security/target/surefire-reports>
-------------------------------------------------------
T E S T S
-------------------------------------------------------
[INFO]
[INFO] --- maven-resources-plugin:2.5:testResources (default-testResources) @ cloud-engine-api ---
[debug] execute contextualize
[INFO] Using 'UTF-8' encoding to copy filtered resources.
[INFO] skip non existing resourceDirectory <http://jenkins.buildacloud.org/job/build-4.5/ws/engine/api/test/resources>
[INFO] Copying 3 resources
[INFO]
[INFO] --- maven-compiler-plugin:2.5.1:testCompile (default-testCompile) @ cloud-engine-api ---
[INFO] Compiling 2 source files to <http://jenkins.buildacloud.org/job/build-4.5/ws/engine/api/target/test-classes>
Results :
Tests run: 0, Failures: 0, Errors: 0, Skipped: 0
[INFO]
[INFO] --- maven-surefire-plugin:2.12:test (default-test) @ cloud-engine-api ---
[INFO] Surefire report directory: <http://jenkins.buildacloud.org/job/build-4.5/ws/engine/api/target/surefire-reports>
-------------------------------------------------------
T E S T S
-------------------------------------------------------
Running org.apache.cloudstack.engine.subsystem.api.storage.ScopeTest
Tests run: 3, Failures: 0, Errors: 0, Skipped: 0, Time elapsed: 0.18 sec
Running org.apache.cloudstack.engine.subsystem.api.storage.type.VolumeTypeHelperTest
Tests run: 8, Failures: 0, Errors: 0, Skipped: 0, Time elapsed: 0.022 sec
Results :
Tests run: 11, Failures: 0, Errors: 0, Skipped: 0
[INFO]
[INFO]
[INFO] ------------------------------------------------------------------------
[INFO] Building Apache CloudStack Cloud Engine Schema Component 4.5.0-SNAPSHOT
[INFO] ------------------------------------------------------------------------
[INFO] ------------------------------------------------------------------------
[INFO] Building Apache CloudStack Core 4.5.0-SNAPSHOT
[INFO] ------------------------------------------------------------------------
[INFO]
[INFO] --- maven-clean-plugin:2.5:clean (default-clean) @ cloud-core ---
[INFO] Deleting <http://jenkins.buildacloud.org/job/build-4.5/ws/core/target> (includes = [**/*], excludes = [])
[INFO]
[INFO] --- maven-clean-plugin:2.5:clean (default-clean) @ cloud-engine-schema ---
[INFO] Deleting <http://jenkins.buildacloud.org/job/build-4.5/ws/engine/schema/target> (includes = [**/*], excludes = [])
[INFO] Deleting <http://jenkins.buildacloud.org/job/build-4.5/ws/core> (includes = [target, dist], excludes = [])
[INFO]
[INFO] --- maven-checkstyle-plugin:2.11:check (cloudstack-checkstyle) @ cloud-core ---
[INFO] Deleting <http://jenkins.buildacloud.org/job/build-4.5/ws/engine/schema> (includes = [target, dist], excludes = [])
[INFO]
[INFO] --- maven-checkstyle-plugin:2.11:check (cloudstack-checkstyle) @ cloud-engine-schema ---
[INFO] Starting audit...
Audit done.
[INFO]
[INFO] --- maven-remote-resources-plugin:1.3:process (default) @ cloud-core ---
[INFO]
[INFO] --- maven-resources-plugin:2.5:resources (default-resources) @ cloud-core ---
[debug] execute contextualize
[INFO] Using 'UTF-8' encoding to copy filtered resources.
[INFO] Copying 26 resources
[INFO] Copying 3 resources
[INFO]
[INFO] --- maven-compiler-plugin:2.5.1:compile (default-compile) @ cloud-core ---
[INFO] Compiling 331 source files to <http://jenkins.buildacloud.org/job/build-4.5/ws/core/target/classes>
[INFO] Starting audit...
Audit done.
[INFO]
[INFO] --- maven-remote-resources-plugin:1.3:process (default) @ cloud-engine-schema ---
[INFO]
[INFO] --- maven-resources-plugin:2.5:resources (default-resources) @ cloud-engine-schema ---
[debug] execute contextualize
[INFO] Using 'UTF-8' encoding to copy filtered resources.
[INFO] Copying 2 resources
[INFO] Copying 3 resources
[INFO]
[INFO] --- maven-compiler-plugin:2.5.1:compile (default-compile) @ cloud-engine-schema ---
[INFO] Compiling 660 source files to <http://jenkins.buildacloud.org/job/build-4.5/ws/engine/schema/target/classes>
[INFO]
[INFO] --- license-maven-plugin:2.5:check (cloudstack-checklicence) @ cloud-core ---
[INFO] Checking licenses...
[WARNING] Missing header in: <http://jenkins.buildacloud.org/job/build-4.5/ws/core/src/com/cloud/agent/api/baremetal/PrepareKickstartPxeServerCommand.java>
[INFO] ------------------------------------------------------------------------
[INFO] Reactor Summary:
[INFO]
[INFO] Apache CloudStack Developer Tools - Checkstyle Configuration SUCCESS [1.661s]
[INFO] Apache CloudStack ................................. SUCCESS [1.502s]
[INFO] Apache CloudStack Maven Conventions Parent ........ SUCCESS [4.795s]
[INFO] Apache CloudStack Framework - Managed Context ..... SUCCESS [10.382s]
[INFO] Apache CloudStack Utils ........................... SUCCESS [33.096s]
[INFO] Apache CloudStack Framework ....................... SUCCESS [1.130s]
[INFO] Apache CloudStack Framework - Event Notification .. SUCCESS [28.410s]
[INFO] Apache CloudStack Framework - Configuration ....... SUCCESS [6.678s]
[INFO] Apache CloudStack API ............................. SUCCESS [26.387s]
[INFO] Apache CloudStack Framework - REST ................ SUCCESS [17.661s]
[INFO] Apache CloudStack Framework - IPC ................. SUCCESS [12.307s]
[INFO] Apache CloudStack Cloud Engine .................... SUCCESS [1.127s]
[INFO] Apache CloudStack Cloud Engine API ................ SUCCESS [9.389s]
[INFO] Apache CloudStack Framework - Security ............ SUCCESS [6.738s]
[INFO] Apache CloudStack Core ............................ FAILURE [19.141s]
[INFO] Apache CloudStack Agents .......................... SKIPPED
[INFO] Apache CloudStack Framework - Clustering .......... SUCCESS [7.513s]
[INFO] Apache CloudStack Framework - Event Notification .. SUCCESS [11.175s]
[INFO] Apache CloudStack Cloud Engine Schema Component ... SKIPPED
[INFO] Apache CloudStack Framework - Jobs ................ SKIPPED
[INFO] Apache CloudStack Cloud Engine Internal Components API SKIPPED
[INFO] Apache CloudStack Server .......................... SKIPPED
[INFO] Apache CloudStack Usage Server .................... SKIPPED
[INFO] Apache CloudStack Cloud Engine Orchestration Component SKIPPED
[INFO] Apache CloudStack Cloud Services .................. SUCCESS [1.157s]
[INFO] Apache CloudStack Secondary Storage ............... SUCCESS [14.626s]
[INFO] Apache CloudStack Secondary Storage Service ....... SKIPPED
[INFO] Apache CloudStack Engine Storage Component ........ SKIPPED
[INFO] Apache CloudStack Engine Storage Volume Component . SKIPPED
[INFO] Apache CloudStack Engine Storage Image Component .. SKIPPED
[INFO] Apache CloudStack Engine Storage Data Motion Component SKIPPED
[INFO] Apache CloudStack Engine Storage Cache Component .. SKIPPED
[INFO] Apache CloudStack Engine Storage Snapshot Component SKIPPED
[INFO] Apache CloudStack Cloud Engine API ................ SKIPPED
[INFO] Apache CloudStack Cloud Engine Service ............ SKIPPED
[INFO] Apache CloudStack Plugin POM ...................... SKIPPED
[INFO] Apache CloudStack Plugin - API Rate Limit ......... SKIPPED
[INFO] Apache CloudStack Plugin - Storage Volume default provider SKIPPED
[INFO] Apache CloudStack Plugin - Storage Volume SolidFire Provider SKIPPED
[INFO] Apache CloudStack Plugin - API SolidFire .......... SKIPPED
[INFO] Apache CloudStack Plugin - API Discovery .......... SKIPPED
[INFO] Apache CloudStack Plugin - ACL Static Role Based .. SKIPPED
[INFO] Apache CloudStack Plugin - Host Anti-Affinity Processor SKIPPED
[INFO] Apache CloudStack Plugin - Explicit Dedication Processor SKIPPED
[INFO] Apache CloudStack Plugin - User Concentrated Pod Deployment Planner SKIPPED
[INFO] Apache CloudStack Plugin - User Dispersing Deployment Planner SKIPPED
[INFO] Apache CloudStack Plugin - Implicit Dedication Planner SKIPPED
[INFO] Apache CloudStack Plugin - Skip Heurestics Planner SKIPPED
[INFO] Apache CloudStack Plugin - Host Allocator Random .. SKIPPED
[INFO] Apache CloudStack Plugin - Dedicated Resources .... SKIPPED
[INFO] Apache CloudStack Plugin - Hypervisor OracleVM .... SKIPPED
[INFO] Apache CloudStack Plugin - Open vSwitch ........... SKIPPED
[INFO] Apache CloudStack Plugin - Hypervisor XenServer ... SKIPPED
[INFO] Apache CloudStack Plugin - Hypervisor KVM ......... SKIPPED
[INFO] Apache CloudStack Plugin - RabbitMQ Event Bus ..... SKIPPED
[INFO] Apache CloudStack Plugin - In Memory Event Bus .... SKIPPED
[INFO] Apache CloudStack Plugin - Hypervisor Baremetal ... SKIPPED
[INFO] Apache CloudStack Plugin - Hypervisor UCS ......... SKIPPED
[INFO] Apache CloudStack Plugin - Hypervisor Hyper-V ..... SKIPPED
[INFO] Apache CloudStack Plugin - Network Elastic Load Balancer SKIPPED
[INFO] Apache CloudStack Plugin - Network Internal Load Balancer SKIPPED
[INFO] Apache CloudStack Framework - Spring Life Cycle ... SUCCESS [6.302s]
[INFO] Apache CloudStack Plugin - Network Juniper Contrail SKIPPED
[INFO] Apache CloudStack Plugin - Palo Alto .............. SKIPPED
[INFO] Apache CloudStack Plugin - Network Netscaler ...... SKIPPED
[INFO] Apache CloudStack Plugin - Network Nicira NVP ..... SKIPPED
[INFO] Apache CloudStack Plugin - BigSwitch Virtual Network Segment SKIPPED
[INFO] Apache CloudStack Plugin - Network Brocade VCS .... SKIPPED
[INFO] Apache CloudStack Plugin - Midokura Midonet ....... SKIPPED
[INFO] Apache CloudStack Plugin - Stratosphere SSP ....... SKIPPED
[INFO] Apache CloudStack Plugin - Network Opendaylight ... SKIPPED
[INFO] Apache CloudStack Plugin - Storage Allocator Random SKIPPED
[INFO] Apache CloudStack Plugin - User Authenticator LDAP SKIPPED
[INFO] Apache CloudStack Plugin - User Authenticator MD5 . SKIPPED
[INFO] Apache CloudStack Plugin - User Authenticator Plain Text SKIPPED
[INFO] Apache CloudStack Plugin - User Authenticator SAML2 SKIPPED
[INFO] Apache CloudStack Plugin - User Authenticator SHA256 Salted SKIPPED
[INFO] Apache CloudStack Plugin - Dns Notifier Example ... SKIPPED
[INFO] Apache CloudStack Plugin - Storage Image S3 ....... SKIPPED
[INFO] Apache CloudStack Plugin - Storage Image Swift provider SKIPPED
[INFO] Apache CloudStack Plugin - Storage Image default provider SKIPPED
[INFO] Apache CloudStack Plugin - Storage Image sample provider SKIPPED
[INFO] Apache CloudStack Plugin - Storage Volume Nexenta Provider SKIPPED
[INFO] Apache CloudStack Plugin - Storage Volume CloudByte Provider SKIPPED
[INFO] Apache CloudStack Plugin - Storage Volume sample provider SKIPPED
[INFO] Apache CloudStack Plugin - SNMP Alerts ............ SKIPPED
[INFO] Apache CloudStack Plugin - Syslog Alerts .......... SKIPPED
[INFO] Apache CloudStack Plugin - Network VXLAN .......... SKIPPED
[INFO] Apache CloudStack Plugin - GloboDNS ............... SKIPPED
[INFO] Apache CloudStack Framework - Spring Module ....... SUCCESS [27.122s]
[INFO] Apache CloudStack Secondary Storage Controller .... SKIPPED
[INFO] Apache CloudStack Console Proxy - RDP Client ...... SUCCESS [40.837s]
[INFO] Apache CloudStack Console Proxy ................... SUCCESS [10.897s]
[INFO] Apache CloudStack Console Proxy - Server .......... SUCCESS [22.432s]
[INFO] Apache CloudStack System VM ....................... SKIPPED
[INFO] Apache CloudStack Client UI ....................... SKIPPED
[INFO] Apache CloudStack Framework - QuickCloud .......... SUCCESS [2.744s]
[INFO] Apache CloudStack AWS API Bridge .................. SKIPPED
[INFO] ------------------------------------------------------------------------
[INFO] BUILD FAILURE
[INFO] ------------------------------------------------------------------------
[INFO] Total time: 2:54.664s (Wall Clock)
[INFO] Finished at: Tue Oct 14 17:25:53 EDT 2014
[INFO] Final Memory: 47M/283M
[INFO] ------------------------------------------------------------------------
[ERROR] Failed to execute goal com.mycila:license-maven-plugin:2.5:check (cloudstack-checklicence) on project cloud-core: Some files do not have the expected license header -> [Help 1]
[ERROR]
[ERROR] To see the full stack trace of the errors, re-run Maven with the -e switch.
[ERROR] Re-run Maven using the -X switch to enable full debug logging.
[ERROR]
[ERROR] For more information about the errors and possible solutions, please read the following articles:
[ERROR] [Help 1] http://cwiki.apache.org/confluence/display/MAVEN/MojoExecutionException
[ERROR]
[ERROR] After correcting the problems, you can resume the build with the command
[ERROR] mvn <goals> -rf :cloud-core
Build step 'Invoke top-level Maven targets' marked build as failure
Recording test results
Build failed in Jenkins: build-4.5 #18
Posted by je...@cloudstack.org.
See <http://jenkins.buildacloud.org/job/build-4.5/18/changes>
Changes:
[min.chen] CLOUDSTACK-7563: Fix potential NPE from FingBugs.
------------------------------------------
[...truncated 1271 lines...]
[INFO] Deleting <http://jenkins.buildacloud.org/job/build-4.5/ws/engine/api> (includes = [target, dist], excludes = [])
[INFO]
[INFO] --- maven-checkstyle-plugin:2.11:check (cloudstack-checkstyle) @ cloud-engine-api ---
[INFO] Starting audit...
Audit done.
[INFO]
[INFO] --- maven-remote-resources-plugin:1.3:process (default) @ cloud-framework-security ---
[INFO] Starting audit...
Audit done.
[INFO]
[INFO] --- maven-remote-resources-plugin:1.3:process (default) @ cloud-engine-api ---
[INFO]
[INFO] --- maven-resources-plugin:2.5:resources (default-resources) @ cloud-framework-security ---
[debug] execute contextualize
[INFO] Using 'UTF-8' encoding to copy filtered resources.
[INFO] Copying 1 resource
[INFO] Copying 3 resources
[INFO]
[INFO] --- maven-compiler-plugin:2.5.1:compile (default-compile) @ cloud-framework-security ---
[INFO] Compiling 7 source files to <http://jenkins.buildacloud.org/job/build-4.5/ws/framework/security/target/classes>
[INFO]
[INFO] --- maven-resources-plugin:2.5:resources (default-resources) @ cloud-engine-api ---
[debug] execute contextualize
[INFO] Using 'UTF-8' encoding to copy filtered resources.
[INFO] Copying 1 resource
[INFO] Copying 3 resources
[INFO]
[INFO] --- maven-compiler-plugin:2.5.1:compile (default-compile) @ cloud-engine-api ---
[INFO] Compiling 107 source files to <http://jenkins.buildacloud.org/job/build-4.5/ws/engine/api/target/classes>
[INFO]
[INFO] --- maven-resources-plugin:2.5:testResources (default-testResources) @ cloud-framework-security ---
[debug] execute contextualize
[INFO] Using 'UTF-8' encoding to copy filtered resources.
[INFO] skip non existing resourceDirectory <http://jenkins.buildacloud.org/job/build-4.5/ws/framework/security/test/resources>
[INFO] Copying 3 resources
[INFO]
[INFO] --- maven-compiler-plugin:2.5.1:testCompile (default-testCompile) @ cloud-framework-security ---
[INFO] No sources to compile
[INFO]
[INFO] --- maven-surefire-plugin:2.12:test (default-test) @ cloud-framework-security ---
[INFO] Surefire report directory: <http://jenkins.buildacloud.org/job/build-4.5/ws/framework/security/target/surefire-reports>
-------------------------------------------------------
T E S T S
-------------------------------------------------------
Results :
Tests run: 0, Failures: 0, Errors: 0, Skipped: 0
[INFO]
[INFO] --- maven-resources-plugin:2.5:testResources (default-testResources) @ cloud-engine-api ---
[debug] execute contextualize
[INFO] Using 'UTF-8' encoding to copy filtered resources.
[INFO] skip non existing resourceDirectory <http://jenkins.buildacloud.org/job/build-4.5/ws/engine/api/test/resources>
[INFO] Copying 3 resources
[INFO]
[INFO] --- maven-compiler-plugin:2.5.1:testCompile (default-testCompile) @ cloud-engine-api ---
[INFO] Compiling 2 source files to <http://jenkins.buildacloud.org/job/build-4.5/ws/engine/api/target/test-classes>
[INFO]
[INFO] --- maven-surefire-plugin:2.12:test (default-test) @ cloud-engine-api ---
[INFO] Surefire report directory: <http://jenkins.buildacloud.org/job/build-4.5/ws/engine/api/target/surefire-reports>
-------------------------------------------------------
T E S T S
-------------------------------------------------------
Running org.apache.cloudstack.engine.subsystem.api.storage.ScopeTest
Tests run: 3, Failures: 0, Errors: 0, Skipped: 0, Time elapsed: 0.359 sec
Running org.apache.cloudstack.engine.subsystem.api.storage.type.VolumeTypeHelperTest
Tests run: 8, Failures: 0, Errors: 0, Skipped: 0, Time elapsed: 0.087 sec
Results :
Tests run: 11, Failures: 0, Errors: 0, Skipped: 0
[INFO]
[INFO] ------------------------------------------------------------------------
[INFO] Building Apache CloudStack Core 4.5.0-SNAPSHOT
[INFO] ------------------------------------------------------------------------
[INFO]
[INFO] ------------------------------------------------------------------------
[INFO] Building Apache CloudStack Cloud Engine Schema Component 4.5.0-SNAPSHOT
[INFO] ------------------------------------------------------------------------
[INFO]
[INFO] --- maven-clean-plugin:2.5:clean (default-clean) @ cloud-engine-schema ---
[INFO] Deleting <http://jenkins.buildacloud.org/job/build-4.5/ws/engine/schema/target> (includes = [**/*], excludes = [])
[INFO]
[INFO] --- maven-clean-plugin:2.5:clean (default-clean) @ cloud-core ---
[INFO] Deleting <http://jenkins.buildacloud.org/job/build-4.5/ws/core/target> (includes = [**/*], excludes = [])
[INFO] Deleting <http://jenkins.buildacloud.org/job/build-4.5/ws/core> (includes = [target, dist], excludes = [])
[INFO]
[INFO] --- maven-checkstyle-plugin:2.11:check (cloudstack-checkstyle) @ cloud-core ---
[INFO] Deleting <http://jenkins.buildacloud.org/job/build-4.5/ws/engine/schema> (includes = [target, dist], excludes = [])
[INFO]
[INFO] --- maven-checkstyle-plugin:2.11:check (cloudstack-checkstyle) @ cloud-engine-schema ---
[INFO] Starting audit...
Audit done.
[INFO]
[INFO] --- maven-remote-resources-plugin:1.3:process (default) @ cloud-core ---
[INFO]
[INFO] --- maven-resources-plugin:2.5:resources (default-resources) @ cloud-core ---
[debug] execute contextualize
[INFO] Using 'UTF-8' encoding to copy filtered resources.
[INFO] Copying 26 resources
[INFO] Copying 3 resources
[INFO]
[INFO] --- maven-compiler-plugin:2.5.1:compile (default-compile) @ cloud-core ---
[INFO] Compiling 331 source files to <http://jenkins.buildacloud.org/job/build-4.5/ws/core/target/classes>
[INFO] Starting audit...
Audit done.
[INFO]
[INFO] --- maven-remote-resources-plugin:1.3:process (default) @ cloud-engine-schema ---
[INFO]
[INFO] --- maven-resources-plugin:2.5:resources (default-resources) @ cloud-engine-schema ---
[debug] execute contextualize
[INFO] Using 'UTF-8' encoding to copy filtered resources.
[INFO] Copying 2 resources
[INFO] Copying 3 resources
[INFO]
[INFO] --- maven-compiler-plugin:2.5.1:compile (default-compile) @ cloud-engine-schema ---
[INFO] Compiling 660 source files to <http://jenkins.buildacloud.org/job/build-4.5/ws/engine/schema/target/classes>
[INFO]
[INFO] --- license-maven-plugin:2.5:check (cloudstack-checklicence) @ cloud-core ---
[INFO] Checking licenses...
[WARNING] Missing header in: <http://jenkins.buildacloud.org/job/build-4.5/ws/core/src/com/cloud/agent/api/baremetal/PrepareKickstartPxeServerCommand.java>
[INFO] ------------------------------------------------------------------------
[INFO] Reactor Summary:
[INFO]
[INFO] Apache CloudStack Developer Tools - Checkstyle Configuration SUCCESS [2.539s]
[INFO] Apache CloudStack ................................. SUCCESS [3.019s]
[INFO] Apache CloudStack Maven Conventions Parent ........ SUCCESS [7.193s]
[INFO] Apache CloudStack Framework - Managed Context ..... SUCCESS [11.547s]
[INFO] Apache CloudStack Utils ........................... SUCCESS [44.645s]
[INFO] Apache CloudStack Framework ....................... SUCCESS [0.779s]
[INFO] Apache CloudStack Framework - Event Notification .. SUCCESS [51.027s]
[INFO] Apache CloudStack Framework - Configuration ....... SUCCESS [17.309s]
[INFO] Apache CloudStack API ............................. SUCCESS [1:07.037s]
[INFO] Apache CloudStack Framework - REST ................ SUCCESS [22.113s]
[INFO] Apache CloudStack Framework - IPC ................. SUCCESS [31.411s]
[INFO] Apache CloudStack Cloud Engine .................... SUCCESS [0.790s]
[INFO] Apache CloudStack Cloud Engine API ................ SUCCESS [22.121s]
[INFO] Apache CloudStack Framework - Security ............ SUCCESS [15.313s]
[INFO] Apache CloudStack Core ............................ FAILURE [38.184s]
[INFO] Apache CloudStack Agents .......................... SKIPPED
[INFO] Apache CloudStack Framework - Clustering .......... SUCCESS [19.977s]
[INFO] Apache CloudStack Framework - Event Notification .. SUCCESS [17.857s]
[INFO] Apache CloudStack Cloud Engine Schema Component ... SKIPPED
[INFO] Apache CloudStack Framework - Jobs ................ SKIPPED
[INFO] Apache CloudStack Cloud Engine Internal Components API SKIPPED
[INFO] Apache CloudStack Server .......................... SKIPPED
[INFO] Apache CloudStack Usage Server .................... SKIPPED
[INFO] Apache CloudStack Cloud Engine Orchestration Component SKIPPED
[INFO] Apache CloudStack Cloud Services .................. SUCCESS [0.778s]
[INFO] Apache CloudStack Secondary Storage ............... SUCCESS [30.314s]
[INFO] Apache CloudStack Secondary Storage Service ....... SKIPPED
[INFO] Apache CloudStack Engine Storage Component ........ SKIPPED
[INFO] Apache CloudStack Engine Storage Volume Component . SKIPPED
[INFO] Apache CloudStack Engine Storage Image Component .. SKIPPED
[INFO] Apache CloudStack Engine Storage Data Motion Component SKIPPED
[INFO] Apache CloudStack Engine Storage Cache Component .. SKIPPED
[INFO] Apache CloudStack Engine Storage Snapshot Component SKIPPED
[INFO] Apache CloudStack Cloud Engine API ................ SKIPPED
[INFO] Apache CloudStack Cloud Engine Service ............ SKIPPED
[INFO] Apache CloudStack Plugin POM ...................... SKIPPED
[INFO] Apache CloudStack Plugin - API Rate Limit ......... SKIPPED
[INFO] Apache CloudStack Plugin - Storage Volume default provider SKIPPED
[INFO] Apache CloudStack Plugin - Storage Volume SolidFire Provider SKIPPED
[INFO] Apache CloudStack Plugin - API SolidFire .......... SKIPPED
[INFO] Apache CloudStack Plugin - API Discovery .......... SKIPPED
[INFO] Apache CloudStack Plugin - ACL Static Role Based .. SKIPPED
[INFO] Apache CloudStack Plugin - Host Anti-Affinity Processor SKIPPED
[INFO] Apache CloudStack Plugin - Explicit Dedication Processor SKIPPED
[INFO] Apache CloudStack Plugin - User Concentrated Pod Deployment Planner SKIPPED
[INFO] Apache CloudStack Plugin - User Dispersing Deployment Planner SKIPPED
[INFO] Apache CloudStack Plugin - Implicit Dedication Planner SKIPPED
[INFO] Apache CloudStack Plugin - Skip Heurestics Planner SKIPPED
[INFO] Apache CloudStack Plugin - Host Allocator Random .. SKIPPED
[INFO] Apache CloudStack Plugin - Dedicated Resources .... SKIPPED
[INFO] Apache CloudStack Plugin - Hypervisor OracleVM .... SKIPPED
[INFO] Apache CloudStack Plugin - Open vSwitch ........... SKIPPED
[INFO] Apache CloudStack Plugin - Hypervisor XenServer ... SKIPPED
[INFO] Apache CloudStack Plugin - Hypervisor KVM ......... SKIPPED
[INFO] Apache CloudStack Plugin - RabbitMQ Event Bus ..... SKIPPED
[INFO] Apache CloudStack Plugin - In Memory Event Bus .... SKIPPED
[INFO] Apache CloudStack Plugin - Hypervisor Baremetal ... SKIPPED
[INFO] Apache CloudStack Plugin - Hypervisor UCS ......... SKIPPED
[INFO] Apache CloudStack Plugin - Hypervisor Hyper-V ..... SKIPPED
[INFO] Apache CloudStack Plugin - Network Elastic Load Balancer SKIPPED
[INFO] Apache CloudStack Plugin - Network Internal Load Balancer SKIPPED
[INFO] Apache CloudStack Framework - Spring Life Cycle ... SUCCESS [12.088s]
[INFO] Apache CloudStack Plugin - Network Juniper Contrail SKIPPED
[INFO] Apache CloudStack Plugin - Palo Alto .............. SKIPPED
[INFO] Apache CloudStack Plugin - Network Netscaler ...... SKIPPED
[INFO] Apache CloudStack Plugin - Network Nicira NVP ..... SKIPPED
[INFO] Apache CloudStack Plugin - BigSwitch Virtual Network Segment SKIPPED
[INFO] Apache CloudStack Plugin - Network Brocade VCS .... SKIPPED
[INFO] Apache CloudStack Plugin - Midokura Midonet ....... SKIPPED
[INFO] Apache CloudStack Plugin - Stratosphere SSP ....... SKIPPED
[INFO] Apache CloudStack Plugin - Network Opendaylight ... SKIPPED
[INFO] Apache CloudStack Plugin - Storage Allocator Random SKIPPED
[INFO] Apache CloudStack Plugin - User Authenticator LDAP SKIPPED
[INFO] Apache CloudStack Plugin - User Authenticator MD5 . SKIPPED
[INFO] Apache CloudStack Plugin - User Authenticator Plain Text SKIPPED
[INFO] Apache CloudStack Plugin - User Authenticator SAML2 SKIPPED
[INFO] Apache CloudStack Plugin - User Authenticator SHA256 Salted SKIPPED
[INFO] Apache CloudStack Plugin - Dns Notifier Example ... SKIPPED
[INFO] Apache CloudStack Plugin - Storage Image S3 ....... SKIPPED
[INFO] Apache CloudStack Plugin - Storage Image Swift provider SKIPPED
[INFO] Apache CloudStack Plugin - Storage Image default provider SKIPPED
[INFO] Apache CloudStack Plugin - Storage Image sample provider SKIPPED
[INFO] Apache CloudStack Plugin - Storage Volume Nexenta Provider SKIPPED
[INFO] Apache CloudStack Plugin - Storage Volume CloudByte Provider SKIPPED
[INFO] Apache CloudStack Plugin - Storage Volume sample provider SKIPPED
[INFO] Apache CloudStack Plugin - SNMP Alerts ............ SKIPPED
[INFO] Apache CloudStack Plugin - Syslog Alerts .......... SKIPPED
[INFO] Apache CloudStack Plugin - Network VXLAN .......... SKIPPED
[INFO] Apache CloudStack Plugin - GloboDNS ............... SKIPPED
[INFO] Apache CloudStack Framework - Spring Module ....... SUCCESS [50.706s]
[INFO] Apache CloudStack Secondary Storage Controller .... SKIPPED
[INFO] Apache CloudStack Console Proxy - RDP Client ...... SUCCESS [1:04.718s]
[INFO] Apache CloudStack Console Proxy ................... SUCCESS [29.976s]
[INFO] Apache CloudStack Console Proxy - Server .......... SUCCESS [40.035s]
[INFO] Apache CloudStack System VM ....................... SKIPPED
[INFO] Apache CloudStack Client UI ....................... SKIPPED
[INFO] Apache CloudStack Framework - QuickCloud .......... SUCCESS [2.380s]
[INFO] Apache CloudStack AWS API Bridge .................. SKIPPED
[INFO] ------------------------------------------------------------------------
[INFO] BUILD FAILURE
[INFO] ------------------------------------------------------------------------
[INFO] Total time: 5:32.459s (Wall Clock)
[INFO] Finished at: Tue Oct 14 14:38:31 EDT 2014
[INFO] Final Memory: 47M/284M
[INFO] ------------------------------------------------------------------------
[ERROR] Failed to execute goal com.mycila:license-maven-plugin:2.5:check (cloudstack-checklicence) on project cloud-core: Some files do not have the expected license header -> [Help 1]
[ERROR]
[ERROR] To see the full stack trace of the errors, re-run Maven with the -e switch.
[ERROR] Re-run Maven using the -X switch to enable full debug logging.
[ERROR]
[ERROR] For more information about the errors and possible solutions, please read the following articles:
[ERROR] [Help 1] http://cwiki.apache.org/confluence/display/MAVEN/MojoExecutionException
[ERROR]
[ERROR] After correcting the problems, you can resume the build with the command
[ERROR] mvn <goals> -rf :cloud-core
Build step 'Invoke top-level Maven targets' marked build as failure
Recording test results
Build failed in Jenkins: build-4.5 #17
Posted by je...@cloudstack.org.
See <http://jenkins.buildacloud.org/job/build-4.5/17/changes>
Changes:
[sanjay.tripathi] CLOUDSTACK-6650: Reorder Cluster list in deployment planner to protect
------------------------------------------
[...truncated 1271 lines...]
[INFO] Deleting <http://jenkins.buildacloud.org/job/build-4.5/ws/engine/api> (includes = [target, dist], excludes = [])
[INFO]
[INFO] --- maven-checkstyle-plugin:2.11:check (cloudstack-checkstyle) @ cloud-engine-api ---
[INFO] Starting audit...
Audit done.
[INFO]
[INFO] --- maven-remote-resources-plugin:1.3:process (default) @ cloud-framework-security ---
[INFO] Starting audit...
Audit done.
[INFO]
[INFO] --- maven-remote-resources-plugin:1.3:process (default) @ cloud-engine-api ---
[INFO]
[INFO] --- maven-resources-plugin:2.5:resources (default-resources) @ cloud-framework-security ---
[debug] execute contextualize
[INFO] Using 'UTF-8' encoding to copy filtered resources.
[INFO] Copying 1 resource
[INFO] Copying 3 resources
[INFO]
[INFO] --- maven-compiler-plugin:2.5.1:compile (default-compile) @ cloud-framework-security ---
[INFO] Compiling 7 source files to <http://jenkins.buildacloud.org/job/build-4.5/ws/framework/security/target/classes>
[INFO]
[INFO] --- maven-resources-plugin:2.5:resources (default-resources) @ cloud-engine-api ---
[debug] execute contextualize
[INFO] Using 'UTF-8' encoding to copy filtered resources.
[INFO] Copying 1 resource
[INFO] Copying 3 resources
[INFO]
[INFO] --- maven-compiler-plugin:2.5.1:compile (default-compile) @ cloud-engine-api ---
[INFO] Compiling 107 source files to <http://jenkins.buildacloud.org/job/build-4.5/ws/engine/api/target/classes>
[INFO]
[INFO] --- maven-resources-plugin:2.5:testResources (default-testResources) @ cloud-framework-security ---
[debug] execute contextualize
[INFO] Using 'UTF-8' encoding to copy filtered resources.
[INFO] skip non existing resourceDirectory <http://jenkins.buildacloud.org/job/build-4.5/ws/framework/security/test/resources>
[INFO] Copying 3 resources
[INFO]
[INFO] --- maven-compiler-plugin:2.5.1:testCompile (default-testCompile) @ cloud-framework-security ---
[INFO] No sources to compile
[INFO]
[INFO] --- maven-surefire-plugin:2.12:test (default-test) @ cloud-framework-security ---
[INFO] Surefire report directory: <http://jenkins.buildacloud.org/job/build-4.5/ws/framework/security/target/surefire-reports>
-------------------------------------------------------
T E S T S
-------------------------------------------------------
Results :
Tests run: 0, Failures: 0, Errors: 0, Skipped: 0
[INFO]
[INFO] --- maven-resources-plugin:2.5:testResources (default-testResources) @ cloud-engine-api ---
[debug] execute contextualize
[INFO] Using 'UTF-8' encoding to copy filtered resources.
[INFO] skip non existing resourceDirectory <http://jenkins.buildacloud.org/job/build-4.5/ws/engine/api/test/resources>
[INFO] Copying 3 resources
[INFO]
[INFO] --- maven-compiler-plugin:2.5.1:testCompile (default-testCompile) @ cloud-engine-api ---
[INFO] Compiling 2 source files to <http://jenkins.buildacloud.org/job/build-4.5/ws/engine/api/target/test-classes>
[INFO]
[INFO] --- maven-surefire-plugin:2.12:test (default-test) @ cloud-engine-api ---
[INFO] Surefire report directory: <http://jenkins.buildacloud.org/job/build-4.5/ws/engine/api/target/surefire-reports>
-------------------------------------------------------
T E S T S
-------------------------------------------------------
Running org.apache.cloudstack.engine.subsystem.api.storage.ScopeTest
Tests run: 3, Failures: 0, Errors: 0, Skipped: 0, Time elapsed: 0.165 sec
Running org.apache.cloudstack.engine.subsystem.api.storage.type.VolumeTypeHelperTest
Tests run: 8, Failures: 0, Errors: 0, Skipped: 0, Time elapsed: 0.035 sec
Results :
Tests run: 11, Failures: 0, Errors: 0, Skipped: 0
[INFO]
[INFO] ------------------------------------------------------------------------
[INFO] Building Apache CloudStack Core 4.5.0-SNAPSHOT
[INFO] ------------------------------------------------------------------------
[INFO]
[INFO] ------------------------------------------------------------------------
[INFO] Building Apache CloudStack Cloud Engine Schema Component 4.5.0-SNAPSHOT
[INFO] ------------------------------------------------------------------------
[INFO]
[INFO] --- maven-clean-plugin:2.5:clean (default-clean) @ cloud-core ---
[INFO] Deleting <http://jenkins.buildacloud.org/job/build-4.5/ws/core/target> (includes = [**/*], excludes = [])
[INFO]
[INFO] --- maven-clean-plugin:2.5:clean (default-clean) @ cloud-engine-schema ---
[INFO] Deleting <http://jenkins.buildacloud.org/job/build-4.5/ws/engine/schema/target> (includes = [**/*], excludes = [])
[INFO] Deleting <http://jenkins.buildacloud.org/job/build-4.5/ws/core> (includes = [target, dist], excludes = [])
[INFO]
[INFO] --- maven-checkstyle-plugin:2.11:check (cloudstack-checkstyle) @ cloud-core ---
[INFO] Deleting <http://jenkins.buildacloud.org/job/build-4.5/ws/engine/schema> (includes = [target, dist], excludes = [])
[INFO]
[INFO] --- maven-checkstyle-plugin:2.11:check (cloudstack-checkstyle) @ cloud-engine-schema ---
[INFO] Starting audit...
Audit done.
[INFO]
[INFO] --- maven-remote-resources-plugin:1.3:process (default) @ cloud-core ---
[INFO]
[INFO] --- maven-resources-plugin:2.5:resources (default-resources) @ cloud-core ---
[debug] execute contextualize
[INFO] Using 'UTF-8' encoding to copy filtered resources.
[INFO] Copying 26 resources
[INFO] Copying 3 resources
[INFO]
[INFO] --- maven-compiler-plugin:2.5.1:compile (default-compile) @ cloud-core ---
[INFO] Compiling 331 source files to <http://jenkins.buildacloud.org/job/build-4.5/ws/core/target/classes>
[INFO] Starting audit...
Audit done.
[INFO]
[INFO] --- maven-remote-resources-plugin:1.3:process (default) @ cloud-engine-schema ---
[INFO]
[INFO] --- maven-resources-plugin:2.5:resources (default-resources) @ cloud-engine-schema ---
[debug] execute contextualize
[INFO] Using 'UTF-8' encoding to copy filtered resources.
[INFO] Copying 2 resources
[INFO] Copying 3 resources
[INFO]
[INFO] --- maven-compiler-plugin:2.5.1:compile (default-compile) @ cloud-engine-schema ---
[INFO] Compiling 660 source files to <http://jenkins.buildacloud.org/job/build-4.5/ws/engine/schema/target/classes>
[INFO]
[INFO] --- license-maven-plugin:2.5:check (cloudstack-checklicence) @ cloud-core ---
[INFO] Checking licenses...
[WARNING] Missing header in: <http://jenkins.buildacloud.org/job/build-4.5/ws/core/src/com/cloud/agent/api/baremetal/PrepareKickstartPxeServerCommand.java>
[INFO] ------------------------------------------------------------------------
[INFO] Reactor Summary:
[INFO]
[INFO] Apache CloudStack Developer Tools - Checkstyle Configuration SUCCESS [1.960s]
[INFO] Apache CloudStack ................................. SUCCESS [1.296s]
[INFO] Apache CloudStack Maven Conventions Parent ........ SUCCESS [5.003s]
[INFO] Apache CloudStack Framework - Managed Context ..... SUCCESS [9.954s]
[INFO] Apache CloudStack Utils ........................... SUCCESS [26.122s]
[INFO] Apache CloudStack Framework ....................... SUCCESS [1.190s]
[INFO] Apache CloudStack Framework - Event Notification .. SUCCESS [33.865s]
[INFO] Apache CloudStack Framework - Configuration ....... SUCCESS [8.943s]
[INFO] Apache CloudStack API ............................. SUCCESS [28.532s]
[INFO] Apache CloudStack Framework - REST ................ SUCCESS [16.591s]
[INFO] Apache CloudStack Framework - IPC ................. SUCCESS [12.126s]
[INFO] Apache CloudStack Cloud Engine .................... SUCCESS [1.387s]
[INFO] Apache CloudStack Cloud Engine API ................ SUCCESS [10.094s]
[INFO] Apache CloudStack Framework - Security ............ SUCCESS [6.398s]
[INFO] Apache CloudStack Core ............................ FAILURE [16.711s]
[INFO] Apache CloudStack Agents .......................... SKIPPED
[INFO] Apache CloudStack Framework - Clustering .......... SUCCESS [7.185s]
[INFO] Apache CloudStack Framework - Event Notification .. SUCCESS [11.642s]
[INFO] Apache CloudStack Cloud Engine Schema Component ... SKIPPED
[INFO] Apache CloudStack Framework - Jobs ................ SKIPPED
[INFO] Apache CloudStack Cloud Engine Internal Components API SKIPPED
[INFO] Apache CloudStack Server .......................... SKIPPED
[INFO] Apache CloudStack Usage Server .................... SKIPPED
[INFO] Apache CloudStack Cloud Engine Orchestration Component SKIPPED
[INFO] Apache CloudStack Cloud Services .................. SUCCESS [1.383s]
[INFO] Apache CloudStack Secondary Storage ............... SUCCESS [12.763s]
[INFO] Apache CloudStack Secondary Storage Service ....... SKIPPED
[INFO] Apache CloudStack Engine Storage Component ........ SKIPPED
[INFO] Apache CloudStack Engine Storage Volume Component . SKIPPED
[INFO] Apache CloudStack Engine Storage Image Component .. SKIPPED
[INFO] Apache CloudStack Engine Storage Data Motion Component SKIPPED
[INFO] Apache CloudStack Engine Storage Cache Component .. SKIPPED
[INFO] Apache CloudStack Engine Storage Snapshot Component SKIPPED
[INFO] Apache CloudStack Cloud Engine API ................ SKIPPED
[INFO] Apache CloudStack Cloud Engine Service ............ SKIPPED
[INFO] Apache CloudStack Plugin POM ...................... SKIPPED
[INFO] Apache CloudStack Plugin - API Rate Limit ......... SKIPPED
[INFO] Apache CloudStack Plugin - Storage Volume default provider SKIPPED
[INFO] Apache CloudStack Plugin - Storage Volume SolidFire Provider SKIPPED
[INFO] Apache CloudStack Plugin - API SolidFire .......... SKIPPED
[INFO] Apache CloudStack Plugin - API Discovery .......... SKIPPED
[INFO] Apache CloudStack Plugin - ACL Static Role Based .. SKIPPED
[INFO] Apache CloudStack Plugin - Host Anti-Affinity Processor SKIPPED
[INFO] Apache CloudStack Plugin - Explicit Dedication Processor SKIPPED
[INFO] Apache CloudStack Plugin - User Concentrated Pod Deployment Planner SKIPPED
[INFO] Apache CloudStack Plugin - User Dispersing Deployment Planner SKIPPED
[INFO] Apache CloudStack Plugin - Implicit Dedication Planner SKIPPED
[INFO] Apache CloudStack Plugin - Skip Heurestics Planner SKIPPED
[INFO] Apache CloudStack Plugin - Host Allocator Random .. SKIPPED
[INFO] Apache CloudStack Plugin - Dedicated Resources .... SKIPPED
[INFO] Apache CloudStack Plugin - Hypervisor OracleVM .... SKIPPED
[INFO] Apache CloudStack Plugin - Open vSwitch ........... SKIPPED
[INFO] Apache CloudStack Plugin - Hypervisor XenServer ... SKIPPED
[INFO] Apache CloudStack Plugin - Hypervisor KVM ......... SKIPPED
[INFO] Apache CloudStack Plugin - RabbitMQ Event Bus ..... SKIPPED
[INFO] Apache CloudStack Plugin - In Memory Event Bus .... SKIPPED
[INFO] Apache CloudStack Plugin - Hypervisor Baremetal ... SKIPPED
[INFO] Apache CloudStack Plugin - Hypervisor UCS ......... SKIPPED
[INFO] Apache CloudStack Plugin - Hypervisor Hyper-V ..... SKIPPED
[INFO] Apache CloudStack Plugin - Network Elastic Load Balancer SKIPPED
[INFO] Apache CloudStack Plugin - Network Internal Load Balancer SKIPPED
[INFO] Apache CloudStack Framework - Spring Life Cycle ... SUCCESS [6.007s]
[INFO] Apache CloudStack Plugin - Network Juniper Contrail SKIPPED
[INFO] Apache CloudStack Plugin - Palo Alto .............. SKIPPED
[INFO] Apache CloudStack Plugin - Network Netscaler ...... SKIPPED
[INFO] Apache CloudStack Plugin - Network Nicira NVP ..... SKIPPED
[INFO] Apache CloudStack Plugin - BigSwitch Virtual Network Segment SKIPPED
[INFO] Apache CloudStack Plugin - Network Brocade VCS .... SKIPPED
[INFO] Apache CloudStack Plugin - Midokura Midonet ....... SKIPPED
[INFO] Apache CloudStack Plugin - Stratosphere SSP ....... SKIPPED
[INFO] Apache CloudStack Plugin - Network Opendaylight ... SKIPPED
[INFO] Apache CloudStack Plugin - Storage Allocator Random SKIPPED
[INFO] Apache CloudStack Plugin - User Authenticator LDAP SKIPPED
[INFO] Apache CloudStack Plugin - User Authenticator MD5 . SKIPPED
[INFO] Apache CloudStack Plugin - User Authenticator Plain Text SKIPPED
[INFO] Apache CloudStack Plugin - User Authenticator SAML2 SKIPPED
[INFO] Apache CloudStack Plugin - User Authenticator SHA256 Salted SKIPPED
[INFO] Apache CloudStack Plugin - Dns Notifier Example ... SKIPPED
[INFO] Apache CloudStack Plugin - Storage Image S3 ....... SKIPPED
[INFO] Apache CloudStack Plugin - Storage Image Swift provider SKIPPED
[INFO] Apache CloudStack Plugin - Storage Image default provider SKIPPED
[INFO] Apache CloudStack Plugin - Storage Image sample provider SKIPPED
[INFO] Apache CloudStack Plugin - Storage Volume Nexenta Provider SKIPPED
[INFO] Apache CloudStack Plugin - Storage Volume CloudByte Provider SKIPPED
[INFO] Apache CloudStack Plugin - Storage Volume sample provider SKIPPED
[INFO] Apache CloudStack Plugin - SNMP Alerts ............ SKIPPED
[INFO] Apache CloudStack Plugin - Syslog Alerts .......... SKIPPED
[INFO] Apache CloudStack Plugin - Network VXLAN .......... SKIPPED
[INFO] Apache CloudStack Plugin - GloboDNS ............... SKIPPED
[INFO] Apache CloudStack Framework - Spring Module ....... SUCCESS [33.048s]
[INFO] Apache CloudStack Secondary Storage Controller .... SKIPPED
[INFO] Apache CloudStack Console Proxy - RDP Client ...... SUCCESS [37.652s]
[INFO] Apache CloudStack Console Proxy ................... SUCCESS [8.902s]
[INFO] Apache CloudStack Console Proxy - Server .......... SUCCESS [26.722s]
[INFO] Apache CloudStack System VM ....................... SKIPPED
[INFO] Apache CloudStack Client UI ....................... SKIPPED
[INFO] Apache CloudStack Framework - QuickCloud .......... SUCCESS [3.000s]
[INFO] Apache CloudStack AWS API Bridge .................. SKIPPED
[INFO] ------------------------------------------------------------------------
[INFO] BUILD FAILURE
[INFO] ------------------------------------------------------------------------
[INFO] Total time: 2:53.585s (Wall Clock)
[INFO] Finished at: Tue Oct 14 08:26:02 EDT 2014
[INFO] Final Memory: 47M/283M
[INFO] ------------------------------------------------------------------------
[ERROR] Failed to execute goal com.mycila:license-maven-plugin:2.5:check (cloudstack-checklicence) on project cloud-core: Some files do not have the expected license header -> [Help 1]
[ERROR]
[ERROR] To see the full stack trace of the errors, re-run Maven with the -e switch.
[ERROR] Re-run Maven using the -X switch to enable full debug logging.
[ERROR]
[ERROR] For more information about the errors and possible solutions, please read the following articles:
[ERROR] [Help 1] http://cwiki.apache.org/confluence/display/MAVEN/MojoExecutionException
[ERROR]
[ERROR] After correcting the problems, you can resume the build with the command
[ERROR] mvn <goals> -rf :cloud-core
Build step 'Invoke top-level Maven targets' marked build as failure
Recording test results
Build failed in Jenkins: build-4.5 #16
Posted by je...@cloudstack.org.
See <http://jenkins.buildacloud.org/job/build-4.5/16/>
------------------------------------------
[...truncated 1274 lines...]
[INFO] Deleting <http://jenkins.buildacloud.org/job/build-4.5/ws/engine/api> (includes = [target, dist], excludes = [])
[INFO]
[INFO] --- maven-checkstyle-plugin:2.11:check (cloudstack-checkstyle) @ cloud-engine-api ---
[INFO] Starting audit...
Audit done.
[INFO]
[INFO] --- maven-remote-resources-plugin:1.3:process (default) @ cloud-framework-security ---
[INFO] Starting audit...
Audit done.
[INFO]
[INFO] --- maven-remote-resources-plugin:1.3:process (default) @ cloud-engine-api ---
[INFO]
[INFO] --- maven-resources-plugin:2.5:resources (default-resources) @ cloud-framework-security ---
[debug] execute contextualize
[INFO] Using 'UTF-8' encoding to copy filtered resources.
[INFO] Copying 1 resource
[INFO] Copying 3 resources
[INFO]
[INFO] --- maven-compiler-plugin:2.5.1:compile (default-compile) @ cloud-framework-security ---
[INFO] Compiling 7 source files to <http://jenkins.buildacloud.org/job/build-4.5/ws/framework/security/target/classes>
[INFO]
[INFO] --- maven-resources-plugin:2.5:resources (default-resources) @ cloud-engine-api ---
[debug] execute contextualize
[INFO] Using 'UTF-8' encoding to copy filtered resources.
[INFO] Copying 1 resource
[INFO] Copying 3 resources
[INFO]
[INFO] --- maven-compiler-plugin:2.5.1:compile (default-compile) @ cloud-engine-api ---
[INFO] Compiling 107 source files to <http://jenkins.buildacloud.org/job/build-4.5/ws/engine/api/target/classes>
[INFO]
[INFO] --- maven-resources-plugin:2.5:testResources (default-testResources) @ cloud-framework-security ---
[debug] execute contextualize
[INFO] Using 'UTF-8' encoding to copy filtered resources.
[INFO] skip non existing resourceDirectory <http://jenkins.buildacloud.org/job/build-4.5/ws/framework/security/test/resources>
[INFO] Copying 3 resources
[INFO]
[INFO] --- maven-compiler-plugin:2.5.1:testCompile (default-testCompile) @ cloud-framework-security ---
[INFO] No sources to compile
[INFO]
[INFO] --- maven-surefire-plugin:2.12:test (default-test) @ cloud-framework-security ---
[INFO] Surefire report directory: <http://jenkins.buildacloud.org/job/build-4.5/ws/framework/security/target/surefire-reports>
-------------------------------------------------------
T E S T S
-------------------------------------------------------
Results :
Tests run: 0, Failures: 0, Errors: 0, Skipped: 0
[INFO]
[INFO] --- maven-resources-plugin:2.5:testResources (default-testResources) @ cloud-engine-api ---
[debug] execute contextualize
[INFO] Using 'UTF-8' encoding to copy filtered resources.
[INFO] skip non existing resourceDirectory <http://jenkins.buildacloud.org/job/build-4.5/ws/engine/api/test/resources>
[INFO] Copying 3 resources
[INFO]
[INFO] --- maven-compiler-plugin:2.5.1:testCompile (default-testCompile) @ cloud-engine-api ---
[INFO] Compiling 2 source files to <http://jenkins.buildacloud.org/job/build-4.5/ws/engine/api/target/test-classes>
[INFO]
[INFO] --- maven-surefire-plugin:2.12:test (default-test) @ cloud-engine-api ---
[INFO] Surefire report directory: <http://jenkins.buildacloud.org/job/build-4.5/ws/engine/api/target/surefire-reports>
-------------------------------------------------------
T E S T S
-------------------------------------------------------
Running org.apache.cloudstack.engine.subsystem.api.storage.ScopeTest
Tests run: 3, Failures: 0, Errors: 0, Skipped: 0, Time elapsed: 0.513 sec
Running org.apache.cloudstack.engine.subsystem.api.storage.type.VolumeTypeHelperTest
Tests run: 8, Failures: 0, Errors: 0, Skipped: 0, Time elapsed: 0.121 sec
Results :
Tests run: 11, Failures: 0, Errors: 0, Skipped: 0
[INFO]
[INFO] ------------------------------------------------------------------------
[INFO] Building Apache CloudStack Core 4.5.0-SNAPSHOT
[INFO] ------------------------------------------------------------------------
[INFO]
[INFO] ------------------------------------------------------------------------
[INFO] Building Apache CloudStack Cloud Engine Schema Component 4.5.0-SNAPSHOT
[INFO] ------------------------------------------------------------------------
[INFO]
[INFO] --- maven-clean-plugin:2.5:clean (default-clean) @ cloud-core ---
[INFO] Deleting <http://jenkins.buildacloud.org/job/build-4.5/ws/core/target> (includes = [**/*], excludes = [])
[INFO]
[INFO] --- maven-clean-plugin:2.5:clean (default-clean) @ cloud-engine-schema ---
[INFO] Deleting <http://jenkins.buildacloud.org/job/build-4.5/ws/engine/schema/target> (includes = [**/*], excludes = [])
[INFO] Deleting <http://jenkins.buildacloud.org/job/build-4.5/ws/core> (includes = [target, dist], excludes = [])
[INFO]
[INFO] --- maven-checkstyle-plugin:2.11:check (cloudstack-checkstyle) @ cloud-core ---
[INFO] Deleting <http://jenkins.buildacloud.org/job/build-4.5/ws/engine/schema> (includes = [target, dist], excludes = [])
[INFO]
[INFO] --- maven-checkstyle-plugin:2.11:check (cloudstack-checkstyle) @ cloud-engine-schema ---
[INFO] Starting audit...
Audit done.
[INFO]
[INFO] --- maven-remote-resources-plugin:1.3:process (default) @ cloud-core ---
[INFO]
[INFO] --- maven-resources-plugin:2.5:resources (default-resources) @ cloud-core ---
[debug] execute contextualize
[INFO] Using 'UTF-8' encoding to copy filtered resources.
[INFO] Copying 26 resources
[INFO] Copying 3 resources
[INFO]
[INFO] --- maven-compiler-plugin:2.5.1:compile (default-compile) @ cloud-core ---
[INFO] Compiling 331 source files to <http://jenkins.buildacloud.org/job/build-4.5/ws/core/target/classes>
[INFO] Starting audit...
Audit done.
[INFO]
[INFO] --- maven-remote-resources-plugin:1.3:process (default) @ cloud-engine-schema ---
[INFO]
[INFO] --- maven-resources-plugin:2.5:resources (default-resources) @ cloud-engine-schema ---
[debug] execute contextualize
[INFO] Using 'UTF-8' encoding to copy filtered resources.
[INFO] Copying 2 resources
[INFO] Copying 3 resources
[INFO]
[INFO] --- maven-compiler-plugin:2.5.1:compile (default-compile) @ cloud-engine-schema ---
[INFO] Compiling 660 source files to <http://jenkins.buildacloud.org/job/build-4.5/ws/engine/schema/target/classes>
[INFO]
[INFO] --- license-maven-plugin:2.5:check (cloudstack-checklicence) @ cloud-core ---
[INFO] Checking licenses...
[WARNING] Missing header in: <http://jenkins.buildacloud.org/job/build-4.5/ws/core/src/com/cloud/agent/api/baremetal/PrepareKickstartPxeServerCommand.java>
[INFO] ------------------------------------------------------------------------
[INFO] Reactor Summary:
[INFO]
[INFO] Apache CloudStack Developer Tools - Checkstyle Configuration SUCCESS [1.813s]
[INFO] Apache CloudStack ................................. SUCCESS [2.274s]
[INFO] Apache CloudStack Maven Conventions Parent ........ SUCCESS [3.998s]
[INFO] Apache CloudStack Framework - Managed Context ..... SUCCESS [13.842s]
[INFO] Apache CloudStack Utils ........................... SUCCESS [33.334s]
[INFO] Apache CloudStack Framework ....................... SUCCESS [0.431s]
[INFO] Apache CloudStack Framework - Event Notification .. SUCCESS [26.687s]
[INFO] Apache CloudStack Framework - Configuration ....... SUCCESS [11.498s]
[INFO] Apache CloudStack API ............................. SUCCESS [1:01.278s]
[INFO] Apache CloudStack Framework - REST ................ SUCCESS [15.900s]
[INFO] Apache CloudStack Framework - IPC ................. SUCCESS [38.071s]
[INFO] Apache CloudStack Cloud Engine .................... SUCCESS [0.405s]
[INFO] Apache CloudStack Cloud Engine API ................ SUCCESS [25.639s]
[INFO] Apache CloudStack Framework - Security ............ SUCCESS [14.862s]
[INFO] Apache CloudStack Core ............................ FAILURE [39.630s]
[INFO] Apache CloudStack Agents .......................... SKIPPED
[INFO] Apache CloudStack Framework - Clustering .......... SUCCESS [22.833s]
[INFO] Apache CloudStack Framework - Event Notification .. SUCCESS [10.881s]
[INFO] Apache CloudStack Cloud Engine Schema Component ... SKIPPED
[INFO] Apache CloudStack Framework - Jobs ................ SKIPPED
[INFO] Apache CloudStack Cloud Engine Internal Components API SKIPPED
[INFO] Apache CloudStack Server .......................... SKIPPED
[INFO] Apache CloudStack Usage Server .................... SKIPPED
[INFO] Apache CloudStack Cloud Engine Orchestration Component SKIPPED
[INFO] Apache CloudStack Cloud Services .................. SUCCESS [0.386s]
[INFO] Apache CloudStack Secondary Storage ............... SUCCESS [8.375s]
[INFO] Apache CloudStack Secondary Storage Service ....... SKIPPED
[INFO] Apache CloudStack Engine Storage Component ........ SKIPPED
[INFO] Apache CloudStack Engine Storage Volume Component . SKIPPED
[INFO] Apache CloudStack Engine Storage Image Component .. SKIPPED
[INFO] Apache CloudStack Engine Storage Data Motion Component SKIPPED
[INFO] Apache CloudStack Engine Storage Cache Component .. SKIPPED
[INFO] Apache CloudStack Engine Storage Snapshot Component SKIPPED
[INFO] Apache CloudStack Cloud Engine API ................ SKIPPED
[INFO] Apache CloudStack Cloud Engine Service ............ SKIPPED
[INFO] Apache CloudStack Plugin POM ...................... SKIPPED
[INFO] Apache CloudStack Plugin - API Rate Limit ......... SKIPPED
[INFO] Apache CloudStack Plugin - Storage Volume default provider SKIPPED
[INFO] Apache CloudStack Plugin - Storage Volume SolidFire Provider SKIPPED
[INFO] Apache CloudStack Plugin - API SolidFire .......... SKIPPED
[INFO] Apache CloudStack Plugin - API Discovery .......... SKIPPED
[INFO] Apache CloudStack Plugin - ACL Static Role Based .. SKIPPED
[INFO] Apache CloudStack Plugin - Host Anti-Affinity Processor SKIPPED
[INFO] Apache CloudStack Plugin - Explicit Dedication Processor SKIPPED
[INFO] Apache CloudStack Plugin - User Concentrated Pod Deployment Planner SKIPPED
[INFO] Apache CloudStack Plugin - User Dispersing Deployment Planner SKIPPED
[INFO] Apache CloudStack Plugin - Implicit Dedication Planner SKIPPED
[INFO] Apache CloudStack Plugin - Skip Heurestics Planner SKIPPED
[INFO] Apache CloudStack Plugin - Host Allocator Random .. SKIPPED
[INFO] Apache CloudStack Plugin - Dedicated Resources .... SKIPPED
[INFO] Apache CloudStack Plugin - Hypervisor OracleVM .... SKIPPED
[INFO] Apache CloudStack Plugin - Open vSwitch ........... SKIPPED
[INFO] Apache CloudStack Plugin - Hypervisor XenServer ... SKIPPED
[INFO] Apache CloudStack Plugin - Hypervisor KVM ......... SKIPPED
[INFO] Apache CloudStack Plugin - RabbitMQ Event Bus ..... SKIPPED
[INFO] Apache CloudStack Plugin - In Memory Event Bus .... SKIPPED
[INFO] Apache CloudStack Plugin - Hypervisor Baremetal ... SKIPPED
[INFO] Apache CloudStack Plugin - Hypervisor UCS ......... SKIPPED
[INFO] Apache CloudStack Plugin - Hypervisor Hyper-V ..... SKIPPED
[INFO] Apache CloudStack Plugin - Network Elastic Load Balancer SKIPPED
[INFO] Apache CloudStack Plugin - Network Internal Load Balancer SKIPPED
[INFO] Apache CloudStack Framework - Spring Life Cycle ... SUCCESS [12.527s]
[INFO] Apache CloudStack Plugin - Network Juniper Contrail SKIPPED
[INFO] Apache CloudStack Plugin - Palo Alto .............. SKIPPED
[INFO] Apache CloudStack Plugin - Network Netscaler ...... SKIPPED
[INFO] Apache CloudStack Plugin - Network Nicira NVP ..... SKIPPED
[INFO] Apache CloudStack Plugin - BigSwitch Virtual Network Segment SKIPPED
[INFO] Apache CloudStack Plugin - Network Brocade VCS .... SKIPPED
[INFO] Apache CloudStack Plugin - Midokura Midonet ....... SKIPPED
[INFO] Apache CloudStack Plugin - Stratosphere SSP ....... SKIPPED
[INFO] Apache CloudStack Plugin - Network Opendaylight ... SKIPPED
[INFO] Apache CloudStack Plugin - Storage Allocator Random SKIPPED
[INFO] Apache CloudStack Plugin - User Authenticator LDAP SKIPPED
[INFO] Apache CloudStack Plugin - User Authenticator MD5 . SKIPPED
[INFO] Apache CloudStack Plugin - User Authenticator Plain Text SKIPPED
[INFO] Apache CloudStack Plugin - User Authenticator SAML2 SKIPPED
[INFO] Apache CloudStack Plugin - User Authenticator SHA256 Salted SKIPPED
[INFO] Apache CloudStack Plugin - Dns Notifier Example ... SKIPPED
[INFO] Apache CloudStack Plugin - Storage Image S3 ....... SKIPPED
[INFO] Apache CloudStack Plugin - Storage Image Swift provider SKIPPED
[INFO] Apache CloudStack Plugin - Storage Image default provider SKIPPED
[INFO] Apache CloudStack Plugin - Storage Image sample provider SKIPPED
[INFO] Apache CloudStack Plugin - Storage Volume Nexenta Provider SKIPPED
[INFO] Apache CloudStack Plugin - Storage Volume CloudByte Provider SKIPPED
[INFO] Apache CloudStack Plugin - Storage Volume sample provider SKIPPED
[INFO] Apache CloudStack Plugin - SNMP Alerts ............ SKIPPED
[INFO] Apache CloudStack Plugin - Syslog Alerts .......... SKIPPED
[INFO] Apache CloudStack Plugin - Network VXLAN .......... SKIPPED
[INFO] Apache CloudStack Plugin - GloboDNS ............... SKIPPED
[INFO] Apache CloudStack Framework - Spring Module ....... SUCCESS [28.828s]
[INFO] Apache CloudStack Secondary Storage Controller .... SKIPPED
[INFO] Apache CloudStack Console Proxy - RDP Client ...... SUCCESS [40.066s]
[INFO] Apache CloudStack Console Proxy ................... SUCCESS [8.100s]
[INFO] Apache CloudStack Console Proxy - Server .......... SUCCESS [21.794s]
[INFO] Apache CloudStack System VM ....................... SKIPPED
[INFO] Apache CloudStack Client UI ....................... SKIPPED
[INFO] Apache CloudStack Framework - QuickCloud .......... SUCCESS [3.386s]
[INFO] Apache CloudStack AWS API Bridge .................. SKIPPED
[INFO] ------------------------------------------------------------------------
[INFO] BUILD FAILURE
[INFO] ------------------------------------------------------------------------
[INFO] Total time: 4:32.951s (Wall Clock)
[INFO] Finished at: Mon Oct 13 21:56:44 EDT 2014
[INFO] Final Memory: 47M/279M
[INFO] ------------------------------------------------------------------------
[ERROR] Failed to execute goal com.mycila:license-maven-plugin:2.5:check (cloudstack-checklicence) on project cloud-core: Some files do not have the expected license header -> [Help 1]
[ERROR]
[ERROR] To see the full stack trace of the errors, re-run Maven with the -e switch.
[ERROR] Re-run Maven using the -X switch to enable full debug logging.
[ERROR]
[ERROR] For more information about the errors and possible solutions, please read the following articles:
[ERROR] [Help 1] http://cwiki.apache.org/confluence/display/MAVEN/MojoExecutionException
[ERROR]
[ERROR] After correcting the problems, you can resume the build with the command
[ERROR] mvn <goals> -rf :cloud-core
Build step 'Invoke top-level Maven targets' marked build as failure
Recording test results
Build failed in Jenkins: build-4.5 #15
Posted by je...@cloudstack.org.
See <http://jenkins.buildacloud.org/job/build-4.5/15/>
------------------------------------------
[...truncated 1248 lines...]
[INFO]
[INFO] --- maven-clean-plugin:2.5:clean (default-clean) @ cloud-engine-api ---
[INFO] Deleting <http://jenkins.buildacloud.org/job/build-4.5/ws/engine/api> (includes = [target, dist], excludes = [])
[INFO]
[INFO] --- maven-checkstyle-plugin:2.11:check (cloudstack-checkstyle) @ cloud-engine-api ---
[INFO] Starting audit...
Audit done.
[INFO]
[INFO] --- maven-remote-resources-plugin:1.3:process (default) @ cloud-framework-security ---
[INFO] Starting audit...
Audit done.
[INFO]
[INFO] --- maven-remote-resources-plugin:1.3:process (default) @ cloud-engine-api ---
[INFO]
[INFO] --- maven-resources-plugin:2.5:resources (default-resources) @ cloud-framework-security ---
[debug] execute contextualize
[INFO] Using 'UTF-8' encoding to copy filtered resources.
[INFO] Copying 1 resource
[INFO] Copying 3 resources
[INFO]
[INFO] --- maven-compiler-plugin:2.5.1:compile (default-compile) @ cloud-framework-security ---
[INFO] Compiling 7 source files to <http://jenkins.buildacloud.org/job/build-4.5/ws/framework/security/target/classes>
[INFO]
[INFO] --- maven-resources-plugin:2.5:resources (default-resources) @ cloud-engine-api ---
[debug] execute contextualize
[INFO] Using 'UTF-8' encoding to copy filtered resources.
[INFO] Copying 1 resource
[INFO] Copying 3 resources
[INFO]
[INFO] --- maven-compiler-plugin:2.5.1:compile (default-compile) @ cloud-engine-api ---
[INFO] Compiling 107 source files to <http://jenkins.buildacloud.org/job/build-4.5/ws/engine/api/target/classes>
[INFO]
[INFO] --- maven-resources-plugin:2.5:testResources (default-testResources) @ cloud-framework-security ---
[debug] execute contextualize
[INFO] Using 'UTF-8' encoding to copy filtered resources.
[INFO] skip non existing resourceDirectory <http://jenkins.buildacloud.org/job/build-4.5/ws/framework/security/test/resources>
[INFO] Copying 3 resources
[INFO]
[INFO] --- maven-compiler-plugin:2.5.1:testCompile (default-testCompile) @ cloud-framework-security ---
[INFO] No sources to compile
[INFO]
[INFO] --- maven-surefire-plugin:2.12:test (default-test) @ cloud-framework-security ---
[INFO] Surefire report directory: <http://jenkins.buildacloud.org/job/build-4.5/ws/framework/security/target/surefire-reports>
-------------------------------------------------------
T E S T S
-------------------------------------------------------
Results :
Tests run: 0, Failures: 0, Errors: 0, Skipped: 0
[INFO]
[INFO] --- maven-resources-plugin:2.5:testResources (default-testResources) @ cloud-engine-api ---
[debug] execute contextualize
[INFO] Using 'UTF-8' encoding to copy filtered resources.
[INFO] skip non existing resourceDirectory <http://jenkins.buildacloud.org/job/build-4.5/ws/engine/api/test/resources>
[INFO] Copying 3 resources
[INFO]
[INFO] --- maven-compiler-plugin:2.5.1:testCompile (default-testCompile) @ cloud-engine-api ---
[INFO] Compiling 2 source files to <http://jenkins.buildacloud.org/job/build-4.5/ws/engine/api/target/test-classes>
[INFO]
[INFO] --- maven-surefire-plugin:2.12:test (default-test) @ cloud-engine-api ---
[INFO] Surefire report directory: <http://jenkins.buildacloud.org/job/build-4.5/ws/engine/api/target/surefire-reports>
-------------------------------------------------------
T E S T S
-------------------------------------------------------
Running org.apache.cloudstack.engine.subsystem.api.storage.ScopeTest
Tests run: 3, Failures: 0, Errors: 0, Skipped: 0, Time elapsed: 0.199 sec
Running org.apache.cloudstack.engine.subsystem.api.storage.type.VolumeTypeHelperTest
Tests run: 8, Failures: 0, Errors: 0, Skipped: 0, Time elapsed: 0.063 sec
Results :
Tests run: 11, Failures: 0, Errors: 0, Skipped: 0
[INFO]
[INFO] ------------------------------------------------------------------------
[INFO] Building Apache CloudStack Core 4.5.0-SNAPSHOT
[INFO] ------------------------------------------------------------------------
[INFO]
[INFO] ------------------------------------------------------------------------
[INFO] Building Apache CloudStack Cloud Engine Schema Component 4.5.0-SNAPSHOT
[INFO] ------------------------------------------------------------------------
[INFO]
[INFO] --- maven-clean-plugin:2.5:clean (default-clean) @ cloud-core ---
[INFO] Deleting <http://jenkins.buildacloud.org/job/build-4.5/ws/core> (includes = [target, dist], excludes = [])
[INFO]
[INFO] --- maven-checkstyle-plugin:2.11:check (cloudstack-checkstyle) @ cloud-core ---
[INFO]
[INFO] --- maven-clean-plugin:2.5:clean (default-clean) @ cloud-engine-schema ---
[INFO] Deleting <http://jenkins.buildacloud.org/job/build-4.5/ws/engine/schema> (includes = [target, dist], excludes = [])
[INFO]
[INFO] --- maven-checkstyle-plugin:2.11:check (cloudstack-checkstyle) @ cloud-engine-schema ---
[INFO] Starting audit...
Audit done.
[INFO]
[INFO] --- maven-remote-resources-plugin:1.3:process (default) @ cloud-core ---
[INFO]
[INFO] --- maven-resources-plugin:2.5:resources (default-resources) @ cloud-core ---
[debug] execute contextualize
[INFO] Using 'UTF-8' encoding to copy filtered resources.
[INFO] Copying 26 resources
[INFO] Copying 3 resources
[INFO]
[INFO] --- maven-compiler-plugin:2.5.1:compile (default-compile) @ cloud-core ---
[INFO] Compiling 331 source files to <http://jenkins.buildacloud.org/job/build-4.5/ws/core/target/classes>
[INFO] Starting audit...
Audit done.
[INFO]
[INFO] --- maven-remote-resources-plugin:1.3:process (default) @ cloud-engine-schema ---
[INFO]
[INFO] --- maven-resources-plugin:2.5:resources (default-resources) @ cloud-engine-schema ---
[debug] execute contextualize
[INFO] Using 'UTF-8' encoding to copy filtered resources.
[INFO] Copying 2 resources
[INFO] Copying 3 resources
[INFO]
[INFO] --- maven-compiler-plugin:2.5.1:compile (default-compile) @ cloud-engine-schema ---
[INFO] Compiling 660 source files to <http://jenkins.buildacloud.org/job/build-4.5/ws/engine/schema/target/classes>
[INFO]
[INFO] --- license-maven-plugin:2.5:check (cloudstack-checklicence) @ cloud-core ---
[INFO] Checking licenses...
[WARNING] Missing header in: <http://jenkins.buildacloud.org/job/build-4.5/ws/core/src/com/cloud/agent/api/baremetal/PrepareKickstartPxeServerCommand.java>
[INFO] ------------------------------------------------------------------------
[INFO] Reactor Summary:
[INFO]
[INFO] Apache CloudStack Developer Tools - Checkstyle Configuration SUCCESS [2.540s]
[INFO] Apache CloudStack ................................. SUCCESS [1.939s]
[INFO] Apache CloudStack Maven Conventions Parent ........ SUCCESS [4.533s]
[INFO] Apache CloudStack Framework - Managed Context ..... SUCCESS [14.943s]
[INFO] Apache CloudStack Utils ........................... SUCCESS [37.368s]
[INFO] Apache CloudStack Framework ....................... SUCCESS [0.681s]
[INFO] Apache CloudStack Framework - Event Notification .. SUCCESS [35.394s]
[INFO] Apache CloudStack Framework - Configuration ....... SUCCESS [9.586s]
[INFO] Apache CloudStack API ............................. SUCCESS [41.510s]
[INFO] Apache CloudStack Framework - REST ................ SUCCESS [18.237s]
[INFO] Apache CloudStack Framework - IPC ................. SUCCESS [15.548s]
[INFO] Apache CloudStack Cloud Engine .................... SUCCESS [0.674s]
[INFO] Apache CloudStack Cloud Engine API ................ SUCCESS [15.770s]
[INFO] Apache CloudStack Framework - Security ............ SUCCESS [10.344s]
[INFO] Apache CloudStack Core ............................ FAILURE [24.286s]
[INFO] Apache CloudStack Agents .......................... SKIPPED
[INFO] Apache CloudStack Framework - Clustering .......... SUCCESS [10.011s]
[INFO] Apache CloudStack Framework - Event Notification .. SUCCESS [10.857s]
[INFO] Apache CloudStack Cloud Engine Schema Component ... SKIPPED
[INFO] Apache CloudStack Framework - Jobs ................ SKIPPED
[INFO] Apache CloudStack Cloud Engine Internal Components API SKIPPED
[INFO] Apache CloudStack Server .......................... SKIPPED
[INFO] Apache CloudStack Usage Server .................... SKIPPED
[INFO] Apache CloudStack Cloud Engine Orchestration Component SKIPPED
[INFO] Apache CloudStack Cloud Services .................. SUCCESS [0.646s]
[INFO] Apache CloudStack Secondary Storage ............... SUCCESS [16.459s]
[INFO] Apache CloudStack Secondary Storage Service ....... SKIPPED
[INFO] Apache CloudStack Engine Storage Component ........ SKIPPED
[INFO] Apache CloudStack Engine Storage Volume Component . SKIPPED
[INFO] Apache CloudStack Engine Storage Image Component .. SKIPPED
[INFO] Apache CloudStack Engine Storage Data Motion Component SKIPPED
[INFO] Apache CloudStack Engine Storage Cache Component .. SKIPPED
[INFO] Apache CloudStack Engine Storage Snapshot Component SKIPPED
[INFO] Apache CloudStack Cloud Engine API ................ SKIPPED
[INFO] Apache CloudStack Cloud Engine Service ............ SKIPPED
[INFO] Apache CloudStack Plugin POM ...................... SKIPPED
[INFO] Apache CloudStack Plugin - API Rate Limit ......... SKIPPED
[INFO] Apache CloudStack Plugin - Storage Volume default provider SKIPPED
[INFO] Apache CloudStack Plugin - Storage Volume SolidFire Provider SKIPPED
[INFO] Apache CloudStack Plugin - API SolidFire .......... SKIPPED
[INFO] Apache CloudStack Plugin - API Discovery .......... SKIPPED
[INFO] Apache CloudStack Plugin - ACL Static Role Based .. SKIPPED
[INFO] Apache CloudStack Plugin - Host Anti-Affinity Processor SKIPPED
[INFO] Apache CloudStack Plugin - Explicit Dedication Processor SKIPPED
[INFO] Apache CloudStack Plugin - User Concentrated Pod Deployment Planner SKIPPED
[INFO] Apache CloudStack Plugin - User Dispersing Deployment Planner SKIPPED
[INFO] Apache CloudStack Plugin - Implicit Dedication Planner SKIPPED
[INFO] Apache CloudStack Plugin - Skip Heurestics Planner SKIPPED
[INFO] Apache CloudStack Plugin - Host Allocator Random .. SKIPPED
[INFO] Apache CloudStack Plugin - Dedicated Resources .... SKIPPED
[INFO] Apache CloudStack Plugin - Hypervisor OracleVM .... SKIPPED
[INFO] Apache CloudStack Plugin - Open vSwitch ........... SKIPPED
[INFO] Apache CloudStack Plugin - Hypervisor XenServer ... SKIPPED
[INFO] Apache CloudStack Plugin - Hypervisor KVM ......... SKIPPED
[INFO] Apache CloudStack Plugin - RabbitMQ Event Bus ..... SKIPPED
[INFO] Apache CloudStack Plugin - In Memory Event Bus .... SKIPPED
[INFO] Apache CloudStack Plugin - Hypervisor Baremetal ... SKIPPED
[INFO] Apache CloudStack Plugin - Hypervisor UCS ......... SKIPPED
[INFO] Apache CloudStack Plugin - Hypervisor Hyper-V ..... SKIPPED
[INFO] Apache CloudStack Plugin - Network Elastic Load Balancer SKIPPED
[INFO] Apache CloudStack Plugin - Network Internal Load Balancer SKIPPED
[INFO] Apache CloudStack Framework - Spring Life Cycle ... SUCCESS [9.566s]
[INFO] Apache CloudStack Plugin - Network Juniper Contrail SKIPPED
[INFO] Apache CloudStack Plugin - Palo Alto .............. SKIPPED
[INFO] Apache CloudStack Plugin - Network Netscaler ...... SKIPPED
[INFO] Apache CloudStack Plugin - Network Nicira NVP ..... SKIPPED
[INFO] Apache CloudStack Plugin - BigSwitch Virtual Network Segment SKIPPED
[INFO] Apache CloudStack Plugin - Network Brocade VCS .... SKIPPED
[INFO] Apache CloudStack Plugin - Midokura Midonet ....... SKIPPED
[INFO] Apache CloudStack Plugin - Stratosphere SSP ....... SKIPPED
[INFO] Apache CloudStack Plugin - Network Opendaylight ... SKIPPED
[INFO] Apache CloudStack Plugin - Storage Allocator Random SKIPPED
[INFO] Apache CloudStack Plugin - User Authenticator LDAP SKIPPED
[INFO] Apache CloudStack Plugin - User Authenticator MD5 . SKIPPED
[INFO] Apache CloudStack Plugin - User Authenticator Plain Text SKIPPED
[INFO] Apache CloudStack Plugin - User Authenticator SAML2 SKIPPED
[INFO] Apache CloudStack Plugin - User Authenticator SHA256 Salted SKIPPED
[INFO] Apache CloudStack Plugin - Dns Notifier Example ... SKIPPED
[INFO] Apache CloudStack Plugin - Storage Image S3 ....... SKIPPED
[INFO] Apache CloudStack Plugin - Storage Image Swift provider SKIPPED
[INFO] Apache CloudStack Plugin - Storage Image default provider SKIPPED
[INFO] Apache CloudStack Plugin - Storage Image sample provider SKIPPED
[INFO] Apache CloudStack Plugin - Storage Volume Nexenta Provider SKIPPED
[INFO] Apache CloudStack Plugin - Storage Volume CloudByte Provider SKIPPED
[INFO] Apache CloudStack Plugin - Storage Volume sample provider SKIPPED
[INFO] Apache CloudStack Plugin - SNMP Alerts ............ SKIPPED
[INFO] Apache CloudStack Plugin - Syslog Alerts .......... SKIPPED
[INFO] Apache CloudStack Plugin - Network VXLAN .......... SKIPPED
[INFO] Apache CloudStack Plugin - GloboDNS ............... SKIPPED
[INFO] Apache CloudStack Framework - Spring Module ....... SUCCESS [32.780s]
[INFO] Apache CloudStack Secondary Storage Controller .... SKIPPED
[INFO] Apache CloudStack Console Proxy - RDP Client ...... SUCCESS [53.809s]
[INFO] Apache CloudStack Console Proxy ................... SUCCESS [16.115s]
[INFO] Apache CloudStack Console Proxy - Server .......... SUCCESS [26.215s]
[INFO] Apache CloudStack System VM ....................... SKIPPED
[INFO] Apache CloudStack Client UI ....................... SKIPPED
[INFO] Apache CloudStack Framework - QuickCloud .......... SUCCESS [3.516s]
[INFO] Apache CloudStack AWS API Bridge .................. SKIPPED
[INFO] ------------------------------------------------------------------------
[INFO] BUILD FAILURE
[INFO] ------------------------------------------------------------------------
[INFO] Total time: 3:48.874s (Wall Clock)
[INFO] Finished at: Mon Oct 13 21:50:50 EDT 2014
[INFO] Final Memory: 47M/238M
[INFO] ------------------------------------------------------------------------
[ERROR] Failed to execute goal com.mycila:license-maven-plugin:2.5:check (cloudstack-checklicence) on project cloud-core: Some files do not have the expected license header -> [Help 1]
[ERROR]
[ERROR] To see the full stack trace of the errors, re-run Maven with the -e switch.
[ERROR] Re-run Maven using the -X switch to enable full debug logging.
[ERROR]
[ERROR] For more information about the errors and possible solutions, please read the following articles:
[ERROR] [Help 1] http://cwiki.apache.org/confluence/display/MAVEN/MojoExecutionException
[ERROR]
[ERROR] After correcting the problems, you can resume the build with the command
[ERROR] mvn <goals> -rf :cloud-core
Build step 'Invoke top-level Maven targets' marked build as failure
Recording test results
Re: Build failed in Jenkins: build-4.5 #14
Posted by Ian Duffy <ia...@ianduffy.ie>.
Great, Thanks Talluri.
On 14 October 2014 04:08, Srikanteswararao Talluri <
srikanteswararao.talluri@citrix.com> wrote:
> Cleared old builds on this machine.
>
> ~Talluri
>
> From: Ian Duffy <ia...@ianduffy.ie>
> Date: Tuesday, 14 October 2014 6:40 am
> To: "dev@cloudstack.apache.org" <de...@cloudstack.apache.org>
> Cc: Srikanteswararao Talluri <sr...@citrix.com>, Ahmad
> Emneina <Ah...@citrix.com>, Prasanna Santhanam <ts...@apache.org>
> Subject: Re: Build failed in Jenkins: build-4.5 #14
>
> Can confirm that test-infra-common has /var/lib/jenkins full, CCing the
> people who have access to that box.
>
> I have restricted the build-4.5 job to running on the slavebuilder or
> rpmbuilder as we do with build-master, 4.3, and 4.4
> If anyone feels this is wrong please change it.
>
> Thanks,
> Ian
>
> On 13 October 2014 17:34, Amogh Vasekar <am...@citrix.com> wrote:
>
>> Possibly disk space issue?
>> Can someone with access to Jenkins slaves please check on this?
>>
>> Thanks
>> Amogh
>>
>> On 10/13/14 1:12 AM, "jenkins@cloudstack.org" <je...@cloudstack.org>
>> wrote:
>>
>> >See <http://jenkins.buildacloud.org/job/build-4.5/14/>
>> >
>> >------------------------------------------
>> >Started by an SCM change
>> >[EnvInject] - Loading node environment variables.
>> >Building remotely on test-infra-common (test) in workspace
>> ><http://jenkins.buildacloud.org/job/build-4.5/ws/>
>> >java.io.IOException: Failed to mkdirs:
>> ><http://jenkins.buildacloud.org/job/build-4.5/ws/>
>> > at hudson.FilePath.mkdirs(FilePath.java:1069)
>> > at
>> hudson.model.AbstractProject.checkout(AbstractProject.java:1313)
>> > at
>>
>> >hudson.model.AbstractBuild$AbstractBuildExecution.defaultCheckout(Abstract
>> >Build.java:609)
>> > at
>> jenkins.scm.SCMCheckoutStrategy.checkout(SCMCheckoutStrategy.java:88)
>> > at
>>
>> >hudson.model.AbstractBuild$AbstractBuildExecution.run(AbstractBuild.java:5
>> >18)
>> > at hudson.model.Run.execute(Run.java:1688)
>> > at hudson.model.FreeStyleBuild.run(FreeStyleBuild.java:43)
>> > at
>> hudson.model.ResourceController.execute(ResourceController.java:88)
>> > at hudson.model.Executor.run(Executor.java:231)
>> >Recording test results
>> >ERROR: Publisher hudson.tasks.junit.JUnitResultArchiver aborted due to
>> >exception
>> ><http://jenkins.buildacloud.org/job/build-4.5/ws/> does not exist.
>> > at
>>
>> >org.apache.tools.ant.types.AbstractFileSet.getDirectoryScanner(AbstractFil
>> >eSet.java:483)
>> > at
>>
>> >org.apache.tools.ant.types.AbstractFileSet.getDirectoryScanner(AbstractFil
>> >eSet.java:460)
>> > at
>>
>> >hudson.tasks.junit.JUnitParser$ParseResultCallable.invoke(JUnitParser.java
>> >:108)
>> > at
>>
>> >hudson.tasks.junit.JUnitParser$ParseResultCallable.invoke(JUnitParser.java
>> >:90)
>> > at hudson.FilePath$FileCallableWrapper.call(FilePath.java:2462)
>> > at hudson.remoting.UserRequest.perform(UserRequest.java:118)
>> > at hudson.remoting.UserRequest.perform(UserRequest.java:48)
>> > at hudson.remoting.Request$2.run(Request.java:328)
>> > at
>>
>> >hudson.remoting.InterceptingExecutorService$1.call(InterceptingExecutorSer
>> >vice.java:72)
>> > at
>> java.util.concurrent.FutureTask$Sync.innerRun(FutureTask.java:334)
>> > at java.util.concurrent.FutureTask.run(FutureTask.java:166)
>> > at
>>
>> >java.util.concurrent.ThreadPoolExecutor.runWorker(ThreadPoolExecutor.java:
>> >1146)
>> > at
>>
>> >java.util.concurrent.ThreadPoolExecutor$Worker.run(ThreadPoolExecutor.java
>> >:615)
>> > at java.lang.Thread.run(Thread.java:679)
>>
>>
>
Re: Build failed in Jenkins: build-4.5 #14
Posted by Srikanteswararao Talluri <sr...@citrix.com>.
Cleared old builds on this machine.
~Talluri
From: Ian Duffy <ia...@ianduffy.ie>>
Date: Tuesday, 14 October 2014 6:40 am
To: "dev@cloudstack.apache.org<ma...@cloudstack.apache.org>" <de...@cloudstack.apache.org>>
Cc: Srikanteswararao Talluri <sr...@citrix.com>>, Ahmad Emneina <Ah...@citrix.com>>, Prasanna Santhanam <ts...@apache.org>>
Subject: Re: Build failed in Jenkins: build-4.5 #14
Can confirm that test-infra-common has /var/lib/jenkins full, CCing the people who have access to that box.
I have restricted the build-4.5 job to running on the slavebuilder or rpmbuilder as we do with build-master, 4.3, and 4.4
If anyone feels this is wrong please change it.
Thanks,
Ian
On 13 October 2014 17:34, Amogh Vasekar <am...@citrix.com>> wrote:
Possibly disk space issue?
Can someone with access to Jenkins slaves please check on this?
Thanks
Amogh
On 10/13/14 1:12 AM, "jenkins@cloudstack.org<ma...@cloudstack.org>" <je...@cloudstack.org>>
wrote:
>See <http://jenkins.buildacloud.org/job/build-4.5/14/>
>
>------------------------------------------
>Started by an SCM change
>[EnvInject] - Loading node environment variables.
>Building remotely on test-infra-common (test) in workspace
><http://jenkins.buildacloud.org/job/build-4.5/ws/>
>java.io.IOException: Failed to mkdirs:
><http://jenkins.buildacloud.org/job/build-4.5/ws/>
> at hudson.FilePath.mkdirs(FilePath.java:1069)
> at hudson.model.AbstractProject.checkout(AbstractProject.java:1313)
> at
>hudson.model.AbstractBuild$AbstractBuildExecution.defaultCheckout(Abstract
>Build.java:609)
> at jenkins.scm.SCMCheckoutStrategy.checkout(SCMCheckoutStrategy.java:88)
> at
>hudson.model.AbstractBuild$AbstractBuildExecution.run(AbstractBuild.java:5
>18)
> at hudson.model.Run.execute(Run.java:1688)
> at hudson.model.FreeStyleBuild.run(FreeStyleBuild.java:43)
> at hudson.model.ResourceController.execute(ResourceController.java:88)
> at hudson.model.Executor.run(Executor.java:231)
>Recording test results
>ERROR: Publisher hudson.tasks.junit.JUnitResultArchiver aborted due to
>exception
><http://jenkins.buildacloud.org/job/build-4.5/ws/> does not exist.
> at
>org.apache.tools.ant.types.AbstractFileSet.getDirectoryScanner(AbstractFil
>eSet.java:483)
> at
>org.apache.tools.ant.types.AbstractFileSet.getDirectoryScanner(AbstractFil
>eSet.java:460)
> at
>hudson.tasks.junit.JUnitParser$ParseResultCallable.invoke(JUnitParser.java
>:108)
> at
>hudson.tasks.junit.JUnitParser$ParseResultCallable.invoke(JUnitParser.java
>:90)
> at hudson.FilePath$FileCallableWrapper.call(FilePath.java:2462)
> at hudson.remoting.UserRequest.perform(UserRequest.java:118)
> at hudson.remoting.UserRequest.perform(UserRequest.java:48)
> at hudson.remoting.Request$2.run(Request.java:328)
> at
>hudson.remoting.InterceptingExecutorService$1.call(InterceptingExecutorSer
>vice.java:72)
> at java.util.concurrent.FutureTask$Sync.innerRun(FutureTask.java:334)
> at java.util.concurrent.FutureTask.run(FutureTask.java:166)
> at
>java.util.concurrent.ThreadPoolExecutor.runWorker(ThreadPoolExecutor.java:
>1146)
> at
>java.util.concurrent.ThreadPoolExecutor$Worker.run(ThreadPoolExecutor.java
>:615)
> at java.lang.Thread.run(Thread.java:679)
Re: Build failed in Jenkins: build-4.5 #14
Posted by Ian Duffy <ia...@ianduffy.ie>.
Can confirm that test-infra-common has /var/lib/jenkins full, CCing the
people who have access to that box.
I have restricted the build-4.5 job to running on the slavebuilder or
rpmbuilder as we do with build-master, 4.3, and 4.4
If anyone feels this is wrong please change it.
Thanks,
Ian
On 13 October 2014 17:34, Amogh Vasekar <am...@citrix.com> wrote:
> Possibly disk space issue?
> Can someone with access to Jenkins slaves please check on this?
>
> Thanks
> Amogh
>
> On 10/13/14 1:12 AM, "jenkins@cloudstack.org" <je...@cloudstack.org>
> wrote:
>
> >See <http://jenkins.buildacloud.org/job/build-4.5/14/>
> >
> >------------------------------------------
> >Started by an SCM change
> >[EnvInject] - Loading node environment variables.
> >Building remotely on test-infra-common (test) in workspace
> ><http://jenkins.buildacloud.org/job/build-4.5/ws/>
> >java.io.IOException: Failed to mkdirs:
> ><http://jenkins.buildacloud.org/job/build-4.5/ws/>
> > at hudson.FilePath.mkdirs(FilePath.java:1069)
> > at hudson.model.AbstractProject.checkout(AbstractProject.java:1313)
> > at
> >hudson.model.AbstractBuild$AbstractBuildExecution.defaultCheckout(Abstract
> >Build.java:609)
> > at
> jenkins.scm.SCMCheckoutStrategy.checkout(SCMCheckoutStrategy.java:88)
> > at
> >hudson.model.AbstractBuild$AbstractBuildExecution.run(AbstractBuild.java:5
> >18)
> > at hudson.model.Run.execute(Run.java:1688)
> > at hudson.model.FreeStyleBuild.run(FreeStyleBuild.java:43)
> > at
> hudson.model.ResourceController.execute(ResourceController.java:88)
> > at hudson.model.Executor.run(Executor.java:231)
> >Recording test results
> >ERROR: Publisher hudson.tasks.junit.JUnitResultArchiver aborted due to
> >exception
> ><http://jenkins.buildacloud.org/job/build-4.5/ws/> does not exist.
> > at
> >org.apache.tools.ant.types.AbstractFileSet.getDirectoryScanner(AbstractFil
> >eSet.java:483)
> > at
> >org.apache.tools.ant.types.AbstractFileSet.getDirectoryScanner(AbstractFil
> >eSet.java:460)
> > at
> >hudson.tasks.junit.JUnitParser$ParseResultCallable.invoke(JUnitParser.java
> >:108)
> > at
> >hudson.tasks.junit.JUnitParser$ParseResultCallable.invoke(JUnitParser.java
> >:90)
> > at hudson.FilePath$FileCallableWrapper.call(FilePath.java:2462)
> > at hudson.remoting.UserRequest.perform(UserRequest.java:118)
> > at hudson.remoting.UserRequest.perform(UserRequest.java:48)
> > at hudson.remoting.Request$2.run(Request.java:328)
> > at
> >hudson.remoting.InterceptingExecutorService$1.call(InterceptingExecutorSer
> >vice.java:72)
> > at
> java.util.concurrent.FutureTask$Sync.innerRun(FutureTask.java:334)
> > at java.util.concurrent.FutureTask.run(FutureTask.java:166)
> > at
> >java.util.concurrent.ThreadPoolExecutor.runWorker(ThreadPoolExecutor.java:
> >1146)
> > at
> >java.util.concurrent.ThreadPoolExecutor$Worker.run(ThreadPoolExecutor.java
> >:615)
> > at java.lang.Thread.run(Thread.java:679)
>
>
Re: Build failed in Jenkins: build-4.5 #14
Posted by Amogh Vasekar <am...@citrix.com>.
Possibly disk space issue?
Can someone with access to Jenkins slaves please check on this?
Thanks
Amogh
On 10/13/14 1:12 AM, "jenkins@cloudstack.org" <je...@cloudstack.org>
wrote:
>See <http://jenkins.buildacloud.org/job/build-4.5/14/>
>
>------------------------------------------
>Started by an SCM change
>[EnvInject] - Loading node environment variables.
>Building remotely on test-infra-common (test) in workspace
><http://jenkins.buildacloud.org/job/build-4.5/ws/>
>java.io.IOException: Failed to mkdirs:
><http://jenkins.buildacloud.org/job/build-4.5/ws/>
> at hudson.FilePath.mkdirs(FilePath.java:1069)
> at hudson.model.AbstractProject.checkout(AbstractProject.java:1313)
> at
>hudson.model.AbstractBuild$AbstractBuildExecution.defaultCheckout(Abstract
>Build.java:609)
> at jenkins.scm.SCMCheckoutStrategy.checkout(SCMCheckoutStrategy.java:88)
> at
>hudson.model.AbstractBuild$AbstractBuildExecution.run(AbstractBuild.java:5
>18)
> at hudson.model.Run.execute(Run.java:1688)
> at hudson.model.FreeStyleBuild.run(FreeStyleBuild.java:43)
> at hudson.model.ResourceController.execute(ResourceController.java:88)
> at hudson.model.Executor.run(Executor.java:231)
>Recording test results
>ERROR: Publisher hudson.tasks.junit.JUnitResultArchiver aborted due to
>exception
><http://jenkins.buildacloud.org/job/build-4.5/ws/> does not exist.
> at
>org.apache.tools.ant.types.AbstractFileSet.getDirectoryScanner(AbstractFil
>eSet.java:483)
> at
>org.apache.tools.ant.types.AbstractFileSet.getDirectoryScanner(AbstractFil
>eSet.java:460)
> at
>hudson.tasks.junit.JUnitParser$ParseResultCallable.invoke(JUnitParser.java
>:108)
> at
>hudson.tasks.junit.JUnitParser$ParseResultCallable.invoke(JUnitParser.java
>:90)
> at hudson.FilePath$FileCallableWrapper.call(FilePath.java:2462)
> at hudson.remoting.UserRequest.perform(UserRequest.java:118)
> at hudson.remoting.UserRequest.perform(UserRequest.java:48)
> at hudson.remoting.Request$2.run(Request.java:328)
> at
>hudson.remoting.InterceptingExecutorService$1.call(InterceptingExecutorSer
>vice.java:72)
> at java.util.concurrent.FutureTask$Sync.innerRun(FutureTask.java:334)
> at java.util.concurrent.FutureTask.run(FutureTask.java:166)
> at
>java.util.concurrent.ThreadPoolExecutor.runWorker(ThreadPoolExecutor.java:
>1146)
> at
>java.util.concurrent.ThreadPoolExecutor$Worker.run(ThreadPoolExecutor.java
>:615)
> at java.lang.Thread.run(Thread.java:679)
Build failed in Jenkins: build-4.5 #14
Posted by je...@cloudstack.org.
See <http://jenkins.buildacloud.org/job/build-4.5/14/>
------------------------------------------
Started by an SCM change
[EnvInject] - Loading node environment variables.
Building remotely on test-infra-common (test) in workspace <http://jenkins.buildacloud.org/job/build-4.5/ws/>
java.io.IOException: Failed to mkdirs: <http://jenkins.buildacloud.org/job/build-4.5/ws/>
at hudson.FilePath.mkdirs(FilePath.java:1069)
at hudson.model.AbstractProject.checkout(AbstractProject.java:1313)
at hudson.model.AbstractBuild$AbstractBuildExecution.defaultCheckout(AbstractBuild.java:609)
at jenkins.scm.SCMCheckoutStrategy.checkout(SCMCheckoutStrategy.java:88)
at hudson.model.AbstractBuild$AbstractBuildExecution.run(AbstractBuild.java:518)
at hudson.model.Run.execute(Run.java:1688)
at hudson.model.FreeStyleBuild.run(FreeStyleBuild.java:43)
at hudson.model.ResourceController.execute(ResourceController.java:88)
at hudson.model.Executor.run(Executor.java:231)
Recording test results
ERROR: Publisher hudson.tasks.junit.JUnitResultArchiver aborted due to exception
<http://jenkins.buildacloud.org/job/build-4.5/ws/> does not exist.
at org.apache.tools.ant.types.AbstractFileSet.getDirectoryScanner(AbstractFileSet.java:483)
at org.apache.tools.ant.types.AbstractFileSet.getDirectoryScanner(AbstractFileSet.java:460)
at hudson.tasks.junit.JUnitParser$ParseResultCallable.invoke(JUnitParser.java:108)
at hudson.tasks.junit.JUnitParser$ParseResultCallable.invoke(JUnitParser.java:90)
at hudson.FilePath$FileCallableWrapper.call(FilePath.java:2462)
at hudson.remoting.UserRequest.perform(UserRequest.java:118)
at hudson.remoting.UserRequest.perform(UserRequest.java:48)
at hudson.remoting.Request$2.run(Request.java:328)
at hudson.remoting.InterceptingExecutorService$1.call(InterceptingExecutorService.java:72)
at java.util.concurrent.FutureTask$Sync.innerRun(FutureTask.java:334)
at java.util.concurrent.FutureTask.run(FutureTask.java:166)
at java.util.concurrent.ThreadPoolExecutor.runWorker(ThreadPoolExecutor.java:1146)
at java.util.concurrent.ThreadPoolExecutor$Worker.run(ThreadPoolExecutor.java:615)
at java.lang.Thread.run(Thread.java:679)
Build failed in Jenkins: build-4.5 #13
Posted by je...@cloudstack.org.
See <http://jenkins.buildacloud.org/job/build-4.5/13/>
------------------------------------------
Started by an SCM change
[EnvInject] - Loading node environment variables.
Building remotely on windows-buildslave-001 (windows) in workspace <http://jenkins.buildacloud.org/job/build-4.5/ws/>
ERROR: Workspace has a .git repository, but it appears to be corrupt.
hudson.plugins.git.GitException: Error performing command: git rev-parse --is-inside-work-tree
at org.jenkinsci.plugins.gitclient.CliGitAPIImpl.launchCommandIn(CliGitAPIImpl.java:1093)
at org.jenkinsci.plugins.gitclient.CliGitAPIImpl.launchCommandIn(CliGitAPIImpl.java:1063)
at org.jenkinsci.plugins.gitclient.CliGitAPIImpl.launchCommand(CliGitAPIImpl.java:900)
at org.jenkinsci.plugins.gitclient.CliGitAPIImpl.launchCommand(CliGitAPIImpl.java:910)
at org.jenkinsci.plugins.gitclient.CliGitAPIImpl.hasGitRepo(CliGitAPIImpl.java:120)
at hudson.plugins.git.GitAPI.hasGitRepo(GitAPI.java:185)
at sun.reflect.NativeMethodAccessorImpl.invoke0(Native Method)
at sun.reflect.NativeMethodAccessorImpl.invoke(Unknown Source)
at sun.reflect.DelegatingMethodAccessorImpl.invoke(Unknown Source)
at java.lang.reflect.Method.invoke(Unknown Source)
at hudson.remoting.RemoteInvocationHandler$RPCRequest.perform(RemoteInvocationHandler.java:299)
at hudson.remoting.RemoteInvocationHandler$RPCRequest.call(RemoteInvocationHandler.java:280)
at hudson.remoting.RemoteInvocationHandler$RPCRequest.call(RemoteInvocationHandler.java:239)
at hudson.remoting.UserRequest.perform(UserRequest.java:118)
at hudson.remoting.UserRequest.perform(UserRequest.java:48)
at hudson.remoting.Request$2.run(Request.java:328)
at hudson.remoting.InterceptingExecutorService$1.call(InterceptingExecutorService.java:72)
at java.util.concurrent.FutureTask.run(Unknown Source)
at java.util.concurrent.ThreadPoolExecutor.runWorker(Unknown Source)
at java.util.concurrent.ThreadPoolExecutor$Worker.run(Unknown Source)
at hudson.remoting.Engine$1$1.run(Engine.java:63)
at java.lang.Thread.run(Unknown Source)
Caused by: java.io.IOException: Cannot run program "/usr/bin/git" (in directory "workspace\build-4.5"): CreateProcess error=2, The system cannot find the file specified
at java.lang.ProcessBuilder.start(Unknown Source)
at hudson.Proc$LocalProc.<init>(Proc.java:244)
at hudson.Proc$LocalProc.<init>(Proc.java:216)
at hudson.Launcher$LocalLauncher.launch(Launcher.java:773)
at hudson.Launcher$ProcStarter.start(Launcher.java:353)
at org.jenkinsci.plugins.gitclient.CliGitAPIImpl.launchCommandIn(CliGitAPIImpl.java:1082)
... 21 more
Caused by: java.io.IOException: CreateProcess error=2, The system cannot find the file specified
at java.lang.ProcessImpl.create(Native Method)
at java.lang.ProcessImpl.<init>(Unknown Source)
at java.lang.ProcessImpl.start(Unknown Source)
... 27 more
Cloning the remote Git repository
Cloning repository https://git-wip-us.apache.org/repos/asf/cloudstack.git
Fetching upstream changes from https://git-wip-us.apache.org/repos/asf/cloudstack.git
ERROR: Error cloning remote repo 'origin'
hudson.plugins.git.GitException: Error performing command: git fetch --tags --progress https://git-wip-us.apache.org/repos/asf/cloudstack.git +refs/heads/*:refs/remotes/origin/*
at org.jenkinsci.plugins.gitclient.CliGitAPIImpl.launchCommandIn(CliGitAPIImpl.java:1093)
at org.jenkinsci.plugins.gitclient.CliGitAPIImpl.launchCommandWithCredentials(CliGitAPIImpl.java:968)
at org.jenkinsci.plugins.gitclient.CliGitAPIImpl.access$200(CliGitAPIImpl.java:71)
at org.jenkinsci.plugins.gitclient.CliGitAPIImpl$1.execute(CliGitAPIImpl.java:197)
at org.jenkinsci.plugins.gitclient.CliGitAPIImpl$2.execute(CliGitAPIImpl.java:329)
at org.jenkinsci.plugins.gitclient.RemoteGitImpl$CommandInvocationHandler$1.call(RemoteGitImpl.java:152)
at org.jenkinsci.plugins.gitclient.RemoteGitImpl$CommandInvocationHandler$1.call(RemoteGitImpl.java:145)
at hudson.remoting.UserRequest.perform(UserRequest.java:118)
at hudson.remoting.UserRequest.perform(UserRequest.java:48)
at hudson.remoting.Request$2.run(Request.java:328)
at hudson.remoting.InterceptingExecutorService$1.call(InterceptingExecutorService.java:72)
at java.util.concurrent.FutureTask.run(Unknown Source)
at java.util.concurrent.ThreadPoolExecutor.runWorker(Unknown Source)
at java.util.concurrent.ThreadPoolExecutor$Worker.run(Unknown Source)
at hudson.remoting.Engine$1$1.run(Engine.java:63)
at java.lang.Thread.run(Unknown Source)
Caused by: java.io.IOException: Cannot run program "/usr/bin/git" (in directory "workspace\build-4.5"): CreateProcess error=2, The system cannot find the file specified
at java.lang.ProcessBuilder.start(Unknown Source)
at hudson.Proc$LocalProc.<init>(Proc.java:244)
at hudson.Proc$LocalProc.<init>(Proc.java:216)
at hudson.Launcher$LocalLauncher.launch(Launcher.java:773)
at hudson.Launcher$ProcStarter.start(Launcher.java:353)
at org.jenkinsci.plugins.gitclient.CliGitAPIImpl.launchCommandIn(CliGitAPIImpl.java:1082)
... 15 more
Caused by: java.io.IOException: CreateProcess error=2, The system cannot find the file specified
at java.lang.ProcessImpl.create(Native Method)
at java.lang.ProcessImpl.<init>(Unknown Source)
at java.lang.ProcessImpl.start(Unknown Source)
... 21 more
ERROR: null
Recording test results
Build failed in Jenkins: build-4.5 #12
Posted by je...@cloudstack.org.
See <http://jenkins.buildacloud.org/job/build-4.5/12/>
------------------------------------------
Started by an SCM change
[EnvInject] - Loading node environment variables.
Building remotely on test-infra-common (test) in workspace <http://jenkins.buildacloud.org/job/build-4.5/ws/>
java.io.IOException: Failed to mkdirs: <http://jenkins.buildacloud.org/job/build-4.5/ws/>
at hudson.FilePath.mkdirs(FilePath.java:1069)
at hudson.model.AbstractProject.checkout(AbstractProject.java:1313)
at hudson.model.AbstractBuild$AbstractBuildExecution.defaultCheckout(AbstractBuild.java:609)
at jenkins.scm.SCMCheckoutStrategy.checkout(SCMCheckoutStrategy.java:88)
at hudson.model.AbstractBuild$AbstractBuildExecution.run(AbstractBuild.java:518)
at hudson.model.Run.execute(Run.java:1688)
at hudson.model.FreeStyleBuild.run(FreeStyleBuild.java:43)
at hudson.model.ResourceController.execute(ResourceController.java:88)
at hudson.model.Executor.run(Executor.java:231)
Recording test results
ERROR: Publisher hudson.tasks.junit.JUnitResultArchiver aborted due to exception
<http://jenkins.buildacloud.org/job/build-4.5/ws/> does not exist.
at org.apache.tools.ant.types.AbstractFileSet.getDirectoryScanner(AbstractFileSet.java:483)
at org.apache.tools.ant.types.AbstractFileSet.getDirectoryScanner(AbstractFileSet.java:460)
at hudson.tasks.junit.JUnitParser$ParseResultCallable.invoke(JUnitParser.java:108)
at hudson.tasks.junit.JUnitParser$ParseResultCallable.invoke(JUnitParser.java:90)
at hudson.FilePath$FileCallableWrapper.call(FilePath.java:2462)
at hudson.remoting.UserRequest.perform(UserRequest.java:118)
at hudson.remoting.UserRequest.perform(UserRequest.java:48)
at hudson.remoting.Request$2.run(Request.java:328)
at hudson.remoting.InterceptingExecutorService$1.call(InterceptingExecutorService.java:72)
at java.util.concurrent.FutureTask$Sync.innerRun(FutureTask.java:334)
at java.util.concurrent.FutureTask.run(FutureTask.java:166)
at java.util.concurrent.ThreadPoolExecutor.runWorker(ThreadPoolExecutor.java:1146)
at java.util.concurrent.ThreadPoolExecutor$Worker.run(ThreadPoolExecutor.java:615)
at java.lang.Thread.run(Thread.java:679)
Build failed in Jenkins: build-4.5 #11
Posted by je...@cloudstack.org.
See <http://jenkins.buildacloud.org/job/build-4.5/11/>
------------------------------------------
Started by an SCM change
[EnvInject] - Loading node environment variables.
Building remotely on test-infra-common (test) in workspace <http://jenkins.buildacloud.org/job/build-4.5/ws/>
java.io.IOException: Failed to mkdirs: <http://jenkins.buildacloud.org/job/build-4.5/ws/>
at hudson.FilePath.mkdirs(FilePath.java:1069)
at hudson.model.AbstractProject.checkout(AbstractProject.java:1313)
at hudson.model.AbstractBuild$AbstractBuildExecution.defaultCheckout(AbstractBuild.java:609)
at jenkins.scm.SCMCheckoutStrategy.checkout(SCMCheckoutStrategy.java:88)
at hudson.model.AbstractBuild$AbstractBuildExecution.run(AbstractBuild.java:518)
at hudson.model.Run.execute(Run.java:1688)
at hudson.model.FreeStyleBuild.run(FreeStyleBuild.java:43)
at hudson.model.ResourceController.execute(ResourceController.java:88)
at hudson.model.Executor.run(Executor.java:231)
Recording test results
ERROR: Publisher hudson.tasks.junit.JUnitResultArchiver aborted due to exception
<http://jenkins.buildacloud.org/job/build-4.5/ws/> does not exist.
at org.apache.tools.ant.types.AbstractFileSet.getDirectoryScanner(AbstractFileSet.java:483)
at org.apache.tools.ant.types.AbstractFileSet.getDirectoryScanner(AbstractFileSet.java:460)
at hudson.tasks.junit.JUnitParser$ParseResultCallable.invoke(JUnitParser.java:108)
at hudson.tasks.junit.JUnitParser$ParseResultCallable.invoke(JUnitParser.java:90)
at hudson.FilePath$FileCallableWrapper.call(FilePath.java:2462)
at hudson.remoting.UserRequest.perform(UserRequest.java:118)
at hudson.remoting.UserRequest.perform(UserRequest.java:48)
at hudson.remoting.Request$2.run(Request.java:328)
at hudson.remoting.InterceptingExecutorService$1.call(InterceptingExecutorService.java:72)
at java.util.concurrent.FutureTask$Sync.innerRun(FutureTask.java:334)
at java.util.concurrent.FutureTask.run(FutureTask.java:166)
at java.util.concurrent.ThreadPoolExecutor.runWorker(ThreadPoolExecutor.java:1146)
at java.util.concurrent.ThreadPoolExecutor$Worker.run(ThreadPoolExecutor.java:615)
at java.lang.Thread.run(Thread.java:679)
Build failed in Jenkins: build-4.5 #10
Posted by je...@cloudstack.org.
See <http://jenkins.buildacloud.org/job/build-4.5/10/>
------------------------------------------
Started by an SCM change
[EnvInject] - Loading node environment variables.
Building remotely on test-infra-common (test) in workspace <http://jenkins.buildacloud.org/job/build-4.5/ws/>
java.io.IOException: Failed to mkdirs: <http://jenkins.buildacloud.org/job/build-4.5/ws/>
at hudson.FilePath.mkdirs(FilePath.java:1069)
at hudson.model.AbstractProject.checkout(AbstractProject.java:1313)
at hudson.model.AbstractBuild$AbstractBuildExecution.defaultCheckout(AbstractBuild.java:609)
at jenkins.scm.SCMCheckoutStrategy.checkout(SCMCheckoutStrategy.java:88)
at hudson.model.AbstractBuild$AbstractBuildExecution.run(AbstractBuild.java:518)
at hudson.model.Run.execute(Run.java:1688)
at hudson.model.FreeStyleBuild.run(FreeStyleBuild.java:43)
at hudson.model.ResourceController.execute(ResourceController.java:88)
at hudson.model.Executor.run(Executor.java:231)
Recording test results
ERROR: Publisher hudson.tasks.junit.JUnitResultArchiver aborted due to exception
<http://jenkins.buildacloud.org/job/build-4.5/ws/> does not exist.
at org.apache.tools.ant.types.AbstractFileSet.getDirectoryScanner(AbstractFileSet.java:483)
at org.apache.tools.ant.types.AbstractFileSet.getDirectoryScanner(AbstractFileSet.java:460)
at hudson.tasks.junit.JUnitParser$ParseResultCallable.invoke(JUnitParser.java:108)
at hudson.tasks.junit.JUnitParser$ParseResultCallable.invoke(JUnitParser.java:90)
at hudson.FilePath$FileCallableWrapper.call(FilePath.java:2462)
at hudson.remoting.UserRequest.perform(UserRequest.java:118)
at hudson.remoting.UserRequest.perform(UserRequest.java:48)
at hudson.remoting.Request$2.run(Request.java:328)
at hudson.remoting.InterceptingExecutorService$1.call(InterceptingExecutorService.java:72)
at java.util.concurrent.FutureTask$Sync.innerRun(FutureTask.java:334)
at java.util.concurrent.FutureTask.run(FutureTask.java:166)
at java.util.concurrent.ThreadPoolExecutor.runWorker(ThreadPoolExecutor.java:1146)
at java.util.concurrent.ThreadPoolExecutor$Worker.run(ThreadPoolExecutor.java:615)
at java.lang.Thread.run(Thread.java:679)
Build failed in Jenkins: build-4.5 #9
Posted by je...@cloudstack.org.
See <http://jenkins.buildacloud.org/job/build-4.5/9/>
------------------------------------------
Started by an SCM change
[EnvInject] - Loading node environment variables.
Building remotely on test-infra-common (test) in workspace <http://jenkins.buildacloud.org/job/build-4.5/ws/>
java.io.IOException: Failed to mkdirs: <http://jenkins.buildacloud.org/job/build-4.5/ws/>
at hudson.FilePath.mkdirs(FilePath.java:1069)
at hudson.model.AbstractProject.checkout(AbstractProject.java:1313)
at hudson.model.AbstractBuild$AbstractBuildExecution.defaultCheckout(AbstractBuild.java:609)
at jenkins.scm.SCMCheckoutStrategy.checkout(SCMCheckoutStrategy.java:88)
at hudson.model.AbstractBuild$AbstractBuildExecution.run(AbstractBuild.java:518)
at hudson.model.Run.execute(Run.java:1688)
at hudson.model.FreeStyleBuild.run(FreeStyleBuild.java:43)
at hudson.model.ResourceController.execute(ResourceController.java:88)
at hudson.model.Executor.run(Executor.java:231)
Recording test results
ERROR: Publisher hudson.tasks.junit.JUnitResultArchiver aborted due to exception
<http://jenkins.buildacloud.org/job/build-4.5/ws/> does not exist.
at org.apache.tools.ant.types.AbstractFileSet.getDirectoryScanner(AbstractFileSet.java:483)
at org.apache.tools.ant.types.AbstractFileSet.getDirectoryScanner(AbstractFileSet.java:460)
at hudson.tasks.junit.JUnitParser$ParseResultCallable.invoke(JUnitParser.java:108)
at hudson.tasks.junit.JUnitParser$ParseResultCallable.invoke(JUnitParser.java:90)
at hudson.FilePath$FileCallableWrapper.call(FilePath.java:2462)
at hudson.remoting.UserRequest.perform(UserRequest.java:118)
at hudson.remoting.UserRequest.perform(UserRequest.java:48)
at hudson.remoting.Request$2.run(Request.java:328)
at hudson.remoting.InterceptingExecutorService$1.call(InterceptingExecutorService.java:72)
at java.util.concurrent.FutureTask$Sync.innerRun(FutureTask.java:334)
at java.util.concurrent.FutureTask.run(FutureTask.java:166)
at java.util.concurrent.ThreadPoolExecutor.runWorker(ThreadPoolExecutor.java:1146)
at java.util.concurrent.ThreadPoolExecutor$Worker.run(ThreadPoolExecutor.java:615)
at java.lang.Thread.run(Thread.java:679)
Build failed in Jenkins: build-4.5 #8
Posted by je...@cloudstack.org.
See <http://jenkins.buildacloud.org/job/build-4.5/8/>
------------------------------------------
Started by an SCM change
[EnvInject] - Loading node environment variables.
Building remotely on test-infra-common (test) in workspace <http://jenkins.buildacloud.org/job/build-4.5/ws/>
java.io.IOException: Failed to mkdirs: <http://jenkins.buildacloud.org/job/build-4.5/ws/>
at hudson.FilePath.mkdirs(FilePath.java:1069)
at hudson.model.AbstractProject.checkout(AbstractProject.java:1313)
at hudson.model.AbstractBuild$AbstractBuildExecution.defaultCheckout(AbstractBuild.java:609)
at jenkins.scm.SCMCheckoutStrategy.checkout(SCMCheckoutStrategy.java:88)
at hudson.model.AbstractBuild$AbstractBuildExecution.run(AbstractBuild.java:518)
at hudson.model.Run.execute(Run.java:1688)
at hudson.model.FreeStyleBuild.run(FreeStyleBuild.java:43)
at hudson.model.ResourceController.execute(ResourceController.java:88)
at hudson.model.Executor.run(Executor.java:231)
Recording test results
ERROR: Publisher hudson.tasks.junit.JUnitResultArchiver aborted due to exception
<http://jenkins.buildacloud.org/job/build-4.5/ws/> does not exist.
at org.apache.tools.ant.types.AbstractFileSet.getDirectoryScanner(AbstractFileSet.java:483)
at org.apache.tools.ant.types.AbstractFileSet.getDirectoryScanner(AbstractFileSet.java:460)
at hudson.tasks.junit.JUnitParser$ParseResultCallable.invoke(JUnitParser.java:108)
at hudson.tasks.junit.JUnitParser$ParseResultCallable.invoke(JUnitParser.java:90)
at hudson.FilePath$FileCallableWrapper.call(FilePath.java:2462)
at hudson.remoting.UserRequest.perform(UserRequest.java:118)
at hudson.remoting.UserRequest.perform(UserRequest.java:48)
at hudson.remoting.Request$2.run(Request.java:328)
at hudson.remoting.InterceptingExecutorService$1.call(InterceptingExecutorService.java:72)
at java.util.concurrent.FutureTask$Sync.innerRun(FutureTask.java:334)
at java.util.concurrent.FutureTask.run(FutureTask.java:166)
at java.util.concurrent.ThreadPoolExecutor.runWorker(ThreadPoolExecutor.java:1146)
at java.util.concurrent.ThreadPoolExecutor$Worker.run(ThreadPoolExecutor.java:615)
at java.lang.Thread.run(Thread.java:679)