You are viewing a plain text version of this content. The canonical link for it is here.
Posted to dev@lucene.apache.org by Dawid Weiss <da...@gmail.com> on 2025/04/15 18:58:52 UTC

Re: [JENKINS-EA] Lucene-nightly-main-Linux (64bit/hotspot/jdk-25-ea+15) - Build # 20 - Unstable!

This fails in TestIndexWriterDelete.testDeleteAllRepeated, with the heap
indicating byte buffers directory is taking up all the space -

[image: image.png]

Should this test be allowed to write to ram? It writes *a lot*.

Dawid

On Tue, Apr 15, 2025 at 5:05 PM Policeman Jenkins Server <
jenkins@thetaphi.de> wrote:

> Build: https://jenkins.thetaphi.de/job/Lucene-nightly-main-Linux/20/
> Java: 64bit/hotspot/jdk-25-ea+15 -XX:-UseCompressedOops -XX:+UseSerialGC
>
> 1 tests failed.
> FAILED:
> org.apache.lucene.index.TestIndexWriterDelete.testDeleteAllRepeated
>
> Error Message:
> java.lang.OutOfMemoryError: Java heap space
>
> Stack Trace:
> java.lang.OutOfMemoryError: Java heap space
>         at
> __randomizedtesting.SeedInfo.seed([98BA3033CB41FA31:EECDCE6E3B12EC2B]:0)
>         at java.base/java.util.HashMap.resize(HashMap.java:711)
>         at java.base/java.util.HashMap.putVal(HashMap.java:670)
>         at java.base/java.util.HashMap.put(HashMap.java:619)
>         at java.base/java.util.HashSet.add(HashSet.java:230)
>         at
> org.apache.lucene.index.IndexFileDeleter.refresh(IndexFileDeleter.java:489)
>         at
> org.apache.lucene.index.IndexWriter.rollbackInternalNoCommit(IndexWriter.java:2559)
>         at
> org.apache.lucene.index.IndexWriter.rollbackInternal(IndexWriter.java:2477)
>         at
> org.apache.lucene.index.IndexWriter.shutdown(IndexWriter.java:1342)
>         at org.apache.lucene.index.IndexWriter.close(IndexWriter.java:1370)
>         at
> org.apache.lucene.index.TestIndexWriterDelete.testDeleteAllRepeated(TestIndexWriterDelete.java:525)
>         at
> java.base/java.lang.invoke.LambdaForm$DMH/0x00007104840a5400.invokeVirtual(LambdaForm$DMH)
>         at
> java.base/java.lang.invoke.LambdaForm$MH/0x000071048403c800.invoke(LambdaForm$MH)
>         at
> java.base/java.lang.invoke.Invokers$Holder.invokeExact_MT(Invokers$Holder)
>         at
> java.base/jdk.internal.reflect.DirectMethodHandleAccessor.invokeImpl(DirectMethodHandleAccessor.java:154)
>         at
> java.base/jdk.internal.reflect.DirectMethodHandleAccessor.invoke(DirectMethodHandleAccessor.java:104)
>         at java.base/java.lang.reflect.Method.invoke(Method.java:565)
>         at
> com.carrotsearch.randomizedtesting.RandomizedRunner.invoke(RandomizedRunner.java:1758)
>         at
> com.carrotsearch.randomizedtesting.RandomizedRunner$8.evaluate(RandomizedRunner.java:946)
>         at
> com.carrotsearch.randomizedtesting.RandomizedRunner$9.evaluate(RandomizedRunner.java:982)
>         at
> com.carrotsearch.randomizedtesting.RandomizedRunner$10.evaluate(RandomizedRunner.java:996)
>         at
> org.apache.lucene.tests.util.TestRuleSetupTeardownChained$1.evaluate(TestRuleSetupTeardownChained.java:48)
>         at
> org.apache.lucene.tests.util.AbstractBeforeAfterRule$1.evaluate(AbstractBeforeAfterRule.java:43)
>         at
> org.apache.lucene.tests.util.TestRuleThreadAndTestName$1.evaluate(TestRuleThreadAndTestName.java:45)
>         at
> org.apache.lucene.tests.util.TestRuleIgnoreAfterMaxFailures$1.evaluate(TestRuleIgnoreAfterMaxFailures.java:60)
>         at
> org.apache.lucene.tests.util.TestRuleMarkFailure$1.evaluate(TestRuleMarkFailure.java:44)
>         at org.junit.rules.RunRules.evaluate(RunRules.java:20)
>         at
> com.carrotsearch.randomizedtesting.rules.StatementAdapter.evaluate(StatementAdapter.java:36)
>         at
> com.carrotsearch.randomizedtesting.ThreadLeakControl$StatementRunner.run(ThreadLeakControl.java:390)
>         at
> com.carrotsearch.randomizedtesting.ThreadLeakControl.forkTimeoutingTask(ThreadLeakControl.java:843)
>         at
> com.carrotsearch.randomizedtesting.ThreadLeakControl$3.evaluate(ThreadLeakControl.java:490)
>         at
> com.carrotsearch.randomizedtesting.RandomizedRunner.runSingleTest(RandomizedRunner.java:955)
>         at
> com.carrotsearch.randomizedtesting.RandomizedRunner$5.evaluate(RandomizedRunner.java:840)
>
> ---------------------------------------------------------------------
> To unsubscribe, e-mail: builds-unsubscribe@lucene.apache.org
> For additional commands, e-mail: builds-help@lucene.apache.org

Re: [JENKINS-EA] Lucene-nightly-main-Linux (64bit/hotspot/jdk-25-ea+15) - Build # 20 - Unstable!

Posted by Dawid Weiss <da...@gmail.com>.
I filed https://github.com/apache/lucene/issues/14508

On Tue, Apr 15, 2025 at 8:58 PM Dawid Weiss <da...@gmail.com> wrote:
>
>
> This fails in TestIndexWriterDelete.testDeleteAllRepeated, with the heap indicating byte buffers directory is taking up all the space -
>
>
>
> Should this test be allowed to write to ram? It writes a lot.
>
> Dawid
>
> On Tue, Apr 15, 2025 at 5:05 PM Policeman Jenkins Server <je...@thetaphi.de> wrote:
>>
>> Build: https://jenkins.thetaphi.de/job/Lucene-nightly-main-Linux/20/
>> Java: 64bit/hotspot/jdk-25-ea+15 -XX:-UseCompressedOops -XX:+UseSerialGC
>>
>> 1 tests failed.
>> FAILED:  org.apache.lucene.index.TestIndexWriterDelete.testDeleteAllRepeated
>>
>> Error Message:
>> java.lang.OutOfMemoryError: Java heap space
>>
>> Stack Trace:
>> java.lang.OutOfMemoryError: Java heap space
>>         at __randomizedtesting.SeedInfo.seed([98BA3033CB41FA31:EECDCE6E3B12EC2B]:0)
>>         at java.base/java.util.HashMap.resize(HashMap.java:711)
>>         at java.base/java.util.HashMap.putVal(HashMap.java:670)
>>         at java.base/java.util.HashMap.put(HashMap.java:619)
>>         at java.base/java.util.HashSet.add(HashSet.java:230)
>>         at org.apache.lucene.index.IndexFileDeleter.refresh(IndexFileDeleter.java:489)
>>         at org.apache.lucene.index.IndexWriter.rollbackInternalNoCommit(IndexWriter.java:2559)
>>         at org.apache.lucene.index.IndexWriter.rollbackInternal(IndexWriter.java:2477)
>>         at org.apache.lucene.index.IndexWriter.shutdown(IndexWriter.java:1342)
>>         at org.apache.lucene.index.IndexWriter.close(IndexWriter.java:1370)
>>         at org.apache.lucene.index.TestIndexWriterDelete.testDeleteAllRepeated(TestIndexWriterDelete.java:525)
>>         at java.base/java.lang.invoke.LambdaForm$DMH/0x00007104840a5400.invokeVirtual(LambdaForm$DMH)
>>         at java.base/java.lang.invoke.LambdaForm$MH/0x000071048403c800.invoke(LambdaForm$MH)
>>         at java.base/java.lang.invoke.Invokers$Holder.invokeExact_MT(Invokers$Holder)
>>         at java.base/jdk.internal.reflect.DirectMethodHandleAccessor.invokeImpl(DirectMethodHandleAccessor.java:154)
>>         at java.base/jdk.internal.reflect.DirectMethodHandleAccessor.invoke(DirectMethodHandleAccessor.java:104)
>>         at java.base/java.lang.reflect.Method.invoke(Method.java:565)
>>         at com.carrotsearch.randomizedtesting.RandomizedRunner.invoke(RandomizedRunner.java:1758)
>>         at com.carrotsearch.randomizedtesting.RandomizedRunner$8.evaluate(RandomizedRunner.java:946)
>>         at com.carrotsearch.randomizedtesting.RandomizedRunner$9.evaluate(RandomizedRunner.java:982)
>>         at com.carrotsearch.randomizedtesting.RandomizedRunner$10.evaluate(RandomizedRunner.java:996)
>>         at org.apache.lucene.tests.util.TestRuleSetupTeardownChained$1.evaluate(TestRuleSetupTeardownChained.java:48)
>>         at org.apache.lucene.tests.util.AbstractBeforeAfterRule$1.evaluate(AbstractBeforeAfterRule.java:43)
>>         at org.apache.lucene.tests.util.TestRuleThreadAndTestName$1.evaluate(TestRuleThreadAndTestName.java:45)
>>         at org.apache.lucene.tests.util.TestRuleIgnoreAfterMaxFailures$1.evaluate(TestRuleIgnoreAfterMaxFailures.java:60)
>>         at org.apache.lucene.tests.util.TestRuleMarkFailure$1.evaluate(TestRuleMarkFailure.java:44)
>>         at org.junit.rules.RunRules.evaluate(RunRules.java:20)
>>         at com.carrotsearch.randomizedtesting.rules.StatementAdapter.evaluate(StatementAdapter.java:36)
>>         at com.carrotsearch.randomizedtesting.ThreadLeakControl$StatementRunner.run(ThreadLeakControl.java:390)
>>         at com.carrotsearch.randomizedtesting.ThreadLeakControl.forkTimeoutingTask(ThreadLeakControl.java:843)
>>         at com.carrotsearch.randomizedtesting.ThreadLeakControl$3.evaluate(ThreadLeakControl.java:490)
>>         at com.carrotsearch.randomizedtesting.RandomizedRunner.runSingleTest(RandomizedRunner.java:955)
>>         at com.carrotsearch.randomizedtesting.RandomizedRunner$5.evaluate(RandomizedRunner.java:840)
>>
>> ---------------------------------------------------------------------
>> To unsubscribe, e-mail: builds-unsubscribe@lucene.apache.org
>> For additional commands, e-mail: builds-help@lucene.apache.org

---------------------------------------------------------------------
To unsubscribe, e-mail: dev-unsubscribe@lucene.apache.org
For additional commands, e-mail: dev-help@lucene.apache.org


Re: [JENKINS-EA] Lucene-nightly-main-Linux (64bit/hotspot/jdk-25-ea+15) - Build # 20 - Unstable!

Posted by Dawid Weiss <da...@gmail.com>.
I filed https://github.com/apache/lucene/issues/14508

On Tue, Apr 15, 2025 at 8:58 PM Dawid Weiss <da...@gmail.com> wrote:
>
>
> This fails in TestIndexWriterDelete.testDeleteAllRepeated, with the heap indicating byte buffers directory is taking up all the space -
>
>
>
> Should this test be allowed to write to ram? It writes a lot.
>
> Dawid
>
> On Tue, Apr 15, 2025 at 5:05 PM Policeman Jenkins Server <je...@thetaphi.de> wrote:
>>
>> Build: https://jenkins.thetaphi.de/job/Lucene-nightly-main-Linux/20/
>> Java: 64bit/hotspot/jdk-25-ea+15 -XX:-UseCompressedOops -XX:+UseSerialGC
>>
>> 1 tests failed.
>> FAILED:  org.apache.lucene.index.TestIndexWriterDelete.testDeleteAllRepeated
>>
>> Error Message:
>> java.lang.OutOfMemoryError: Java heap space
>>
>> Stack Trace:
>> java.lang.OutOfMemoryError: Java heap space
>>         at __randomizedtesting.SeedInfo.seed([98BA3033CB41FA31:EECDCE6E3B12EC2B]:0)
>>         at java.base/java.util.HashMap.resize(HashMap.java:711)
>>         at java.base/java.util.HashMap.putVal(HashMap.java:670)
>>         at java.base/java.util.HashMap.put(HashMap.java:619)
>>         at java.base/java.util.HashSet.add(HashSet.java:230)
>>         at org.apache.lucene.index.IndexFileDeleter.refresh(IndexFileDeleter.java:489)
>>         at org.apache.lucene.index.IndexWriter.rollbackInternalNoCommit(IndexWriter.java:2559)
>>         at org.apache.lucene.index.IndexWriter.rollbackInternal(IndexWriter.java:2477)
>>         at org.apache.lucene.index.IndexWriter.shutdown(IndexWriter.java:1342)
>>         at org.apache.lucene.index.IndexWriter.close(IndexWriter.java:1370)
>>         at org.apache.lucene.index.TestIndexWriterDelete.testDeleteAllRepeated(TestIndexWriterDelete.java:525)
>>         at java.base/java.lang.invoke.LambdaForm$DMH/0x00007104840a5400.invokeVirtual(LambdaForm$DMH)
>>         at java.base/java.lang.invoke.LambdaForm$MH/0x000071048403c800.invoke(LambdaForm$MH)
>>         at java.base/java.lang.invoke.Invokers$Holder.invokeExact_MT(Invokers$Holder)
>>         at java.base/jdk.internal.reflect.DirectMethodHandleAccessor.invokeImpl(DirectMethodHandleAccessor.java:154)
>>         at java.base/jdk.internal.reflect.DirectMethodHandleAccessor.invoke(DirectMethodHandleAccessor.java:104)
>>         at java.base/java.lang.reflect.Method.invoke(Method.java:565)
>>         at com.carrotsearch.randomizedtesting.RandomizedRunner.invoke(RandomizedRunner.java:1758)
>>         at com.carrotsearch.randomizedtesting.RandomizedRunner$8.evaluate(RandomizedRunner.java:946)
>>         at com.carrotsearch.randomizedtesting.RandomizedRunner$9.evaluate(RandomizedRunner.java:982)
>>         at com.carrotsearch.randomizedtesting.RandomizedRunner$10.evaluate(RandomizedRunner.java:996)
>>         at org.apache.lucene.tests.util.TestRuleSetupTeardownChained$1.evaluate(TestRuleSetupTeardownChained.java:48)
>>         at org.apache.lucene.tests.util.AbstractBeforeAfterRule$1.evaluate(AbstractBeforeAfterRule.java:43)
>>         at org.apache.lucene.tests.util.TestRuleThreadAndTestName$1.evaluate(TestRuleThreadAndTestName.java:45)
>>         at org.apache.lucene.tests.util.TestRuleIgnoreAfterMaxFailures$1.evaluate(TestRuleIgnoreAfterMaxFailures.java:60)
>>         at org.apache.lucene.tests.util.TestRuleMarkFailure$1.evaluate(TestRuleMarkFailure.java:44)
>>         at org.junit.rules.RunRules.evaluate(RunRules.java:20)
>>         at com.carrotsearch.randomizedtesting.rules.StatementAdapter.evaluate(StatementAdapter.java:36)
>>         at com.carrotsearch.randomizedtesting.ThreadLeakControl$StatementRunner.run(ThreadLeakControl.java:390)
>>         at com.carrotsearch.randomizedtesting.ThreadLeakControl.forkTimeoutingTask(ThreadLeakControl.java:843)
>>         at com.carrotsearch.randomizedtesting.ThreadLeakControl$3.evaluate(ThreadLeakControl.java:490)
>>         at com.carrotsearch.randomizedtesting.RandomizedRunner.runSingleTest(RandomizedRunner.java:955)
>>         at com.carrotsearch.randomizedtesting.RandomizedRunner$5.evaluate(RandomizedRunner.java:840)
>>
>> ---------------------------------------------------------------------
>> To unsubscribe, e-mail: builds-unsubscribe@lucene.apache.org
>> For additional commands, e-mail: builds-help@lucene.apache.org

---------------------------------------------------------------------
To unsubscribe, e-mail: builds-unsubscribe@lucene.apache.org
For additional commands, e-mail: builds-help@lucene.apache.org