You are viewing a plain text version of this content. The canonical link for it is here.
Posted to issues@flink.apache.org by "Guowei Ma (Jira)" <ji...@apache.org> on 2021/03/29 03:57:00 UTC

[jira] [Commented] (FLINK-21659) Running HA per-job cluster (rocks, incremental) end-to-end test fails

    [ https://issues.apache.org/jira/browse/FLINK-21659?page=com.atlassian.jira.plugin.system.issuetabpanels:comment-tabpanel&focusedCommentId=17310373#comment-17310373 ] 

Guowei Ma commented on FLINK-21659:
-----------------------------------

https://dev.azure.com/apache-flink/apache-flink/_build/results?buildId=15573&view=logs&j=4dd4dbdd-1802-5eb7-a518-6acd9d24d0fc&t=8d6b4dd3-4ca1-5611-1743-57a7d76b395a&l=1733


> Running HA per-job cluster (rocks, incremental) end-to-end test fails
> ---------------------------------------------------------------------
>
>                 Key: FLINK-21659
>                 URL: https://issues.apache.org/jira/browse/FLINK-21659
>             Project: Flink
>          Issue Type: Bug
>          Components: Runtime / Coordination
>    Affects Versions: 1.13.0
>            Reporter: Guowei Ma
>            Priority: Critical
>              Labels: test-stability
>
> https://dev.azure.com/apache-flink/apache-flink/_build/results?buildId=14232&view=logs&j=4dd4dbdd-1802-5eb7-a518-6acd9d24d0fc&t=8d6b4dd3-4ca1-5611-1743-57a7d76b395a
> It seems that the task deploy tasks to the TaskManager0 failed and it causes the checkpoint fails.
> {code:java}
> java.util.concurrent.CompletionException: java.util.concurrent.TimeoutException: Invocation of public abstract java.util.concurrent.CompletableFuture org.apache.flink.runtime.taskexecutor.TaskExecutorGateway.submitTask(org.apache.flink.runtime.deployment.TaskDeploymentDescriptor,org.apache.flink.runtime.jobmaster.JobMasterId,org.apache.flink.api.common.time.Time) timed out.
>         at java.util.concurrent.CompletableFuture.encodeRelay(CompletableFuture.java:326) ~[?:1.8.0_282]
>         at java.util.concurrent.CompletableFuture.completeRelay(CompletableFuture.java:338) ~[?:1.8.0_282]
>         at java.util.concurrent.CompletableFuture.uniRelay(CompletableFuture.java:925) ~[?:1.8.0_282]
>         at java.util.concurrent.CompletableFuture$UniRelay.tryFire(CompletableFuture.java:913) ~[?:1.8.0_282]
>         at java.util.concurrent.CompletableFuture.postComplete(CompletableFuture.java:488) ~[?:1.8.0_282]
>         at java.util.concurrent.CompletableFuture.completeExceptionally(CompletableFuture.java:1990) ~[?:1.8.0_282]
>         at org.apache.flink.runtime.rpc.akka.AkkaInvocationHandler.lambda$invokeRpc$0(AkkaInvocationHandler.java:234) ~[flink-dist_2.11-1.13-SNAPSHOT.jar:1.13-SNAPSHOT]
>         at java.util.concurrent.CompletableFuture.uniWhenComplete(CompletableFuture.java:774) ~[?:1.8.0_282]
>         at java.util.concurrent.CompletableFuture$UniWhenComplete.tryFire(CompletableFuture.java:750) ~[?:1.8.0_282]
>         at java.util.concurrent.CompletableFuture.postComplete(CompletableFuture.java:488) ~[?:1.8.0_282]
>         at java.util.concurrent.CompletableFuture.completeExceptionally(CompletableFuture.java:1990) ~[?:1.8.0_282]
>         at org.apache.flink.runtime.concurrent.FutureUtils$1.onComplete(FutureUtils.java:1064) ~[flink-dist_2.11-1.13-SNAPSHOT.jar:1.13-SNAPSHOT]
>         at akka.dispatch.OnComplete.internal(Future.scala:263) ~[flink-dist_2.11-1.13-SNAPSHOT.jar:1.13-SNAPSHOT]
>         at akka.dispatch.OnComplete.internal(Future.scala:261) ~[flink-dist_2.11-1.13-SNAPSHOT.jar:1.13-SNAPSHOT]
>         at akka.dispatch.japi$CallbackBridge.apply(Future.scala:191) ~[flink-dist_2.11-1.13-SNAPSHOT.jar:1.13-SNAPSHOT]
>         at akka.dispatch.japi$CallbackBridge.apply(Future.scala:188) ~[flink-dist_2.11-1.13-SNAPSHOT.jar:1.13-SNAPSHOT]
>         at scala.concurrent.impl.CallbackRunnable.run(Promise.scala:36) ~[flink-dist_2.11-1.13-SNAPSHOT.jar:1.13-SNAPSHOT]
>         at org.apache.flink.runtime.concurrent.Executors$DirectExecutionContext.execute(Executors.java:73) ~[flink-dist_2.11-1.13-SNAPSHOT.jar:1.13-SNAPSHOT]
>         at scala.concurrent.impl.CallbackRunnable.executeWithValue(Promise.scala:44) ~[flink-dist_2.11-1.13-SNAPSHOT.jar:1.13-SNAPSHOT]
>         at scala.concurrent.impl.Promise$DefaultPromise.tryComplete(Promise.scala:252) ~[flink-dist_2.11-1.13-SNAPSHOT.jar:1.13-SNAPSHOT]
>         at akka.pattern.PromiseActorRef$$anonfun$1.apply$mcV$sp(AskSupport.scala:644) ~[flink-dist_2.11-1.13-SNAPSHOT.jar:1.13-SNAPSHOT]
>         at akka.actor.Scheduler$$anon$4.run(Scheduler.scala:205) ~[flink-dist_2.11-1.13-SNAPSHOT.jar:1.13-SNAPSHOT]
>         at scala.concurrent.Future$InternalCallbackExecutor$.unbatchedExecute(Future.scala:601) ~[flink-dist_2.11-1.13-SNAPSHOT.jar:1.13-SNAPSHOT]
>         at scala.concurrent.BatchingExecutor$class.execute(BatchingExecutor.scala:109) ~[flink-dist_2.11-1.13-SNAPSHOT.jar:1.13-SNAPSHOT]
>         at scala.concurrent.Future$InternalCallbackExecutor$.execute(Future.scala:599) ~[flink-dist_2.11-1.13-SNAPSHOT.jar:1.13-SNAPSHOT]
>         at akka.actor.LightArrayRevolverScheduler$TaskHolder.executeTask(LightArrayRevolverScheduler.scala:328) ~[flink-dist_2.11-1.13-SNAPSHOT.jar:1.13-SNAPSHOT]
>         at akka.actor.LightArrayRevolverScheduler$$anon$4.executeBucket$1(LightArrayRevolverScheduler.scala:279) ~[flink-dist_2.11-1.13-SNAPSHOT.jar:1.13-SNAPSHOT]
>         at akka.actor.LightArrayRevolverScheduler$$anon$4.nextTick(LightArrayRevolverScheduler.scala:283) ~[flink-dist_2.11-1.13-SNAPSHOT.jar:1.13-SNAPSHOT]
>         at akka.actor.LightArrayRevolverScheduler$$anon$4.run(LightArrayRevolverScheduler.scala:235) ~[flink-dist_2.11-1.13-SNAPSHOT.jar:1.13-SNAPSHOT]
>         at java.lang.Thread.run(Thread.java:748) ~[?:1.8.0_282]
> Caused by: java.util.concurrent.TimeoutException: Invocation of public abstract java.util.concurrent.CompletableFuture org.apache.flink.runtime.taskexecutor.TaskExecutorGateway.submitTask(org.apache.flink.runtime.deployment.TaskDeploymentDescriptor,org.apache.flink.runtime.jobmaster.JobMasterId,org.apache.flink.api.common.time.Time) timed out.
>         at org.apache.flink.runtime.jobmaster.RpcTaskManagerGateway.submitTask(RpcTaskManagerGateway.java:60) ~[flink-dist_2.11-1.13-SNAPSHOT.jar:1.13-SNAPSHOT]
>         at org.apache.flink.runtime.executiongraph.Execution.lambda$deploy$5(Execution.java:592) ~[flink-dist_2.11-1.13-SNAPSHOT.jar:1.13-SNAPSHOT]
>         at java.util.concurrent.CompletableFuture$AsyncSupply.run(CompletableFuture.java:1604) ~[?:1.8.0_282]
>         at java.util.concurrent.Executors$RunnableAdapter.call(Executors.java:511) ~[?:1.8.0_282]
>         at java.util.concurrent.FutureTask.run(FutureTask.java:266) ~[?:1.8.0_282]
>         at java.util.concurrent.ScheduledThreadPoolExecutor$ScheduledFutureTask.access$201(ScheduledThreadPoolExecutor.java:180) ~[?:1.8.0_282]
>         at java.util.concurrent.ScheduledThreadPoolExecutor$ScheduledFutureTask.run(ScheduledThreadPoolExecutor.java:293) ~[?:1.8.0_282]
>         at java.util.concurrent.ThreadPoolExecutor.runWorker(ThreadPoolExecutor.java:1149) ~[?:1.8.0_282]
>         at java.util.concurrent.ThreadPoolExecutor$Worker.run(ThreadPoolExecutor.java:624) ~[?:1.8.0_282]
>         ... 1 more
> Caused by: akka.pattern.AskTimeoutException: Ask timed out on [Actor[akka.tcp://flink@10.1.0.4:35179/user/rpc/taskmanager_0#1422311381]] after [10000 ms]. Message of type [org.apache.flink.runtime.rpc.messages.RemoteRpcInvocation]. A typical reason for `AskTimeoutException` is that the recipient actor didn't send a reply.
>         at akka.pattern.PromiseActorRef$$anonfun$2.apply(AskSupport.scala:635) ~[flink-dist_2.11-1.13-SNAPSHOT.jar:1.13-SNAPSHOT]
>         at akka.pattern.PromiseActorRef$$anonfun$2.apply(AskSupport.scala:635) ~[flink-dist_2.11-1.13-SNAPSHOT.jar:1.13-SNAPSHOT]
>         at akka.pattern.PromiseActorRef$$anonfun$1.apply$mcV$sp(AskSupport.scala:648) ~[flink-dist_2.11-1.13-SNAPSHOT.jar:1.13-SNAPSHOT]
>         ... 9 more
> {code}



--
This message was sent by Atlassian Jira
(v8.3.4#803005)