You are viewing a plain text version of this content. The canonical link for it is here.
Posted to builds@beam.apache.org by Apache Jenkins Server <je...@builds.apache.org> on 2021/05/05 00:10:30 UTC

Build failed in Jenkins: beam_PostCommit_Java_Examples_Dataflow_V2 #695

See <https://ci-beam.apache.org/job/beam_PostCommit_Java_Examples_Dataflow_V2/695/display/redirect?page=changes>

Changes:

[shoyer] Use __getstate__ & __setstate__ for deterministic coding

[shoyer] Re-raise exceptions during deterministic encoding

[shoyer] Add test for non-deterministic inputs

[Kenneth Knowles] [BEAM-12273] Support non-multimap materialization in Twister2 runner

[Ismaël Mejía] [BEAM-12280] Upgrade Flink runner to Flink version 1.12.3


------------------------------------------
[...truncated 47.31 KB...]
> Task :sdks:java:container:pullLicenses
DEPRECATION: Python 3.5 reached the end of its life on September 13th, 2020. Please upgrade your Python as Python 3.5 is no longer maintained. pip 21.0 will drop support for Python 3.5 in January 2021. pip 21.0 will remove support for this functionality.
Collecting beautifulsoup4<5.0,>=4.9.0
  Using cached beautifulsoup4-4.9.3-py3-none-any.whl (115 kB)
Collecting future<1.0.0,>=0.16.0
  Using cached future-0.18.2-py3-none-any.whl
Collecting pyyaml<6.0.0,>=3.12
  Using cached PyYAML-5.3.1-cp35-cp35m-linux_x86_64.whl
Collecting tenacity<6.0,>=5.0.2
  Using cached tenacity-5.1.5-py2.py3-none-any.whl (34 kB)
Collecting soupsieve>1.2
  Using cached soupsieve-2.1-py3-none-any.whl (32 kB)
Collecting six>=1.9.0
  Using cached six-1.15.0-py2.py3-none-any.whl (10 kB)
Installing collected packages: soupsieve, six, tenacity, pyyaml, future, beautifulsoup4
Successfully installed beautifulsoup4-4.9.3 future-0.18.2 pyyaml-5.3.1 six-1.15.0 soupsieve-2.1 tenacity-5.1.5
Executing <https://ci-beam.apache.org/job/beam_PostCommit_Java_Examples_Dataflow_V2/ws/src/sdks/java/container/build/virtualenv/bin/python> <https://ci-beam.apache.org/job/beam_PostCommit_Java_Examples_Dataflow_V2/ws/src/sdks/java/container/license_scripts/pull_licenses_java.py> --license_index=<https://ci-beam.apache.org/job/beam_PostCommit_Java_Examples_Dataflow_V2/ws/src/sdks/java/container/build/reports/dependency-license/index.json>        --output_dir=<https://ci-beam.apache.org/job/beam_PostCommit_Java_Examples_Dataflow_V2/ws/src/sdks/java/container/build/target/java_third_party_licenses>        --dep_url_yaml=<https://ci-beam.apache.org/job/beam_PostCommit_Java_Examples_Dataflow_V2/ws/src/sdks/java/container/license_scripts/dep_urls_java.yaml> 
INFO:root:Pulling license for 208 dependencies using 16 threads.

> Task :sdks:java:harness:shadowJar FROM-CACHE

> Task :sdks:go:resolveBuildDependencies
Resolving golang.org/x/crypto: commit='d9133f5469342136e669e85192a26056b587f503', urls=[https://go.googlesource.com/crypto]
Resolving golang.org/x/debug: commit='95515998a8a4bd7448134b2cb5971dbeb12e0b77', urls=[https://go.googlesource.com/debug]
Resolving golang.org/x/net: commit='2fb46b16b8dda405028c50f7c7f0f9dd1fa6bfb1', urls=[https://go.googlesource.com/net]
Resolving golang.org/x/oauth2: commit='5d25da1a8d43b66f2898c444f899c7bcfd6a407e', urls=[https://go.googlesource.com/oauth2]
Resolving golang.org/x/sync: commit='fd80eb99c8f653c847d294a001bdf2a3a6f768f5', urls=[https://go.googlesource.com/sync]

> Task :runners:java-fn-execution:compileJava FROM-CACHE
> Task :runners:java-fn-execution:classes UP-TO-DATE

> Task :sdks:java:container:pullLicenses
INFO:root:pull_licenses_java.py succeed. It took 8.495068 seconds with 16 threads.
Copying licenses from <https://ci-beam.apache.org/job/beam_PostCommit_Java_Examples_Dataflow_V2/ws/src/sdks/java/container/build/target/java_third_party_licenses> to <https://ci-beam.apache.org/job/beam_PostCommit_Java_Examples_Dataflow_V2/ws/src/sdks/java/container/build/target/third_party_licenses.>

> Task :runners:java-fn-execution:jar
> Task :sdks:java:expansion-service:compileJava FROM-CACHE
> Task :sdks:java:expansion-service:classes UP-TO-DATE
> Task :sdks:java:expansion-service:jar
> Task :runners:direct-java:compileJava FROM-CACHE
> Task :sdks:java:extensions:ml:compileJava FROM-CACHE
> Task :sdks:java:extensions:ml:classes UP-TO-DATE
> Task :sdks:java:io:kafka:compileJava FROM-CACHE
> Task :sdks:java:io:kafka:classes UP-TO-DATE

> Task :sdks:java:container:pullLicenses
Finished license_scripts.sh

> Task :runners:direct-java:classes UP-TO-DATE
> Task :sdks:java:extensions:ml:jar
> Task :sdks:java:container:java8:copyJavaThirdPartyLicenses NO-SOURCE

> Task :sdks:go:resolveBuildDependencies
Resolving golang.org/x/sys: commit='fde4db37ae7ad8191b03d30d27f258b5291ae4e3', urls=[https://go.googlesource.com/sys]

> Task :sdks:java:io:kafka:jar
> Task :runners:direct-java:shadowJar FROM-CACHE
> Task :sdks:java:io:google-cloud-platform:compileJava FROM-CACHE
> Task :sdks:java:io:google-cloud-platform:classes UP-TO-DATE
> Task :sdks:java:io:google-cloud-platform:jar
> Task :runners:google-cloud-dataflow-java:compileJava FROM-CACHE
> Task :runners:google-cloud-dataflow-java:classes
> Task :examples:java:compileJava FROM-CACHE
> Task :examples:java:classes UP-TO-DATE
> Task :runners:google-cloud-dataflow-java:jar
> Task :examples:java:jar
> Task :sdks:java:container:java8:copyDockerfileDependencies
> Task :examples:java:compileTestJava FROM-CACHE
> Task :examples:java:testClasses
> Task :examples:java:testJar

> Task :release:go-licenses:java:dockerRun
+ go-licenses save github.com/apache/beam/sdks/java/container --save_path=/output/licenses

> Task :sdks:go:resolveBuildDependencies
Resolving golang.org/x/text: commit='23ae387dee1f90d29a23c0e87ee0b46038fbed0e', urls=[https://go.googlesource.com/text]
Resolving cached github.com/etcd-io/etcd: commit='11214aa33bf5a47d3d9d8dafe0f6b97237dfe921', urls=[https://github.com/etcd-io/etcd.git, git@github.com:etcd-io/etcd.git]

> Task :release:go-licenses:java:dockerRun
+ go-licenses csv github.com/apache/beam/sdks/java/container
+ tee /output/licenses/list.csv
github.com/apache/beam/sdks/java/container,https://github.com/apache/beam/blob/master/LICENSE,Apache-2.0
github.com/apache/beam/sdks/go/pkg/beam,https://github.com/apache/beam/blob/master/sdks/go/README.md,Apache-2.0
golang.org/x/net,https://go.googlesource.com/net/+/refs/heads/master/LICENSE,BSD-3-Clause
google.golang.org/genproto/googleapis/rpc/status,https://github.com/googleapis/go-genproto/blob/master/LICENSE,Apache-2.0
golang.org/x/text,https://go.googlesource.com/text/+/refs/heads/master/LICENSE,BSD-3-Clause
github.com/golang/protobuf,https://github.com/golang/protobuf/blob/master/LICENSE,BSD-3-Clause
google.golang.org/protobuf,https://go.googlesource.com/protobuf/+/refs/heads/master/LICENSE,BSD-3-Clause
google.golang.org/grpc,https://github.com/grpc/grpc-go/blob/master/LICENSE,Apache-2.0
golang.org/x/sys,https://go.googlesource.com/sys/+/refs/heads/master/LICENSE,BSD-3-Clause
+ chmod -R a+w /output/licenses

> Task :release:go-licenses:java:createLicenses
> Task :sdks:java:container:java8:copyGolangLicenses

> Task :sdks:go:resolveBuildDependencies
Resolving google.golang.org/api: commit='0324d5e90dc7753607860272666845fad9ceb97e', urls=[https://code.googlesource.com/google-api-go-client]
Resolving google.golang.org/genproto: commit='4d944d34d83c502a5f761500a14d8842648415c3', urls=[https://github.com/google/go-genproto]
Resolving google.golang.org/grpc: commit='5e8f83304c0563d1ba74db05fee83d9c18ab9a58', urls=[https://github.com/grpc/grpc-go]
Resolving google.golang.org/protobuf: commit='d165be301fb1e13390ad453281ded24385fd8ebc', urls=[https://go.googlesource.com/protobuf]
Resolving cached github.com/etcd-io/etcd: commit='11214aa33bf5a47d3d9d8dafe0f6b97237dfe921', urls=[https://github.com/etcd-io/etcd.git, git@github.com:etcd-io/etcd.git]
Resolving cached github.com/etcd-io/etcd: commit='11214aa33bf5a47d3d9d8dafe0f6b97237dfe921', urls=[https://github.com/etcd-io/etcd.git, git@github.com:etcd-io/etcd.git]

> Task :sdks:go:installDependencies
> Task :sdks:go:buildLinuxAmd64
> Task :sdks:go:goBuild

> Task :sdks:java:container:resolveBuildDependencies
Resolving ./github.com/apache/beam/sdks/go@<https://ci-beam.apache.org/job/beam_PostCommit_Java_Examples_Dataflow_V2/ws/src/sdks/go>

> Task :sdks:java:container:installDependencies

> Task :sdks:java:container:buildLinuxAmd64
Unable to watch the file system for changes. The inotify watches limit is too low.

> Task :sdks:java:container:goBuild
> Task :sdks:java:container:java8:copySdkHarnessLauncher
> Task :sdks:java:container:java8:dockerPrepare
> Task :sdks:java:container:java8:docker

> Task :runners:google-cloud-dataflow-java:buildAndPushDockerContainer
WARNING: `gcloud docker` will not be supported for Docker client versions above 18.03.

As an alternative, use `gcloud auth configure-docker` to configure `docker` to
use `gcloud` as a credential helper, then use `docker` as you would for non-GCR
registries, e.g. `docker pull gcr.io/project-id/my-image`. Add
`--verbosity=error` to silence this warning: `gcloud docker
--verbosity=error -- pull gcr.io/project-id/my-image`.

See: https://cloud.google.com/container-registry/docs/support/deprecation-notices#gcloud-docker

The push refers to repository [us.gcr.io/apache-beam-testing/java-postcommit-it/java]
544661c872ff: Preparing
4821c20f03b3: Preparing
993b4cb2dced: Preparing
b283b33c234b: Preparing
7f6417ea76f1: Preparing
2e9c8e8cafa4: Preparing
25b57ee4b608: Preparing
af19bf27c01c: Preparing
45015d8a58c2: Preparing
553830591619: Preparing
cda4a9b37d30: Preparing
b59accdefb18: Preparing
af19bf27c01c: Waiting
d8460eb1eb77: Preparing
45015d8a58c2: Waiting
2e9c8e8cafa4: Waiting
553830591619: Waiting
30b0cc543ee7: Preparing
26863b4714ee: Preparing
25b57ee4b608: Waiting
b59accdefb18: Waiting
5d5962699bd5: Preparing
a42439ce9650: Preparing
26270c5e25fa: Preparing
d8460eb1eb77: Waiting
26863b4714ee: Waiting
e2c6ff462357: Preparing
5d5962699bd5: Waiting
a42439ce9650: Waiting
cda4a9b37d30: Waiting
7f6417ea76f1: Pushed
4821c20f03b3: Pushed
993b4cb2dced: Pushed
544661c872ff: Pushed
af19bf27c01c: Pushed
2e9c8e8cafa4: Pushed
b283b33c234b: Pushed
45015d8a58c2: Pushed
d8460eb1eb77: Layer already exists
cda4a9b37d30: Pushed
30b0cc543ee7: Layer already exists
26863b4714ee: Layer already exists
5d5962699bd5: Layer already exists
a42439ce9650: Layer already exists
26270c5e25fa: Layer already exists
b59accdefb18: Pushed
e2c6ff462357: Layer already exists
25b57ee4b608: Pushed
553830591619: Pushed
20210505000106: digest: sha256:0cb141586cdcc7632c9fb53e94c7e64c12edb2d4b37a167e720eaf362d8908da size: 4310

> Task :runners:google-cloud-dataflow-java:examplesJavaRunnerV2IntegrationTest

org.apache.beam.examples.snippets.transforms.io.gcp.bigquery.BigQuerySamplesIT > testTableIO FAILED
    java.lang.NullPointerException at BigQuerySamplesIT.java:108

org.apache.beam.examples.cookbook.BigQueryTornadoesIT > testE2EBigQueryTornadoesWithExportUsingQuery FAILED
    java.lang.NullPointerException at BigQueryTornadoesIT.java:68

org.apache.beam.examples.complete.TfIdfIT > testE2ETfIdf FAILED
    java.lang.NullPointerException at TfIdfIT.java:70

org.apache.beam.examples.complete.TrafficRoutesIT > testE2ETrafficRoutes FAILED
    java.lang.NullPointerException at TrafficRoutesIT.java:74

org.apache.beam.examples.cookbook.BigQueryTornadoesIT > testE2EBigQueryTornadoesWithExport FAILED
    java.lang.NullPointerException at BigQueryTornadoesIT.java:68

org.apache.beam.examples.cookbook.BigQueryTornadoesIT > testE2eBigQueryTornadoesWithStorageApi FAILED
    java.lang.NullPointerException at BigQueryTornadoesIT.java:68

org.apache.beam.examples.cookbook.BigQueryTornadoesIT > testE2eBigQueryTornadoesWithStorageApiUsingQuery FAILED
    java.lang.NullPointerException at BigQueryTornadoesIT.java:68

org.apache.beam.examples.complete.TrafficMaxLaneFlowIT > testE2ETrafficMaxLaneFlow FAILED
    java.lang.NullPointerException at TrafficMaxLaneFlowIT.java:74

8 tests completed, 8 failed

> Task :runners:google-cloud-dataflow-java:examplesJavaRunnerV2IntegrationTest FAILED

> Task :runners:google-cloud-dataflow-java:cleanUpDockerImages
Untagged: us.gcr.io/apache-beam-testing/java-postcommit-it/java:20210505000106
Untagged: us.gcr.io/apache-beam-testing/java-postcommit-it/java@sha256:0cb141586cdcc7632c9fb53e94c7e64c12edb2d4b37a167e720eaf362d8908da
Digests:
- us.gcr.io/apache-beam-testing/java-postcommit-it/java@sha256:0cb141586cdcc7632c9fb53e94c7e64c12edb2d4b37a167e720eaf362d8908da
  Associated tags:
 - 20210505000106
Tags:
- us.gcr.io/apache-beam-testing/java-postcommit-it/java:20210505000106
Deleted [us.gcr.io/apache-beam-testing/java-postcommit-it/java:20210505000106].
Deleted [us.gcr.io/apache-beam-testing/java-postcommit-it/java@sha256:0cb141586cdcc7632c9fb53e94c7e64c12edb2d4b37a167e720eaf362d8908da].

FAILURE: Build failed with an exception.

* What went wrong:
Execution failed for task ':runners:google-cloud-dataflow-java:examplesJavaRunnerV2IntegrationTest'.
> There were failing tests. See the report at: file://<https://ci-beam.apache.org/job/beam_PostCommit_Java_Examples_Dataflow_V2/ws/src/runners/google-cloud-dataflow-java/build/reports/tests/examplesJavaRunnerV2IntegrationTest/index.html>

* Try:
Run with --stacktrace option to get the stack trace. Run with --info or --debug option to get more log output. Run with --scan to get full insights.

* Get more help at https://help.gradle.org

Deprecated Gradle features were used in this build, making it incompatible with Gradle 7.0.
Use '--warning-mode all' to show the individual deprecation warnings.
See https://docs.gradle.org/6.8.3/userguide/command_line_interface.html#sec:command_line_warnings

BUILD FAILED in 9m 59s
107 actionable tasks: 75 executed, 30 from cache, 2 up-to-date
Gradle was unable to watch the file system for changes. The inotify watches limit is too low.

Publishing build scan...
https://gradle.com/s/lwxxeoezxvpbi

Build step 'Invoke Gradle script' changed build result to FAILURE
Build step 'Invoke Gradle script' marked build as failure

---------------------------------------------------------------------
To unsubscribe, e-mail: builds-unsubscribe@beam.apache.org
For additional commands, e-mail: builds-help@beam.apache.org


Jenkins build is back to normal : beam_PostCommit_Java_Examples_Dataflow_V2 #699

Posted by Apache Jenkins Server <je...@builds.apache.org>.
See <https://ci-beam.apache.org/job/beam_PostCommit_Java_Examples_Dataflow_V2/699/display/redirect?page=changes>


---------------------------------------------------------------------
To unsubscribe, e-mail: builds-unsubscribe@beam.apache.org
For additional commands, e-mail: builds-help@beam.apache.org


Build failed in Jenkins: beam_PostCommit_Java_Examples_Dataflow_V2 #698

Posted by Apache Jenkins Server <je...@builds.apache.org>.
See <https://ci-beam.apache.org/job/beam_PostCommit_Java_Examples_Dataflow_V2/698/display/redirect?page=changes>

Changes:

[Maximilian Michels] [BEAM-11754] Update docs about EOS support


------------------------------------------
[...truncated 45.84 KB...]
Resolving cached github.com/etcd-io/etcd: commit='11214aa33bf5a47d3d9d8dafe0f6b97237dfe921', urls=[https://github.com/etcd-io/etcd.git, git@github.com:etcd-io/etcd.git]
Resolving cached github.com/etcd-io/etcd: commit='11214aa33bf5a47d3d9d8dafe0f6b97237dfe921', urls=[https://github.com/etcd-io/etcd.git, git@github.com:etcd-io/etcd.git]
Resolving github.com/prometheus/procfs: commit='cb4147076ac75738c9a7d279075a253c0cc5acbd', urls=[https://github.com/prometheus/procfs.git, git@github.com:prometheus/procfs.git]
Resolving github.com/rcrowley/go-metrics: commit='8732c616f52954686704c8645fe1a9d59e9df7c1', urls=[https://github.com/rcrowley/go-metrics.git, git@github.com:rcrowley/go-metrics.git]
Resolving github.com/cpuguy83/go-md2man: commit='dc9f53734905c233adfc09fd4f063dce63ce3daf', urls=[https://github.com/cpuguy83/go-md2man.git, git@github.com:cpuguy83/go-md2man.git]
Resolving cached github.com/cpuguy83/go-md2man: commit='dc9f53734905c233adfc09fd4f063dce63ce3daf', urls=[https://github.com/cpuguy83/go-md2man.git, git@github.com:cpuguy83/go-md2man.git]
Resolving cached github.com/etcd-io/etcd: commit='11214aa33bf5a47d3d9d8dafe0f6b97237dfe921', urls=[https://github.com/etcd-io/etcd.git, git@github.com:etcd-io/etcd.git]
Resolving cached github.com/etcd-io/etcd: commit='11214aa33bf5a47d3d9d8dafe0f6b97237dfe921', urls=[https://github.com/etcd-io/etcd.git, git@github.com:etcd-io/etcd.git]
Resolving github.com/spf13/afero: commit='bb8f1927f2a9d3ab41c9340aa034f6b803f4359c', urls=[https://github.com/spf13/afero.git, git@github.com:spf13/afero.git]
Resolving github.com/spf13/cast: commit='acbeb36b902d72a7a4c18e8f3241075e7ab763e4', urls=[https://github.com/spf13/cast.git, git@github.com:spf13/cast.git]
Resolving github.com/spf13/cobra: commit='93959269ad99e80983c9ba742a7e01203a4c0e4f', urls=[https://github.com/spf13/cobra.git, git@github.com:spf13/cobra.git]
Resolving github.com/spf13/jwalterweatherman: commit='7c0cea34c8ece3fbeb2b27ab9b59511d360fb394', urls=[https://github.com/spf13/jwalterweatherman.git, git@github.com:spf13/jwalterweatherman.git]
Resolving cached github.com/etcd-io/etcd: commit='11214aa33bf5a47d3d9d8dafe0f6b97237dfe921', urls=[https://github.com/etcd-io/etcd.git, git@github.com:etcd-io/etcd.git]
Resolving github.com/spf13/viper: commit='aafc9e6bc7b7bb53ddaa75a5ef49a17d6e654be5', urls=[https://github.com/spf13/viper.git, git@github.com:spf13/viper.git]
Resolving github.com/stathat/go: commit='74669b9f388d9d788c97399a0824adbfee78400e', urls=[https://github.com/stathat/go.git, git@github.com:stathat/go.git]
Resolving cached github.com/etcd-io/etcd: commit='11214aa33bf5a47d3d9d8dafe0f6b97237dfe921', urls=[https://github.com/etcd-io/etcd.git, git@github.com:etcd-io/etcd.git]
Resolving cached github.com/etcd-io/etcd: commit='11214aa33bf5a47d3d9d8dafe0f6b97237dfe921', urls=[https://github.com/etcd-io/etcd.git, git@github.com:etcd-io/etcd.git]
Resolving cached github.com/etcd-io/etcd: commit='11214aa33bf5a47d3d9d8dafe0f6b97237dfe921', urls=[https://github.com/etcd-io/etcd.git, git@github.com:etcd-io/etcd.git]
Resolving cached github.com/etcd-io/etcd: commit='11214aa33bf5a47d3d9d8dafe0f6b97237dfe921', urls=[https://github.com/etcd-io/etcd.git, git@github.com:etcd-io/etcd.git]
Resolving github.com/xordataexchange/crypt: commit='b2862e3d0a775f18c7cfe02273500ae307b61218', urls=[https://github.com/xordataexchange/crypt.git, git@github.com:xordataexchange/crypt.git]
Resolving go.opencensus.io: commit='3fb168f674736c026e623310bfccb0691e6dec8a', urls=[https://github.com/census-instrumentation/opencensus-go]
Resolving golang.org/x/crypto: commit='d9133f5469342136e669e85192a26056b587f503', urls=[https://go.googlesource.com/crypto]
Resolving golang.org/x/debug: commit='95515998a8a4bd7448134b2cb5971dbeb12e0b77', urls=[https://go.googlesource.com/debug]

> Task :runners:java-fn-execution:compileJava FROM-CACHE
> Task :runners:java-fn-execution:classes UP-TO-DATE

> Task :sdks:java:container:pullLicenses
INFO:root:pull_licenses_java.py succeed. It took 4.32836 seconds with 16 threads.
Copying licenses from <https://ci-beam.apache.org/job/beam_PostCommit_Java_Examples_Dataflow_V2/ws/src/sdks/java/container/build/target/java_third_party_licenses> to <https://ci-beam.apache.org/job/beam_PostCommit_Java_Examples_Dataflow_V2/ws/src/sdks/java/container/build/target/third_party_licenses.>
Finished license_scripts.sh

> Task :sdks:java:container:java8:copyJavaThirdPartyLicenses NO-SOURCE
> Task :runners:java-fn-execution:jar
> Task :sdks:java:expansion-service:compileJava FROM-CACHE
> Task :sdks:java:expansion-service:classes UP-TO-DATE
> Task :sdks:java:expansion-service:jar
> Task :runners:direct-java:compileJava FROM-CACHE
> Task :runners:direct-java:classes UP-TO-DATE
> Task :sdks:java:extensions:ml:compileJava FROM-CACHE
> Task :sdks:java:extensions:ml:classes UP-TO-DATE
> Task :runners:direct-java:shadowJar FROM-CACHE
> Task :sdks:java:extensions:ml:jar
> Task :sdks:java:io:google-cloud-platform:compileJava FROM-CACHE
> Task :sdks:java:io:google-cloud-platform:classes UP-TO-DATE
> Task :sdks:java:io:google-cloud-platform:jar

> Task :sdks:go:resolveBuildDependencies
Resolving golang.org/x/net: commit='2fb46b16b8dda405028c50f7c7f0f9dd1fa6bfb1', urls=[https://go.googlesource.com/net]
Resolving golang.org/x/oauth2: commit='5d25da1a8d43b66f2898c444f899c7bcfd6a407e', urls=[https://go.googlesource.com/oauth2]
Resolving golang.org/x/sync: commit='fd80eb99c8f653c847d294a001bdf2a3a6f768f5', urls=[https://go.googlesource.com/sync]
Resolving golang.org/x/sys: commit='fde4db37ae7ad8191b03d30d27f258b5291ae4e3', urls=[https://go.googlesource.com/sys]

> Task :sdks:java:io:kafka:compileJava
Note: Some input files use or override a deprecated API.
Note: Recompile with -Xlint:deprecation for details.
Note: Some input files use unchecked or unsafe operations.
Note: Recompile with -Xlint:unchecked for details.

> Task :sdks:java:io:kafka:classes
> Task :sdks:java:io:kafka:jar
> Task :runners:google-cloud-dataflow-java:compileJava FROM-CACHE
> Task :runners:google-cloud-dataflow-java:classes
> Task :examples:java:compileJava FROM-CACHE
> Task :examples:java:classes UP-TO-DATE
> Task :runners:google-cloud-dataflow-java:jar
> Task :examples:java:jar
> Task :sdks:java:container:java8:copyDockerfileDependencies
> Task :examples:java:compileTestJava FROM-CACHE
> Task :examples:java:testClasses
> Task :examples:java:testJar

> Task :sdks:go:resolveBuildDependencies
Resolving golang.org/x/text: commit='23ae387dee1f90d29a23c0e87ee0b46038fbed0e', urls=[https://go.googlesource.com/text]
Resolving cached github.com/etcd-io/etcd: commit='11214aa33bf5a47d3d9d8dafe0f6b97237dfe921', urls=[https://github.com/etcd-io/etcd.git, git@github.com:etcd-io/etcd.git]

> Task :release:go-licenses:java:dockerRun
+ go-licenses save github.com/apache/beam/sdks/java/container --save_path=/output/licenses
+ tee /output/licenses/list.csv
+ go-licenses csv github.com/apache/beam/sdks/java/container
golang.org/x/sys,https://go.googlesource.com/sys/+/refs/heads/master/LICENSE,BSD-3-Clause
github.com/apache/beam/sdks/go/pkg/beam,https://github.com/apache/beam/blob/master/sdks/go/README.md,Apache-2.0
golang.org/x/net,https://go.googlesource.com/net/+/refs/heads/master/LICENSE,BSD-3-Clause
google.golang.org/genproto/googleapis/rpc/status,https://github.com/googleapis/go-genproto/blob/master/LICENSE,Apache-2.0
google.golang.org/grpc,https://github.com/grpc/grpc-go/blob/master/LICENSE,Apache-2.0
golang.org/x/text,https://go.googlesource.com/text/+/refs/heads/master/LICENSE,BSD-3-Clause
github.com/apache/beam/sdks/java/container,https://github.com/apache/beam/blob/master/LICENSE,Apache-2.0
github.com/golang/protobuf,https://github.com/golang/protobuf/blob/master/LICENSE,BSD-3-Clause
google.golang.org/protobuf,https://go.googlesource.com/protobuf/+/refs/heads/master/LICENSE,BSD-3-Clause
+ chmod -R a+w /output/licenses

> Task :release:go-licenses:java:createLicenses
> Task :sdks:java:container:java8:copyGolangLicenses

> Task :sdks:go:resolveBuildDependencies
Resolving google.golang.org/api: commit='0324d5e90dc7753607860272666845fad9ceb97e', urls=[https://code.googlesource.com/google-api-go-client]
Resolving google.golang.org/genproto: commit='4d944d34d83c502a5f761500a14d8842648415c3', urls=[https://github.com/google/go-genproto]
Resolving google.golang.org/grpc: commit='5e8f83304c0563d1ba74db05fee83d9c18ab9a58', urls=[https://github.com/grpc/grpc-go]
Resolving google.golang.org/protobuf: commit='d165be301fb1e13390ad453281ded24385fd8ebc', urls=[https://go.googlesource.com/protobuf]
Resolving cached github.com/etcd-io/etcd: commit='11214aa33bf5a47d3d9d8dafe0f6b97237dfe921', urls=[https://github.com/etcd-io/etcd.git, git@github.com:etcd-io/etcd.git]
Resolving cached github.com/etcd-io/etcd: commit='11214aa33bf5a47d3d9d8dafe0f6b97237dfe921', urls=[https://github.com/etcd-io/etcd.git, git@github.com:etcd-io/etcd.git]

> Task :sdks:go:installDependencies
> Task :sdks:go:buildLinuxAmd64
> Task :sdks:go:goBuild

> Task :sdks:java:container:resolveBuildDependencies
Unable to watch the file system for changes. The inotify watches limit is too low.
Resolving ./github.com/apache/beam/sdks/go@<https://ci-beam.apache.org/job/beam_PostCommit_Java_Examples_Dataflow_V2/ws/src/sdks/go>

> Task :sdks:java:container:installDependencies
> Task :sdks:java:container:buildLinuxAmd64
> Task :sdks:java:container:goBuild
> Task :sdks:java:container:java8:copySdkHarnessLauncher
> Task :sdks:java:container:java8:dockerPrepare
> Task :sdks:java:container:java8:docker

> Task :runners:google-cloud-dataflow-java:buildAndPushDockerContainer
WARNING: `gcloud docker` will not be supported for Docker client versions above 18.03.

As an alternative, use `gcloud auth configure-docker` to configure `docker` to
use `gcloud` as a credential helper, then use `docker` as you would for non-GCR
registries, e.g. `docker pull gcr.io/project-id/my-image`. Add
`--verbosity=error` to silence this warning: `gcloud docker
--verbosity=error -- pull gcr.io/project-id/my-image`.

See: https://cloud.google.com/container-registry/docs/support/deprecation-notices#gcloud-docker

The push refers to repository [us.gcr.io/apache-beam-testing/java-postcommit-it/java]
4367e4d05d40: Preparing
345d0f2df3b9: Preparing
cd5d38d73a3c: Preparing
89bed3049994: Preparing
831a6c860265: Preparing
1e77a2a80c6f: Preparing
057d16366247: Preparing
93a368d14552: Preparing
41bdfec5ff0b: Preparing
52b9baabb878: Preparing
78337d4f8a38: Preparing
d2071cacbcb9: Preparing
d8460eb1eb77: Preparing
30b0cc543ee7: Preparing
93a368d14552: Waiting
26863b4714ee: Preparing
41bdfec5ff0b: Waiting
5d5962699bd5: Preparing
52b9baabb878: Waiting
057d16366247: Waiting
a42439ce9650: Preparing
26863b4714ee: Waiting
78337d4f8a38: Waiting
30b0cc543ee7: Waiting
d2071cacbcb9: Waiting
d8460eb1eb77: Waiting
26270c5e25fa: Preparing
a42439ce9650: Waiting
5d5962699bd5: Waiting
1e77a2a80c6f: Waiting
e2c6ff462357: Preparing
26270c5e25fa: Waiting
e2c6ff462357: Waiting
345d0f2df3b9: Pushed
cd5d38d73a3c: Pushed
831a6c860265: Pushed
1e77a2a80c6f: Pushed
93a368d14552: Pushed
4367e4d05d40: Pushed
89bed3049994: Pushed
41bdfec5ff0b: Pushed
d8460eb1eb77: Layer already exists
30b0cc543ee7: Layer already exists
26863b4714ee: Layer already exists
5d5962699bd5: Layer already exists
a42439ce9650: Layer already exists
26270c5e25fa: Layer already exists
78337d4f8a38: Pushed
e2c6ff462357: Layer already exists
d2071cacbcb9: Pushed
057d16366247: Pushed
52b9baabb878: Pushed
20210505180112: digest: sha256:9030dd9df867c2208944f6ac952bad0b362091e36aaedc4aa0177c106c66fcb3 size: 4310

> Task :runners:google-cloud-dataflow-java:examplesJavaRunnerV2IntegrationTest

org.apache.beam.examples.cookbook.BigQueryTornadoesIT > testE2EBigQueryTornadoesWithExportUsingQuery FAILED
    java.lang.NullPointerException at BigQueryTornadoesIT.java:68

org.apache.beam.examples.snippets.transforms.io.gcp.bigquery.BigQuerySamplesIT > testTableIO FAILED
    java.lang.NullPointerException at BigQuerySamplesIT.java:108

org.apache.beam.examples.complete.TfIdfIT > testE2ETfIdf FAILED
    java.lang.NullPointerException at TfIdfIT.java:70

org.apache.beam.examples.complete.TrafficRoutesIT > testE2ETrafficRoutes FAILED
    java.lang.NullPointerException at TrafficRoutesIT.java:74

org.apache.beam.examples.cookbook.BigQueryTornadoesIT > testE2EBigQueryTornadoesWithExport FAILED
    java.lang.NullPointerException at BigQueryTornadoesIT.java:68

org.apache.beam.examples.cookbook.BigQueryTornadoesIT > testE2eBigQueryTornadoesWithStorageApi FAILED
    java.lang.NullPointerException at BigQueryTornadoesIT.java:68

org.apache.beam.examples.cookbook.BigQueryTornadoesIT > testE2eBigQueryTornadoesWithStorageApiUsingQuery FAILED
    java.lang.NullPointerException at BigQueryTornadoesIT.java:68

org.apache.beam.examples.complete.TrafficMaxLaneFlowIT > testE2ETrafficMaxLaneFlow FAILED
    java.lang.NullPointerException at TrafficMaxLaneFlowIT.java:74

8 tests completed, 8 failed

> Task :runners:google-cloud-dataflow-java:examplesJavaRunnerV2IntegrationTest FAILED

> Task :runners:google-cloud-dataflow-java:cleanUpDockerImages
Untagged: us.gcr.io/apache-beam-testing/java-postcommit-it/java:20210505180112
Untagged: us.gcr.io/apache-beam-testing/java-postcommit-it/java@sha256:9030dd9df867c2208944f6ac952bad0b362091e36aaedc4aa0177c106c66fcb3
Digests:
- us.gcr.io/apache-beam-testing/java-postcommit-it/java@sha256:9030dd9df867c2208944f6ac952bad0b362091e36aaedc4aa0177c106c66fcb3
  Associated tags:
 - 20210505180112
Tags:
- us.gcr.io/apache-beam-testing/java-postcommit-it/java:20210505180112
Deleted [us.gcr.io/apache-beam-testing/java-postcommit-it/java:20210505180112].
Deleted [us.gcr.io/apache-beam-testing/java-postcommit-it/java@sha256:9030dd9df867c2208944f6ac952bad0b362091e36aaedc4aa0177c106c66fcb3].

FAILURE: Build failed with an exception.

* What went wrong:
Execution failed for task ':runners:google-cloud-dataflow-java:examplesJavaRunnerV2IntegrationTest'.
> There were failing tests. See the report at: file://<https://ci-beam.apache.org/job/beam_PostCommit_Java_Examples_Dataflow_V2/ws/src/runners/google-cloud-dataflow-java/build/reports/tests/examplesJavaRunnerV2IntegrationTest/index.html>

* Try:
Run with --stacktrace option to get the stack trace. Run with --info or --debug option to get more log output. Run with --scan to get full insights.

* Get more help at https://help.gradle.org

Deprecated Gradle features were used in this build, making it incompatible with Gradle 7.0.
Use '--warning-mode all' to show the individual deprecation warnings.
See https://docs.gradle.org/6.8.3/userguide/command_line_interface.html#sec:command_line_warnings

BUILD FAILED in 14m 25s
107 actionable tasks: 76 executed, 29 from cache, 2 up-to-date
Gradle was unable to watch the file system for changes. The inotify watches limit is too low.

Publishing build scan...
https://gradle.com/s/nmprgbs2pd72y

Build step 'Invoke Gradle script' changed build result to FAILURE
Build step 'Invoke Gradle script' marked build as failure

---------------------------------------------------------------------
To unsubscribe, e-mail: builds-unsubscribe@beam.apache.org
For additional commands, e-mail: builds-help@beam.apache.org


Build failed in Jenkins: beam_PostCommit_Java_Examples_Dataflow_V2 #697

Posted by Apache Jenkins Server <je...@builds.apache.org>.
See <https://ci-beam.apache.org/job/beam_PostCommit_Java_Examples_Dataflow_V2/697/display/redirect>

Changes:


------------------------------------------
[...truncated 47.28 KB...]
> Task :sdks:java:container:pullLicenses
Copying already-fetched licenses from <https://ci-beam.apache.org/job/beam_PostCommit_Java_Examples_Dataflow_V2/ws/src/sdks/java/container/build/reports/dependency-license> to <https://ci-beam.apache.org/job/beam_PostCommit_Java_Examples_Dataflow_V2/ws/src/sdks/java/container/build/target/java_third_party_licenses>
Already using interpreter /usr/bin/python3
Using base prefix '/usr'
New python executable in <https://ci-beam.apache.org/job/beam_PostCommit_Java_Examples_Dataflow_V2/ws/src/sdks/java/container/build/virtualenv/bin/python3>
Also creating executable in <https://ci-beam.apache.org/job/beam_PostCommit_Java_Examples_Dataflow_V2/ws/src/sdks/java/container/build/virtualenv/bin/python>
Installing setuptools, pip, wheel...

> Task :runners:java-fn-execution:jar
> Task :sdks:java:expansion-service:compileJava FROM-CACHE
> Task :sdks:java:expansion-service:classes UP-TO-DATE
> Task :sdks:java:expansion-service:jar
> Task :runners:direct-java:compileJava FROM-CACHE
> Task :sdks:java:io:kafka:compileJava FROM-CACHE
> Task :sdks:java:io:kafka:classes UP-TO-DATE
> Task :sdks:java:io:kafka:jar
> Task :runners:direct-java:classes UP-TO-DATE
> Task :runners:direct-java:shadowJar FROM-CACHE
> Task :sdks:java:extensions:ml:compileJava FROM-CACHE
> Task :sdks:java:extensions:ml:classes UP-TO-DATE
> Task :sdks:java:extensions:ml:jar
> Task :sdks:java:io:google-cloud-platform:compileJava FROM-CACHE
> Task :sdks:java:io:google-cloud-platform:classes UP-TO-DATE
> Task :sdks:java:io:google-cloud-platform:jar
> Task :sdks:java:container:java8:copyDockerfileDependencies

> Task :sdks:go:resolveBuildDependencies
Resolving golang.org/x/net: commit='2fb46b16b8dda405028c50f7c7f0f9dd1fa6bfb1', urls=[https://go.googlesource.com/net]
Resolving golang.org/x/oauth2: commit='5d25da1a8d43b66f2898c444f899c7bcfd6a407e', urls=[https://go.googlesource.com/oauth2]
Resolving golang.org/x/sync: commit='fd80eb99c8f653c847d294a001bdf2a3a6f768f5', urls=[https://go.googlesource.com/sync]

> Task :runners:google-cloud-dataflow-java:compileJava FROM-CACHE
> Task :runners:google-cloud-dataflow-java:classes
> Task :examples:java:compileJava FROM-CACHE
> Task :examples:java:classes UP-TO-DATE
> Task :runners:google-cloud-dataflow-java:jar

> Task :sdks:java:container:pullLicenses
done.

> Task :examples:java:jar
> Task :examples:java:compileTestJava FROM-CACHE
> Task :examples:java:testClasses
> Task :examples:java:testJar

> Task :sdks:java:container:pullLicenses
DEPRECATION: Python 3.5 reached the end of its life on September 13th, 2020. Please upgrade your Python as Python 3.5 is no longer maintained. pip 21.0 will drop support for Python 3.5 in January 2021. pip 21.0 will remove support for this functionality.
Collecting beautifulsoup4<5.0,>=4.9.0
  Using cached beautifulsoup4-4.9.3-py3-none-any.whl (115 kB)
Collecting future<1.0.0,>=0.16.0
  Using cached future-0.18.2-py3-none-any.whl
Collecting pyyaml<6.0.0,>=3.12
  Using cached PyYAML-5.3.1-cp35-cp35m-linux_x86_64.whl
Collecting tenacity<6.0,>=5.0.2
  Using cached tenacity-5.1.5-py2.py3-none-any.whl (34 kB)
Collecting soupsieve>1.2
  Using cached soupsieve-2.1-py3-none-any.whl (32 kB)
Collecting six>=1.9.0
  Using cached six-1.15.0-py2.py3-none-any.whl (10 kB)
Installing collected packages: soupsieve, six, tenacity, pyyaml, future, beautifulsoup4
Successfully installed beautifulsoup4-4.9.3 future-0.18.2 pyyaml-5.3.1 six-1.15.0 soupsieve-2.1 tenacity-5.1.5
Executing <https://ci-beam.apache.org/job/beam_PostCommit_Java_Examples_Dataflow_V2/ws/src/sdks/java/container/build/virtualenv/bin/python> <https://ci-beam.apache.org/job/beam_PostCommit_Java_Examples_Dataflow_V2/ws/src/sdks/java/container/license_scripts/pull_licenses_java.py> --license_index=<https://ci-beam.apache.org/job/beam_PostCommit_Java_Examples_Dataflow_V2/ws/src/sdks/java/container/build/reports/dependency-license/index.json>        --output_dir=<https://ci-beam.apache.org/job/beam_PostCommit_Java_Examples_Dataflow_V2/ws/src/sdks/java/container/build/target/java_third_party_licenses>        --dep_url_yaml=<https://ci-beam.apache.org/job/beam_PostCommit_Java_Examples_Dataflow_V2/ws/src/sdks/java/container/license_scripts/dep_urls_java.yaml> 
INFO:root:Pulling license for 208 dependencies using 16 threads.
INFO:root:pull_licenses_java.py succeed. It took 5.109299 seconds with 16 threads.
Copying licenses from <https://ci-beam.apache.org/job/beam_PostCommit_Java_Examples_Dataflow_V2/ws/src/sdks/java/container/build/target/java_third_party_licenses> to <https://ci-beam.apache.org/job/beam_PostCommit_Java_Examples_Dataflow_V2/ws/src/sdks/java/container/build/target/third_party_licenses.>
Finished license_scripts.sh

> Task :sdks:java:container:java8:copyJavaThirdPartyLicenses NO-SOURCE

> Task :sdks:go:resolveBuildDependencies
Resolving golang.org/x/sys: commit='fde4db37ae7ad8191b03d30d27f258b5291ae4e3', urls=[https://go.googlesource.com/sys]
Resolving golang.org/x/text: commit='23ae387dee1f90d29a23c0e87ee0b46038fbed0e', urls=[https://go.googlesource.com/text]
Resolving cached github.com/etcd-io/etcd: commit='11214aa33bf5a47d3d9d8dafe0f6b97237dfe921', urls=[https://github.com/etcd-io/etcd.git, git@github.com:etcd-io/etcd.git]

> Task :release:go-licenses:java:dockerRun
+ go-licenses save github.com/apache/beam/sdks/java/container --save_path=/output/licenses
+ go-licenses csv github.com/apache/beam/sdks/java/container
+ tee /output/licenses/list.csv
github.com/apache/beam/sdks/go/pkg/beam,https://github.com/apache/beam/blob/master/sdks/go/README.md,Apache-2.0
github.com/golang/protobuf,https://github.com/golang/protobuf/blob/master/LICENSE,BSD-3-Clause
google.golang.org/genproto/googleapis/rpc/status,https://github.com/googleapis/go-genproto/blob/master/LICENSE,Apache-2.0
golang.org/x/sys,https://go.googlesource.com/sys/+/refs/heads/master/LICENSE,BSD-3-Clause
github.com/apache/beam/sdks/java/container,https://github.com/apache/beam/blob/master/LICENSE,Apache-2.0
google.golang.org/protobuf,https://go.googlesource.com/protobuf/+/refs/heads/master/LICENSE,BSD-3-Clause
google.golang.org/grpc,https://github.com/grpc/grpc-go/blob/master/LICENSE,Apache-2.0
golang.org/x/net,https://go.googlesource.com/net/+/refs/heads/master/LICENSE,BSD-3-Clause
golang.org/x/text,https://go.googlesource.com/text/+/refs/heads/master/LICENSE,BSD-3-Clause
+ chmod -R a+w /output/licenses

> Task :release:go-licenses:java:createLicenses
> Task :sdks:java:container:java8:copyGolangLicenses

> Task :sdks:go:resolveBuildDependencies
Resolving google.golang.org/api: commit='0324d5e90dc7753607860272666845fad9ceb97e', urls=[https://code.googlesource.com/google-api-go-client]
Resolving google.golang.org/genproto: commit='4d944d34d83c502a5f761500a14d8842648415c3', urls=[https://github.com/google/go-genproto]
Resolving google.golang.org/grpc: commit='5e8f83304c0563d1ba74db05fee83d9c18ab9a58', urls=[https://github.com/grpc/grpc-go]
Resolving google.golang.org/protobuf: commit='d165be301fb1e13390ad453281ded24385fd8ebc', urls=[https://go.googlesource.com/protobuf]
Resolving cached github.com/etcd-io/etcd: commit='11214aa33bf5a47d3d9d8dafe0f6b97237dfe921', urls=[https://github.com/etcd-io/etcd.git, git@github.com:etcd-io/etcd.git]
Resolving cached github.com/etcd-io/etcd: commit='11214aa33bf5a47d3d9d8dafe0f6b97237dfe921', urls=[https://github.com/etcd-io/etcd.git, git@github.com:etcd-io/etcd.git]

> Task :sdks:go:installDependencies
> Task :sdks:go:buildLinuxAmd64
> Task :sdks:go:goBuild

> Task :sdks:java:container:resolveBuildDependencies
Resolving ./github.com/apache/beam/sdks/go@<https://ci-beam.apache.org/job/beam_PostCommit_Java_Examples_Dataflow_V2/ws/src/sdks/go>

> Task :sdks:java:container:installDependencies

> Task :sdks:java:container:buildLinuxAmd64
Unable to watch the file system for changes. The inotify watches limit is too low.

> Task :sdks:java:container:goBuild
> Task :sdks:java:container:java8:copySdkHarnessLauncher
> Task :sdks:java:container:java8:dockerPrepare
> Task :sdks:java:container:java8:docker

> Task :runners:google-cloud-dataflow-java:buildAndPushDockerContainer
WARNING: `gcloud docker` will not be supported for Docker client versions above 18.03.

As an alternative, use `gcloud auth configure-docker` to configure `docker` to
use `gcloud` as a credential helper, then use `docker` as you would for non-GCR
registries, e.g. `docker pull gcr.io/project-id/my-image`. Add
`--verbosity=error` to silence this warning: `gcloud docker
--verbosity=error -- pull gcr.io/project-id/my-image`.

See: https://cloud.google.com/container-registry/docs/support/deprecation-notices#gcloud-docker

The push refers to repository [us.gcr.io/apache-beam-testing/java-postcommit-it/java]
adfc6922b56c: Preparing
8f2b0104e53f: Preparing
a52bda7ff445: Preparing
1c0db6a26153: Preparing
2943ad515ab3: Preparing
dc1a40bda996: Preparing
dfae04031077: Preparing
bf70378a1f69: Preparing
631cdca28d67: Preparing
2a3f0e18caff: Preparing
7b9edae556e8: Preparing
e2e5329a9075: Preparing
d8460eb1eb77: Preparing
30b0cc543ee7: Preparing
26863b4714ee: Preparing
5d5962699bd5: Preparing
a42439ce9650: Preparing
26270c5e25fa: Preparing
e2c6ff462357: Preparing
dc1a40bda996: Waiting
dfae04031077: Waiting
bf70378a1f69: Waiting
631cdca28d67: Waiting
2a3f0e18caff: Waiting
e2e5329a9075: Waiting
7b9edae556e8: Waiting
d8460eb1eb77: Waiting
30b0cc543ee7: Waiting
26863b4714ee: Waiting
a42439ce9650: Waiting
5d5962699bd5: Waiting
26270c5e25fa: Waiting
e2c6ff462357: Waiting
8f2b0104e53f: Pushed
2943ad515ab3: Pushed
a52bda7ff445: Pushed
dc1a40bda996: Pushed
adfc6922b56c: Pushed
1c0db6a26153: Pushed
bf70378a1f69: Pushed
631cdca28d67: Pushed
d8460eb1eb77: Layer already exists
30b0cc543ee7: Layer already exists
26863b4714ee: Layer already exists
5d5962699bd5: Layer already exists
7b9edae556e8: Pushed
a42439ce9650: Layer already exists
26270c5e25fa: Layer already exists
e2e5329a9075: Pushed
e2c6ff462357: Layer already exists
dfae04031077: Pushed
2a3f0e18caff: Pushed
20210505120047: digest: sha256:8c804a9986fd3fedf84d3b39d95336d924ebe3a9f569d604b0a467ff8fbabdcc size: 4310

> Task :runners:google-cloud-dataflow-java:examplesJavaRunnerV2IntegrationTest

org.apache.beam.examples.cookbook.BigQueryTornadoesIT > testE2EBigQueryTornadoesWithExportUsingQuery FAILED
    java.lang.NullPointerException at BigQueryTornadoesIT.java:68

org.apache.beam.examples.snippets.transforms.io.gcp.bigquery.BigQuerySamplesIT > testTableIO FAILED
    java.lang.NullPointerException at BigQuerySamplesIT.java:108

org.apache.beam.examples.complete.TfIdfIT > testE2ETfIdf FAILED
    java.lang.NullPointerException at TfIdfIT.java:70

org.apache.beam.examples.complete.TrafficRoutesIT > testE2ETrafficRoutes FAILED
    java.lang.NullPointerException at TrafficRoutesIT.java:74

org.apache.beam.examples.cookbook.BigQueryTornadoesIT > testE2EBigQueryTornadoesWithExport FAILED
    java.lang.NullPointerException at BigQueryTornadoesIT.java:68

org.apache.beam.examples.cookbook.BigQueryTornadoesIT > testE2eBigQueryTornadoesWithStorageApi FAILED
    java.lang.NullPointerException at BigQueryTornadoesIT.java:68

org.apache.beam.examples.cookbook.BigQueryTornadoesIT > testE2eBigQueryTornadoesWithStorageApiUsingQuery FAILED
    java.lang.NullPointerException at BigQueryTornadoesIT.java:68

org.apache.beam.examples.complete.TrafficMaxLaneFlowIT > testE2ETrafficMaxLaneFlow FAILED
    java.lang.NullPointerException at TrafficMaxLaneFlowIT.java:74

8 tests completed, 8 failed

> Task :runners:google-cloud-dataflow-java:examplesJavaRunnerV2IntegrationTest FAILED

> Task :runners:google-cloud-dataflow-java:cleanUpDockerImages
Untagged: us.gcr.io/apache-beam-testing/java-postcommit-it/java:20210505120047
Untagged: us.gcr.io/apache-beam-testing/java-postcommit-it/java@sha256:8c804a9986fd3fedf84d3b39d95336d924ebe3a9f569d604b0a467ff8fbabdcc
Digests:
- us.gcr.io/apache-beam-testing/java-postcommit-it/java@sha256:8c804a9986fd3fedf84d3b39d95336d924ebe3a9f569d604b0a467ff8fbabdcc
  Associated tags:
 - 20210505120047
Tags:
- us.gcr.io/apache-beam-testing/java-postcommit-it/java:20210505120047
Deleted [us.gcr.io/apache-beam-testing/java-postcommit-it/java:20210505120047].
Deleted [us.gcr.io/apache-beam-testing/java-postcommit-it/java@sha256:8c804a9986fd3fedf84d3b39d95336d924ebe3a9f569d604b0a467ff8fbabdcc].

FAILURE: Build failed with an exception.

* What went wrong:
Execution failed for task ':runners:google-cloud-dataflow-java:examplesJavaRunnerV2IntegrationTest'.
> There were failing tests. See the report at: file://<https://ci-beam.apache.org/job/beam_PostCommit_Java_Examples_Dataflow_V2/ws/src/runners/google-cloud-dataflow-java/build/reports/tests/examplesJavaRunnerV2IntegrationTest/index.html>

* Try:
Run with --stacktrace option to get the stack trace. Run with --info or --debug option to get more log output. Run with --scan to get full insights.

* Get more help at https://help.gradle.org

Deprecated Gradle features were used in this build, making it incompatible with Gradle 7.0.
Use '--warning-mode all' to show the individual deprecation warnings.
See https://docs.gradle.org/6.8.3/userguide/command_line_interface.html#sec:command_line_warnings

BUILD FAILED in 10m 35s
107 actionable tasks: 75 executed, 30 from cache, 2 up-to-date
Gradle was unable to watch the file system for changes. The inotify watches limit is too low.

Publishing build scan...
https://gradle.com/s/bg52pxqwk7wio

Build step 'Invoke Gradle script' changed build result to FAILURE
Build step 'Invoke Gradle script' marked build as failure

---------------------------------------------------------------------
To unsubscribe, e-mail: builds-unsubscribe@beam.apache.org
For additional commands, e-mail: builds-help@beam.apache.org


Build failed in Jenkins: beam_PostCommit_Java_Examples_Dataflow_V2 #696

Posted by Apache Jenkins Server <je...@builds.apache.org>.
See <https://ci-beam.apache.org/job/beam_PostCommit_Java_Examples_Dataflow_V2/696/display/redirect?page=changes>

Changes:

[noreply] [BEAM-11759] Create Beam glossary (#14717)


------------------------------------------
[...truncated 44.04 KB...]
> Task :sdks:java:extensions:protobuf:generateProto NO-SOURCE
> Task :sdks:java:extensions:protobuf:compileJava FROM-CACHE
> Task :sdks:java:extensions:protobuf:classes UP-TO-DATE
> Task :runners:core-construction-java:compileJava FROM-CACHE
> Task :runners:core-construction-java:classes UP-TO-DATE
> Task :sdks:java:extensions:protobuf:jar
> Task :runners:core-construction-java:jar

> Task :sdks:java:container:pullLicenses
done.
DEPRECATION: Python 3.5 reached the end of its life on September 13th, 2020. Please upgrade your Python as Python 3.5 is no longer maintained. pip 21.0 will drop support for Python 3.5 in January 2021. pip 21.0 will remove support for this functionality.

> Task :runners:core-java:compileJava FROM-CACHE
> Task :runners:core-java:classes UP-TO-DATE
> Task :runners:core-java:jar
> Task :sdks:java:extensions:google-cloud-platform-core:compileJava FROM-CACHE
> Task :sdks:java:extensions:google-cloud-platform-core:classes UP-TO-DATE
> Task :sdks:java:extensions:google-cloud-platform-core:jar
> Task :sdks:java:harness:compileJava FROM-CACHE
> Task :sdks:java:harness:classes UP-TO-DATE
> Task :sdks:java:harness:jar

> Task :sdks:java:container:pullLicenses
Collecting beautifulsoup4<5.0,>=4.9.0
  Using cached beautifulsoup4-4.9.3-py3-none-any.whl (115 kB)
Collecting future<1.0.0,>=0.16.0
  Using cached future-0.18.2-py3-none-any.whl
Collecting pyyaml<6.0.0,>=3.12
  Using cached PyYAML-5.3.1-cp35-cp35m-linux_x86_64.whl
Collecting tenacity<6.0,>=5.0.2
  Using cached tenacity-5.1.5-py2.py3-none-any.whl (34 kB)
Collecting soupsieve>1.2
  Using cached soupsieve-2.1-py3-none-any.whl (32 kB)
Collecting six>=1.9.0
  Using cached six-1.15.0-py2.py3-none-any.whl (10 kB)
Installing collected packages: soupsieve, six, tenacity, pyyaml, future, beautifulsoup4
Successfully installed beautifulsoup4-4.9.3 future-0.18.2 pyyaml-5.3.1 six-1.15.0 soupsieve-2.1 tenacity-5.1.5
Executing <https://ci-beam.apache.org/job/beam_PostCommit_Java_Examples_Dataflow_V2/ws/src/sdks/java/container/build/virtualenv/bin/python> <https://ci-beam.apache.org/job/beam_PostCommit_Java_Examples_Dataflow_V2/ws/src/sdks/java/container/license_scripts/pull_licenses_java.py> --license_index=<https://ci-beam.apache.org/job/beam_PostCommit_Java_Examples_Dataflow_V2/ws/src/sdks/java/container/build/reports/dependency-license/index.json>        --output_dir=<https://ci-beam.apache.org/job/beam_PostCommit_Java_Examples_Dataflow_V2/ws/src/sdks/java/container/build/target/java_third_party_licenses>        --dep_url_yaml=<https://ci-beam.apache.org/job/beam_PostCommit_Java_Examples_Dataflow_V2/ws/src/sdks/java/container/license_scripts/dep_urls_java.yaml> 
INFO:root:Pulling license for 208 dependencies using 16 threads.

> Task :sdks:java:harness:shadowJar FROM-CACHE

> Task :sdks:java:container:pullLicenses
INFO:root:pull_licenses_java.py succeed. It took 5.715776 seconds with 16 threads.
Copying licenses from <https://ci-beam.apache.org/job/beam_PostCommit_Java_Examples_Dataflow_V2/ws/src/sdks/java/container/build/target/java_third_party_licenses> to <https://ci-beam.apache.org/job/beam_PostCommit_Java_Examples_Dataflow_V2/ws/src/sdks/java/container/build/target/third_party_licenses.>
Finished license_scripts.sh

> Task :sdks:java:container:java8:copyJavaThirdPartyLicenses NO-SOURCE
> Task :runners:java-fn-execution:compileJava FROM-CACHE
> Task :runners:java-fn-execution:classes UP-TO-DATE
> Task :runners:java-fn-execution:jar
> Task :sdks:java:expansion-service:compileJava FROM-CACHE
> Task :sdks:java:expansion-service:classes UP-TO-DATE
> Task :sdks:java:expansion-service:jar
> Task :runners:direct-java:compileJava FROM-CACHE
> Task :runners:direct-java:classes UP-TO-DATE
> Task :sdks:java:extensions:ml:compileJava FROM-CACHE
> Task :sdks:java:extensions:ml:classes UP-TO-DATE
> Task :sdks:java:io:kafka:compileJava FROM-CACHE
> Task :sdks:java:io:kafka:classes UP-TO-DATE
> Task :sdks:java:extensions:ml:jar
> Task :runners:direct-java:shadowJar FROM-CACHE
> Task :sdks:java:io:kafka:jar
> Task :sdks:java:io:google-cloud-platform:compileJava FROM-CACHE
> Task :sdks:java:io:google-cloud-platform:classes UP-TO-DATE
> Task :sdks:java:io:google-cloud-platform:jar
> Task :runners:google-cloud-dataflow-java:compileJava FROM-CACHE
> Task :runners:google-cloud-dataflow-java:classes
> Task :examples:java:compileJava FROM-CACHE
> Task :examples:java:classes UP-TO-DATE
> Task :runners:google-cloud-dataflow-java:jar
> Task :examples:java:jar
> Task :examples:java:compileTestJava FROM-CACHE
> Task :examples:java:testClasses
> Task :examples:java:testJar
> Task :sdks:java:container:java8:copyDockerfileDependencies

> Task :sdks:go:resolveBuildDependencies
Resolving golang.org/x/text: commit='23ae387dee1f90d29a23c0e87ee0b46038fbed0e', urls=[https://go.googlesource.com/text]
Resolving cached github.com/etcd-io/etcd: commit='11214aa33bf5a47d3d9d8dafe0f6b97237dfe921', urls=[https://github.com/etcd-io/etcd.git, git@github.com:etcd-io/etcd.git]

> Task :release:go-licenses:java:dockerRun
+ go-licenses save github.com/apache/beam/sdks/java/container --save_path=/output/licenses
+ go-licenses csv github.com/apache/beam/sdks/java/container
+ tee /output/licenses/list.csv
golang.org/x/sys,https://go.googlesource.com/sys/+/refs/heads/master/LICENSE,BSD-3-Clause
golang.org/x/text,https://go.googlesource.com/text/+/refs/heads/master/LICENSE,BSD-3-Clause
github.com/golang/protobuf,https://github.com/golang/protobuf/blob/master/LICENSE,BSD-3-Clause
google.golang.org/protobuf,https://go.googlesource.com/protobuf/+/refs/heads/master/LICENSE,BSD-3-Clause
google.golang.org/genproto/googleapis/rpc/status,https://github.com/googleapis/go-genproto/blob/master/LICENSE,Apache-2.0
golang.org/x/net,https://go.googlesource.com/net/+/refs/heads/master/LICENSE,BSD-3-Clause
github.com/apache/beam/sdks/java/container,https://github.com/apache/beam/blob/master/LICENSE,Apache-2.0
github.com/apache/beam/sdks/go/pkg/beam,https://github.com/apache/beam/blob/master/sdks/go/README.md,Apache-2.0
google.golang.org/grpc,https://github.com/grpc/grpc-go/blob/master/LICENSE,Apache-2.0
+ chmod -R a+w /output/licenses

> Task :release:go-licenses:java:createLicenses
> Task :sdks:java:container:java8:copyGolangLicenses

> Task :sdks:go:resolveBuildDependencies
Resolving google.golang.org/api: commit='0324d5e90dc7753607860272666845fad9ceb97e', urls=[https://code.googlesource.com/google-api-go-client]
Resolving google.golang.org/genproto: commit='4d944d34d83c502a5f761500a14d8842648415c3', urls=[https://github.com/google/go-genproto]
Resolving google.golang.org/grpc: commit='5e8f83304c0563d1ba74db05fee83d9c18ab9a58', urls=[https://github.com/grpc/grpc-go]
Resolving google.golang.org/protobuf: commit='d165be301fb1e13390ad453281ded24385fd8ebc', urls=[https://go.googlesource.com/protobuf]
Resolving cached github.com/etcd-io/etcd: commit='11214aa33bf5a47d3d9d8dafe0f6b97237dfe921', urls=[https://github.com/etcd-io/etcd.git, git@github.com:etcd-io/etcd.git]
Resolving cached github.com/etcd-io/etcd: commit='11214aa33bf5a47d3d9d8dafe0f6b97237dfe921', urls=[https://github.com/etcd-io/etcd.git, git@github.com:etcd-io/etcd.git]

> Task :sdks:go:installDependencies
> Task :sdks:go:buildLinuxAmd64
> Task :sdks:go:goBuild

> Task :sdks:java:container:resolveBuildDependencies
Unable to watch the file system for changes. The inotify watches limit is too low.
Resolving ./github.com/apache/beam/sdks/go@<https://ci-beam.apache.org/job/beam_PostCommit_Java_Examples_Dataflow_V2/ws/src/sdks/go>

> Task :sdks:java:container:installDependencies
> Task :sdks:java:container:buildLinuxAmd64
> Task :sdks:java:container:goBuild
> Task :sdks:java:container:java8:copySdkHarnessLauncher
> Task :sdks:java:container:java8:dockerPrepare
> Task :sdks:java:container:java8:docker

> Task :runners:google-cloud-dataflow-java:buildAndPushDockerContainer
WARNING: `gcloud docker` will not be supported for Docker client versions above 18.03.

As an alternative, use `gcloud auth configure-docker` to configure `docker` to
use `gcloud` as a credential helper, then use `docker` as you would for non-GCR
registries, e.g. `docker pull gcr.io/project-id/my-image`. Add
`--verbosity=error` to silence this warning: `gcloud docker
--verbosity=error -- pull gcr.io/project-id/my-image`.

See: https://cloud.google.com/container-registry/docs/support/deprecation-notices#gcloud-docker

The push refers to repository [us.gcr.io/apache-beam-testing/java-postcommit-it/java]
6d5aaf8f9efc: Preparing
a3e49a9cd6cb: Preparing
36517cb903bd: Preparing
80043163bd3d: Preparing
5f4b289ba9b7: Preparing
71e89ce0f7d2: Preparing
b697e37cf972: Preparing
a80f04303c99: Preparing
7a1f5933cadc: Preparing
24e750d0f118: Preparing
9497835274ee: Preparing
3d1f60da7d09: Preparing
d8460eb1eb77: Preparing
30b0cc543ee7: Preparing
71e89ce0f7d2: Waiting
a80f04303c99: Waiting
7a1f5933cadc: Waiting
3d1f60da7d09: Waiting
26863b4714ee: Preparing
9497835274ee: Waiting
5d5962699bd5: Preparing
30b0cc543ee7: Waiting
26863b4714ee: Waiting
a42439ce9650: Preparing
26270c5e25fa: Preparing
e2c6ff462357: Preparing
b697e37cf972: Waiting
26270c5e25fa: Waiting
36517cb903bd: Pushed
a3e49a9cd6cb: Pushed
5f4b289ba9b7: Pushed
71e89ce0f7d2: Pushed
6d5aaf8f9efc: Pushed
80043163bd3d: Pushed
a80f04303c99: Pushed
7a1f5933cadc: Pushed
d8460eb1eb77: Layer already exists
30b0cc543ee7: Layer already exists
26863b4714ee: Layer already exists
9497835274ee: Pushed
5d5962699bd5: Layer already exists
a42439ce9650: Layer already exists
26270c5e25fa: Layer already exists
e2c6ff462357: Layer already exists
3d1f60da7d09: Pushed
b697e37cf972: Pushed
24e750d0f118: Pushed
20210505060050: digest: sha256:7d3990c0b8c62a9a0ff2eb09884fe075ca6855d7a027a981a3dc725877595553 size: 4310

> Task :runners:google-cloud-dataflow-java:examplesJavaRunnerV2IntegrationTest

org.apache.beam.examples.snippets.transforms.io.gcp.bigquery.BigQuerySamplesIT > testTableIO FAILED
    java.lang.NullPointerException at BigQuerySamplesIT.java:108

org.apache.beam.examples.complete.TfIdfIT > testE2ETfIdf FAILED
    java.lang.NullPointerException at TfIdfIT.java:70

org.apache.beam.examples.complete.TrafficRoutesIT > testE2ETrafficRoutes FAILED
    java.lang.NullPointerException at TrafficRoutesIT.java:74

org.apache.beam.examples.cookbook.BigQueryTornadoesIT > testE2EBigQueryTornadoesWithExportUsingQuery FAILED
    java.lang.NullPointerException at BigQueryTornadoesIT.java:68

org.apache.beam.examples.cookbook.BigQueryTornadoesIT > testE2EBigQueryTornadoesWithExport FAILED
    java.lang.NullPointerException at BigQueryTornadoesIT.java:68

org.apache.beam.examples.cookbook.BigQueryTornadoesIT > testE2eBigQueryTornadoesWithStorageApi FAILED
    java.lang.NullPointerException at BigQueryTornadoesIT.java:68

org.apache.beam.examples.cookbook.BigQueryTornadoesIT > testE2eBigQueryTornadoesWithStorageApiUsingQuery FAILED
    java.lang.NullPointerException at BigQueryTornadoesIT.java:68

org.apache.beam.examples.complete.TrafficMaxLaneFlowIT > testE2ETrafficMaxLaneFlow FAILED
    java.lang.NullPointerException at TrafficMaxLaneFlowIT.java:74

8 tests completed, 8 failed

> Task :runners:google-cloud-dataflow-java:examplesJavaRunnerV2IntegrationTest FAILED

> Task :runners:google-cloud-dataflow-java:cleanUpDockerImages
Untagged: us.gcr.io/apache-beam-testing/java-postcommit-it/java:20210505060050
Untagged: us.gcr.io/apache-beam-testing/java-postcommit-it/java@sha256:7d3990c0b8c62a9a0ff2eb09884fe075ca6855d7a027a981a3dc725877595553
Digests:
- us.gcr.io/apache-beam-testing/java-postcommit-it/java@sha256:7d3990c0b8c62a9a0ff2eb09884fe075ca6855d7a027a981a3dc725877595553
  Associated tags:
 - 20210505060050
Tags:
- us.gcr.io/apache-beam-testing/java-postcommit-it/java:20210505060050
Deleted [us.gcr.io/apache-beam-testing/java-postcommit-it/java:20210505060050].
Deleted [us.gcr.io/apache-beam-testing/java-postcommit-it/java@sha256:7d3990c0b8c62a9a0ff2eb09884fe075ca6855d7a027a981a3dc725877595553].

FAILURE: Build failed with an exception.

* What went wrong:
Execution failed for task ':runners:google-cloud-dataflow-java:examplesJavaRunnerV2IntegrationTest'.
> There were failing tests. See the report at: file://<https://ci-beam.apache.org/job/beam_PostCommit_Java_Examples_Dataflow_V2/ws/src/runners/google-cloud-dataflow-java/build/reports/tests/examplesJavaRunnerV2IntegrationTest/index.html>

* Try:
Run with --stacktrace option to get the stack trace. Run with --info or --debug option to get more log output. Run with --scan to get full insights.

* Get more help at https://help.gradle.org

Deprecated Gradle features were used in this build, making it incompatible with Gradle 7.0.
Use '--warning-mode all' to show the individual deprecation warnings.
See https://docs.gradle.org/6.8.3/userguide/command_line_interface.html#sec:command_line_warnings

BUILD FAILED in 13m 35s
107 actionable tasks: 75 executed, 30 from cache, 2 up-to-date
Gradle was unable to watch the file system for changes. The inotify watches limit is too low.

Publishing build scan...
https://gradle.com/s/gcm4bqt2zcfcy

Build step 'Invoke Gradle script' changed build result to FAILURE
Build step 'Invoke Gradle script' marked build as failure

---------------------------------------------------------------------
To unsubscribe, e-mail: builds-unsubscribe@beam.apache.org
For additional commands, e-mail: builds-help@beam.apache.org