You are viewing a plain text version of this content. The canonical link for it is here.
Posted to dev@openmeetings.apache.org by Apache Jenkins Server <je...@builds.apache.org> on 2020/03/25 04:01:25 UTC

Build failed in Jenkins: openmeetings #3062

See <https://builds.apache.org/job/openmeetings/3062/display/redirect?page=changes>

Changes:

[solomax666] [OPENMEETINGS-2186] documentation update


------------------------------------------
[...truncated 187.19 KB...]
[INFO] Downloading from central: https://repo.maven.apache.org/maven2/org/apache/maven/wagon/wagon-ssh-common/1.0-beta-2/wagon-ssh-common-1.0-beta-2.jar
[INFO] Downloaded from central: https://repo.maven.apache.org/maven2/org/apache/maven/wagon/wagon-ssh/1.0-beta-2/wagon-ssh-1.0-beta-2.jar (24 kB at 1.4 MB/s)
[INFO] Downloaded from central: https://repo.maven.apache.org/maven2/org/apache/maven/wagon/wagon-ssh-common/1.0-beta-2/wagon-ssh-common-1.0-beta-2.jar (25 kB at 681 kB/s)
[INFO] Downloaded from central: https://repo.maven.apache.org/maven2/com/jcraft/jsch/0.1.27/jsch-0.1.27.jar (122 kB at 2.5 MB/s)
[INFO] Downloaded from central: https://repo.maven.apache.org/maven2/plexus/plexus-utils/1.0.2/plexus-utils-1.0.2.jar (160 kB at 2.9 MB/s)
[INFO] Downloading from central: https://repo.maven.apache.org/maven2/org/apache/felix/maven-bundle-plugin/2.0.0/maven-bundle-plugin-2.0.0.pom
[INFO] Downloaded from central: https://repo.maven.apache.org/maven2/org/apache/felix/maven-bundle-plugin/2.0.0/maven-bundle-plugin-2.0.0.pom (4.8 kB at 208 kB/s)
[INFO] Downloading from central: https://repo.maven.apache.org/maven2/biz/aQute/bndlib/0.0.311/bndlib-0.0.311.pom
[INFO] Downloaded from central: https://repo.maven.apache.org/maven2/biz/aQute/bndlib/0.0.311/bndlib-0.0.311.pom (864 B at 66 kB/s)
[INFO] Downloading from central: https://repo.maven.apache.org/maven2/org/apache/felix/maven-bundle-plugin/2.0.0/maven-bundle-plugin-2.0.0.jar
[INFO] Downloading from central: https://repo.maven.apache.org/maven2/biz/aQute/bndlib/0.0.311/bndlib-0.0.311.jar
[INFO] Downloaded from central: https://repo.maven.apache.org/maven2/biz/aQute/bndlib/0.0.311/bndlib-0.0.311.jar (154 kB at 5.1 MB/s)
[INFO] Downloaded from central: https://repo.maven.apache.org/maven2/org/apache/felix/maven-bundle-plugin/2.0.0/maven-bundle-plugin-2.0.0.jar (156 kB at 5.2 MB/s)
[WARNING] Failure to transfer org.apache.wicket:wicket-parent:9.0.0-M5-SNAPSHOT/maven-metadata.xml from https://oss.sonatype.org/content/repositories/snapshots was cached in the local repository, resolution will not be reattempted until the update interval of sonatype-nexus-snapshots has elapsed or updates are forced. Original error: Could not transfer metadata org.apache.wicket:wicket-parent:9.0.0-M5-SNAPSHOT/maven-metadata.xml from/to sonatype-nexus-snapshots (https://oss.sonatype.org/content/repositories/snapshots): Access denied to: https://oss.sonatype.org/content/repositories/snapshots/org/apache/wicket/wicket-parent/9.0.0-M5-SNAPSHOT/maven-metadata.xml
[WARNING] Failure to transfer org.apache.wicket:wicket-parent:9.0.0-M5-SNAPSHOT/maven-metadata.xml from https://oss.sonatype.org/content/repositories/snapshots/ was cached in the local repository, resolution will not be reattempted until the update interval of sonatype-snapshots has elapsed or updates are forced. Original error: Could not transfer metadata org.apache.wicket:wicket-parent:9.0.0-M5-SNAPSHOT/maven-metadata.xml from/to sonatype-snapshots (https://oss.sonatype.org/content/repositories/snapshots/): Access denied to: https://oss.sonatype.org/content/repositories/snapshots/org/apache/wicket/wicket-parent/9.0.0-M5-SNAPSHOT/maven-metadata.xml
[INFO] Downloading from codehaus.snapshots: http://snapshots.repository.codehaus.org/org/apache/wicket/wicket-parent/9.0.0-M5-SNAPSHOT/maven-metadata.xml
[INFO] Downloading from terracotta-snapshots: http://www.terracotta.org/download/reflector/snapshots/org/apache/wicket/wicket-parent/9.0.0-M5-SNAPSHOT/maven-metadata.xml
[INFO] Downloading from jvnet-nexus-snapshots: https://maven.java.net/content/repositories/snapshots/org/apache/wicket/wicket-parent/9.0.0-M5-SNAPSHOT/maven-metadata.xml
[INFO] Downloading from codehaus-snapshots: http://snapshots.repository.codehaus.org/org/apache/wicket/wicket-parent/9.0.0-M5-SNAPSHOT/maven-metadata.xml
[INFO] Downloading from unidata: https://artifacts.unidata.ucar.edu/content/repositories/unidata/org/apache/wicket/wicket-parent/9.0.0-M5-SNAPSHOT/maven-metadata.xml
[INFO] Downloading from unidata-3rdparty: https://artifacts.unidata.ucar.edu/content/repositories/unidata-3rdparty/org/apache/wicket/wicket-parent/9.0.0-M5-SNAPSHOT/maven-metadata.xml
[INFO] Downloading from mvmsearch: http://www.mvnsearch.org/maven2/org/apache/wicket/wicket-parent/9.0.0-M5-SNAPSHOT/maven-metadata.xml
[INFO] Downloading from Oracle: http://download.oracle.com/maven/org/apache/wicket/wicket-parent/9.0.0-M5-SNAPSHOT/maven-metadata.xml
[INFO] Downloading from glassfish-repository: http://download.java.net/maven/glassfish/org/apache/wicket/wicket-parent/9.0.0-M5-SNAPSHOT/maven-metadata.xml
[WARNING] Could not transfer metadata org.apache.wicket:wicket-parent:9.0.0-M5-SNAPSHOT/maven-metadata.xml from/to codehaus.snapshots (http://snapshots.repository.codehaus.org): Transfer failed for http://snapshots.repository.codehaus.org/org/apache/wicket/wicket-parent/9.0.0-M5-SNAPSHOT/maven-metadata.xml
[WARNING] Could not transfer metadata org.apache.wicket:wicket-parent:9.0.0-M5-SNAPSHOT/maven-metadata.xml from/to codehaus-snapshots (http://snapshots.repository.codehaus.org): Transfer failed for http://snapshots.repository.codehaus.org/org/apache/wicket/wicket-parent/9.0.0-M5-SNAPSHOT/maven-metadata.xml
[WARNING] Could not transfer metadata org.apache.wicket:wicket-parent:9.0.0-M5-SNAPSHOT/maven-metadata.xml from/to unidata-3rdparty (https://artifacts.unidata.ucar.edu/content/repositories/unidata-3rdparty/): Transfer failed for https://artifacts.unidata.ucar.edu/content/repositories/unidata-3rdparty/org/apache/wicket/wicket-parent/9.0.0-M5-SNAPSHOT/maven-metadata.xml 400 Repository version policy: RELEASE does not allow metadata in path: org/apache/wicket/wicket-parent/9.0.0-M5-SNAPSHOT/maven-metadata.xml
[WARNING] Could not transfer metadata org.apache.wicket:wicket-parent:9.0.0-M5-SNAPSHOT/maven-metadata.xml from/to mvmsearch (http://www.mvnsearch.org/maven2/): Transfer failed for http://www.mvnsearch.org/maven2/org/apache/wicket/wicket-parent/9.0.0-M5-SNAPSHOT/maven-metadata.xml
[INFO] Downloading from central: https://repo.maven.apache.org/maven2/org/apache/maven/wagon/wagon-http-lightweight/1.0/wagon-http-lightweight-1.0.pom
[INFO] Downloaded from central: https://repo.maven.apache.org/maven2/org/apache/maven/wagon/wagon-http-lightweight/1.0/wagon-http-lightweight-1.0.pom (2.0 kB at 26 kB/s)
[INFO] Downloading from central: https://repo.maven.apache.org/maven2/org/apache/maven/wagon/wagon-http-shared/1.0/wagon-http-shared-1.0.pom
[INFO] Downloaded from central: https://repo.maven.apache.org/maven2/org/apache/maven/wagon/wagon-http-shared/1.0/wagon-http-shared-1.0.pom (2.6 kB at 186 kB/s)
[INFO] Downloading from central: https://repo.maven.apache.org/maven2/org/jsoup/jsoup/1.6.1/jsoup-1.6.1.pom
[INFO] Downloaded from central: https://repo.maven.apache.org/maven2/org/jsoup/jsoup/1.6.1/jsoup-1.6.1.pom (5.1 kB at 363 kB/s)
[INFO] Downloading from central: https://repo.maven.apache.org/maven2/org/apache/maven/wagon/wagon-http-lightweight/1.0/wagon-http-lightweight-1.0.jar
[INFO] Downloading from central: https://repo.maven.apache.org/maven2/org/apache/maven/wagon/wagon-http-shared/1.0/wagon-http-shared-1.0.jar
[INFO] Downloading from central: https://repo.maven.apache.org/maven2/org/jsoup/jsoup/1.6.1/jsoup-1.6.1.jar
[INFO] Downloaded from central: https://repo.maven.apache.org/maven2/org/apache/maven/wagon/wagon-http-shared/1.0/wagon-http-shared-1.0.jar (25 kB at 1.1 MB/s)
[INFO] Downloaded from central: https://repo.maven.apache.org/maven2/org/apache/maven/wagon/wagon-http-lightweight/1.0/wagon-http-lightweight-1.0.jar (15 kB at 356 kB/s)
[INFO] Downloaded from central: https://repo.maven.apache.org/maven2/org/jsoup/jsoup/1.6.1/jsoup-1.6.1.jar (282 kB at 4.0 MB/s)
[WARNING] Failure to transfer org.apache.wicket:wicket-parent:9.0.0-M5-SNAPSHOT/maven-metadata.xml from https://oss.sonatype.org/content/repositories/snapshots/ was cached in the local repository, resolution will not be reattempted until the update interval of sonatype-snapshots has elapsed or updates are forced. Original error: Could not transfer metadata org.apache.wicket:wicket-parent:9.0.0-M5-SNAPSHOT/maven-metadata.xml from/to sonatype-snapshots (https://oss.sonatype.org/content/repositories/snapshots/): Access denied to: https://oss.sonatype.org/content/repositories/snapshots/org/apache/wicket/wicket-parent/9.0.0-M5-SNAPSHOT/maven-metadata.xml
[WARNING] Failure to transfer org.apache.wicket:wicket-parent:9.0.0-M5-SNAPSHOT/maven-metadata.xml from https://oss.sonatype.org/content/repositories/snapshots was cached in the local repository, resolution will not be reattempted until the update interval of sonatype-nexus-snapshots has elapsed or updates are forced. Original error: Could not transfer metadata org.apache.wicket:wicket-parent:9.0.0-M5-SNAPSHOT/maven-metadata.xml from/to sonatype-nexus-snapshots (https://oss.sonatype.org/content/repositories/snapshots): Access denied to: https://oss.sonatype.org/content/repositories/snapshots/org/apache/wicket/wicket-parent/9.0.0-M5-SNAPSHOT/maven-metadata.xml
[WARNING] Failure to transfer org.apache.wicket:wicket-parent:9.0.0-M5-SNAPSHOT/maven-metadata.xml from http://snapshots.repository.codehaus.org was cached in the local repository, resolution will not be reattempted until the update interval of codehaus.snapshots has elapsed or updates are forced. Original error: Could not transfer metadata org.apache.wicket:wicket-parent:9.0.0-M5-SNAPSHOT/maven-metadata.xml from/to codehaus.snapshots (http://snapshots.repository.codehaus.org): Transfer failed for http://snapshots.repository.codehaus.org/org/apache/wicket/wicket-parent/9.0.0-M5-SNAPSHOT/maven-metadata.xml
[WARNING] Failure to transfer org.apache.wicket:wicket-parent:9.0.0-M5-SNAPSHOT/maven-metadata.xml from http://snapshots.repository.codehaus.org was cached in the local repository, resolution will not be reattempted until the update interval of codehaus-snapshots has elapsed or updates are forced. Original error: Could not transfer metadata org.apache.wicket:wicket-parent:9.0.0-M5-SNAPSHOT/maven-metadata.xml from/to codehaus-snapshots (http://snapshots.repository.codehaus.org): Transfer failed for http://snapshots.repository.codehaus.org/org/apache/wicket/wicket-parent/9.0.0-M5-SNAPSHOT/maven-metadata.xml
[WARNING] Failure to transfer org.apache.wicket:wicket-parent:9.0.0-M5-SNAPSHOT/maven-metadata.xml from https://artifacts.unidata.ucar.edu/content/repositories/unidata-3rdparty/ was cached in the local repository, resolution will not be reattempted until the update interval of unidata-3rdparty has elapsed or updates are forced. Original error: Could not transfer metadata org.apache.wicket:wicket-parent:9.0.0-M5-SNAPSHOT/maven-metadata.xml from/to unidata-3rdparty (https://artifacts.unidata.ucar.edu/content/repositories/unidata-3rdparty/): Transfer failed for https://artifacts.unidata.ucar.edu/content/repositories/unidata-3rdparty/org/apache/wicket/wicket-parent/9.0.0-M5-SNAPSHOT/maven-metadata.xml 400 Repository version policy: RELEASE does not allow metadata in path: org/apache/wicket/wicket-parent/9.0.0-M5-SNAPSHOT/maven-metadata.xml
[WARNING] Failure to transfer org.apache.wicket:wicket-parent:9.0.0-M5-SNAPSHOT/maven-metadata.xml from http://www.mvnsearch.org/maven2/ was cached in the local repository, resolution will not be reattempted until the update interval of mvmsearch has elapsed or updates are forced. Original error: Could not transfer metadata org.apache.wicket:wicket-parent:9.0.0-M5-SNAPSHOT/maven-metadata.xml from/to mvmsearch (http://www.mvnsearch.org/maven2/): Transfer failed for http://www.mvnsearch.org/maven2/org/apache/wicket/wicket-parent/9.0.0-M5-SNAPSHOT/maven-metadata.xml
[INFO] Downloading from ow2-snapshot: http://repository.ow2.org/nexus/content/repositories/snapshots/org/apache/wicket/wicket-parent/9.0.0-M5-SNAPSHOT/maven-metadata.xml
[INFO] Downloading from terracotta-releases: http://www.terracotta.org/download/reflector/releases/org/apache/wicket/wicket-parent/9.0.0-M5-SNAPSHOT/maven-metadata.xml
[WARNING] Could not transfer metadata org.apache.wicket:wicket-parent:9.0.0-M5-SNAPSHOT/maven-metadata.xml from/to terracotta-releases (http://www.terracotta.org/download/reflector/releases): Authorization failed for http://www.terracotta.org/download/reflector/releases/org/apache/wicket/wicket-parent/9.0.0-M5-SNAPSHOT/maven-metadata.xml 403 Forbidden
[WARNING] Failure to transfer org.apache.wicket:wicket-native-websocket:9.0.0-M5-SNAPSHOT/maven-metadata.xml from https://oss.sonatype.org/content/repositories/snapshots/ was cached in the local repository, resolution will not be reattempted until the update interval of sonatype-snapshots has elapsed or updates are forced. Original error: Could not transfer metadata org.apache.wicket:wicket-native-websocket:9.0.0-M5-SNAPSHOT/maven-metadata.xml from/to sonatype-snapshots (https://oss.sonatype.org/content/repositories/snapshots/): Access denied to: https://oss.sonatype.org/content/repositories/snapshots/org/apache/wicket/wicket-native-websocket/9.0.0-M5-SNAPSHOT/maven-metadata.xml
[INFO] Downloading from jvnet-nexus-snapshots: https://maven.java.net/content/repositories/snapshots/org/apache/wicket/wicket-native-websocket/9.0.0-M5-SNAPSHOT/maven-metadata.xml
[INFO] Downloading from sonatype-nexus-snapshots: https://oss.sonatype.org/content/repositories/snapshots/org/apache/wicket/wicket-native-websocket/9.0.0-M5-SNAPSHOT/maven-metadata.xml
[INFO] Downloading from terracotta-snapshots: http://www.terracotta.org/download/reflector/snapshots/org/apache/wicket/wicket-native-websocket/9.0.0-M5-SNAPSHOT/maven-metadata.xml
[INFO] Downloading from terracotta-releases: http://www.terracotta.org/download/reflector/releases/org/apache/wicket/wicket-native-websocket/9.0.0-M5-SNAPSHOT/maven-metadata.xml
[INFO] Downloading from ow2-snapshot: http://repository.ow2.org/nexus/content/repositories/snapshots/org/apache/wicket/wicket-native-websocket/9.0.0-M5-SNAPSHOT/maven-metadata.xml
[INFO] Downloading from codehaus.snapshots: http://snapshots.repository.codehaus.org/org/apache/wicket/wicket-native-websocket/9.0.0-M5-SNAPSHOT/maven-metadata.xml
[INFO] Downloading from codehaus-snapshots: http://snapshots.repository.codehaus.org/org/apache/wicket/wicket-native-websocket/9.0.0-M5-SNAPSHOT/maven-metadata.xml
[INFO] Downloading from unidata: https://artifacts.unidata.ucar.edu/content/repositories/unidata/org/apache/wicket/wicket-native-websocket/9.0.0-M5-SNAPSHOT/maven-metadata.xml
[INFO] Downloading from unidata-3rdparty: https://artifacts.unidata.ucar.edu/content/repositories/unidata-3rdparty/org/apache/wicket/wicket-native-websocket/9.0.0-M5-SNAPSHOT/maven-metadata.xml
[INFO] Downloading from mvmsearch: http://www.mvnsearch.org/maven2/org/apache/wicket/wicket-native-websocket/9.0.0-M5-SNAPSHOT/maven-metadata.xml
[INFO] Downloading from Oracle: http://download.oracle.com/maven/org/apache/wicket/wicket-native-websocket/9.0.0-M5-SNAPSHOT/maven-metadata.xml
[INFO] Downloading from glassfish-repository: http://download.java.net/maven/glassfish/org/apache/wicket/wicket-native-websocket/9.0.0-M5-SNAPSHOT/maven-metadata.xml
[WARNING] Could not transfer metadata org.apache.wicket:wicket-native-websocket:9.0.0-M5-SNAPSHOT/maven-metadata.xml from/to sonatype-nexus-snapshots (https://oss.sonatype.org/content/repositories/snapshots): Authorization failed for https://oss.sonatype.org/content/repositories/snapshots/org/apache/wicket/wicket-native-websocket/9.0.0-M5-SNAPSHOT/maven-metadata.xml 403 Forbidden
[WARNING] Could not transfer metadata org.apache.wicket:wicket-native-websocket:9.0.0-M5-SNAPSHOT/maven-metadata.xml from/to terracotta-releases (http://www.terracotta.org/download/reflector/releases): Authorization failed for http://www.terracotta.org/download/reflector/releases/org/apache/wicket/wicket-native-websocket/9.0.0-M5-SNAPSHOT/maven-metadata.xml 403 Forbidden
[WARNING] Could not transfer metadata org.apache.wicket:wicket-native-websocket:9.0.0-M5-SNAPSHOT/maven-metadata.xml from/to codehaus.snapshots (http://snapshots.repository.codehaus.org): Transfer failed for http://snapshots.repository.codehaus.org/org/apache/wicket/wicket-native-websocket/9.0.0-M5-SNAPSHOT/maven-metadata.xml
[WARNING] Could not transfer metadata org.apache.wicket:wicket-native-websocket:9.0.0-M5-SNAPSHOT/maven-metadata.xml from/to codehaus-snapshots (http://snapshots.repository.codehaus.org): Transfer failed for http://snapshots.repository.codehaus.org/org/apache/wicket/wicket-native-websocket/9.0.0-M5-SNAPSHOT/maven-metadata.xml
[WARNING] Could not transfer metadata org.apache.wicket:wicket-native-websocket:9.0.0-M5-SNAPSHOT/maven-metadata.xml from/to unidata-3rdparty (https://artifacts.unidata.ucar.edu/content/repositories/unidata-3rdparty/): Transfer failed for https://artifacts.unidata.ucar.edu/content/repositories/unidata-3rdparty/org/apache/wicket/wicket-native-websocket/9.0.0-M5-SNAPSHOT/maven-metadata.xml 400 Repository version policy: RELEASE does not allow metadata in path: org/apache/wicket/wicket-native-websocket/9.0.0-M5-SNAPSHOT/maven-metadata.xml
[WARNING] Could not transfer metadata org.apache.wicket:wicket-native-websocket:9.0.0-M5-SNAPSHOT/maven-metadata.xml from/to mvmsearch (http://www.mvnsearch.org/maven2/): Transfer failed for http://www.mvnsearch.org/maven2/org/apache/wicket/wicket-native-websocket/9.0.0-M5-SNAPSHOT/maven-metadata.xml
[INFO] Generating "Dependency Convergence" report --- maven-project-info-reports-plugin:3.0.0:dependency-convergence
[INFO] Generating "Dependency Management" report --- maven-project-info-reports-plugin:3.0.0:dependency-management
[INFO] Generating "Distribution Management" report --- maven-project-info-reports-plugin:3.0.0:distribution-management
[INFO] Generating "Issue Management" report     --- maven-project-info-reports-plugin:3.0.0:issue-management
[INFO] Generating "Licenses" report             --- maven-project-info-reports-plugin:3.0.0:licenses
[INFO] Generating "Mailing Lists" report        --- maven-project-info-reports-plugin:3.0.0:mailing-lists
[INFO] Generating "Plugin Management" report    --- maven-project-info-reports-plugin:3.0.0:plugin-management
[INFO] Generating "Plugins" report              --- maven-project-info-reports-plugin:3.0.0:plugins
[INFO] Generating "Team" report                 --- maven-project-info-reports-plugin:3.0.0:team
[INFO] Generating "Source Code Management" report --- maven-project-info-reports-plugin:3.0.0:scm
[INFO] Generating "Summary" report              --- maven-project-info-reports-plugin:3.0.0:summary
[INFO] Generating "Surefire Report" report      --- maven-surefire-report-plugin:3.0.0-M4:report-only
[WARNING] Unable to locate Test Source XRef to link to - DISABLED
[INFO] Generating "Rat Report" report           --- apache-rat-plugin:0.13:rat
[INFO] Added 1 additional default licenses.
[INFO] Enabled default license matchers.
[INFO] Added 1 custom approved licenses.
[INFO] Will parse SCM ignores for exclusions...
[INFO] Finished adding exclusions from SCM ignore files.
[INFO] 62 implicit excludes (use -debug for more details).
[INFO] 2 explicit excludes (use -debug for more details).
[INFO] 35 resources included (use -debug for more details)
[JENKINS] Archiving site from <https://builds.apache.org/job/openmeetings/ws/openmeetings-util/target/site> to /x1/jenkins/jenkins-home/jobs/openmeetings/site/openmeetings-util
[INFO] 
[INFO] --- maven-resources-plugin:3.1.0:resources (default-resources) @ openmeetings-util ---
[INFO] Using 'UTF-8' encoding to copy filtered resources.
[INFO] Copying 2 resources
[INFO] Copying 3 resources
[INFO] 
[INFO] --- maven-compiler-plugin:3.8.1:compile (default-compile) @ openmeetings-util ---
[INFO] Changes detected - recompiling the module!
[INFO] Compiling 23 source files to <https://builds.apache.org/job/openmeetings/ws/openmeetings-util/target/classes>
[INFO] 
[INFO] --- maven-resources-plugin:3.1.0:testResources (default-testResources) @ openmeetings-util ---
[INFO] Using 'UTF-8' encoding to copy filtered resources.
[INFO] Copying 2 resources
[INFO] Copying 3 resources
[INFO] 
[INFO] --- maven-compiler-plugin:3.8.1:testCompile (default-testCompile) @ openmeetings-util ---
[INFO] Changes detected - recompiling the module!
[INFO] Compiling 6 source files to <https://builds.apache.org/job/openmeetings/ws/openmeetings-util/target/test-classes>
[INFO] 
[INFO] --- maven-surefire-plugin:3.0.0-M4:test (default-test) @ openmeetings-util ---
[INFO] Downloading from central: https://repo.maven.apache.org/maven2/org/junit/platform/junit-platform-launcher/1.6.0/junit-platform-launcher-1.6.0.jar
[INFO] Downloaded from central: https://repo.maven.apache.org/maven2/org/junit/platform/junit-platform-launcher/1.6.0/junit-platform-launcher-1.6.0.jar (122 kB at 1.7 MB/s)
[INFO] Downloading from central: https://repo.maven.apache.org/maven2/org/junit/platform/junit-platform-launcher/1.6.0/junit-platform-launcher-1.6.0.pom
[INFO] Downloaded from central: https://repo.maven.apache.org/maven2/org/junit/platform/junit-platform-launcher/1.6.0/junit-platform-launcher-1.6.0.pom (3.0 kB at 217 kB/s)
[INFO] 
[INFO] -------------------------------------------------------
[INFO]  T E S T S
[INFO] -------------------------------------------------------
[INFO] Running org.apache.openmeetings.util.TestCalendarPatterns
[INFO] Tests run: 1, Failures: 0, Errors: 0, Skipped: 0, Time elapsed: 0.564 s - in org.apache.openmeetings.util.TestCalendarPatterns
[INFO] Running org.apache.openmeetings.util.TestStoredFile
Mar 25, 2020 3:54:26 AM org.apache.tika.config.InitializableProblemHandler$3 handleInitializableProblem
WARNING: J2KImageReader not loaded. JPEG2000 files will not be processed.
See https://pdfbox.apache.org/2.0/dependencies.html#jai-image-io
for optional dependencies.

Mar 25, 2020 3:54:26 AM org.apache.tika.config.InitializableProblemHandler$3 handleInitializableProblem
WARNING: org.xerial's sqlite-jdbc is not loaded.
Please provide the jar on your classpath to parse sqlite files.
See tika-parsers/pom.xml for the correct version.
[INFO] Tests run: 5, Failures: 0, Errors: 0, Skipped: 0, Time elapsed: 2.998 s - in org.apache.openmeetings.util.TestStoredFile
[INFO] Running org.apache.openmeetings.util.crypt.TestSCrypt
[INFO] Tests run: 3, Failures: 0, Errors: 0, Skipped: 0, Time elapsed: 358.58 s - in org.apache.openmeetings.util.crypt.TestSCrypt
[INFO] Running org.apache.openmeetings.util.TestVersion
04:00:31.888 [main] DEBUG org.apache.openmeetings.util.Version - 
	################################################################################
	#                              Openmeetings is up                              #
	#                5.0.0-M4-SNAPSHOT e2d19a8 2020-03-25T03:54:11Z                #
	#                               and ready to use                               #
	################################################################################

[INFO] Tests run: 4, Failures: 0, Errors: 0, Skipped: 0, Time elapsed: 0.415 s - in org.apache.openmeetings.util.TestVersion
[INFO] 
[INFO] Results:
[INFO] 
[INFO] Tests run: 13, Failures: 0, Errors: 0, Skipped: 0
[INFO] 
[JENKINS] Recording test results
[INFO] 
[INFO] --- maven-jar-plugin:3.2.0:jar (default-jar) @ openmeetings-util ---
[INFO] Building jar: <https://builds.apache.org/job/openmeetings/ws/openmeetings-util/target/openmeetings-util-5.0.0-M4-SNAPSHOT.jar>
[INFO] 
[INFO] --- maven-jar-plugin:3.2.0:test-jar (default) @ openmeetings-util ---
[INFO] Building jar: <https://builds.apache.org/job/openmeetings/ws/openmeetings-util/target/openmeetings-util-5.0.0-M4-SNAPSHOT-tests.jar>
[INFO] 
[INFO] --- maven-site-plugin:3.9.0:attach-descriptor (attach-descriptor) @ openmeetings-util ---
[INFO] Skipping because packaging 'jar' is not pom.
[INFO] 
[INFO] --- forbiddenapis:2.7:check (forbiddenapis) @ openmeetings-util ---
[INFO] Scanning for classes to check...
[INFO] Reading bundled API signatures: jdk-deprecated-1.7
[INFO] Reading bundled API signatures: jdk-non-portable
[INFO] Reading inline API signatures...
[INFO] Loading classes to check...
[INFO] Scanning classes for violations...
[INFO] Scanned 26 class file(s) for forbidden API invocations (in 0.54s), 0 error(s).
[INFO] 
[INFO] --- forbiddenapis:2.7:testCheck (forbiddenapis) @ openmeetings-util ---
[INFO] Scanning for classes to check...
[INFO] Reading bundled API signatures: jdk-deprecated-1.7
[INFO] Reading bundled API signatures: jdk-non-portable
[INFO] Reading inline API signatures...
[INFO] Loading classes to check...
[INFO] Scanning classes for violations...
[INFO] Scanned 6 class file(s) for forbidden API invocations (in 0.11s), 0 error(s).
[INFO] 
[INFO] --- maven-install-plugin:2.5.2:install (default-install) @ openmeetings-util ---
[INFO] Installing <https://builds.apache.org/job/openmeetings/ws/openmeetings-util/target/openmeetings-util-5.0.0-M4-SNAPSHOT.jar> to /home/jenkins/jenkins-slave/maven-repositories/1/org/apache/openmeetings/openmeetings-util/5.0.0-M4-SNAPSHOT/openmeetings-util-5.0.0-M4-SNAPSHOT.jar
[INFO] Installing <https://builds.apache.org/job/openmeetings/ws/openmeetings-util/pom.xml> to /home/jenkins/jenkins-slave/maven-repositories/1/org/apache/openmeetings/openmeetings-util/5.0.0-M4-SNAPSHOT/openmeetings-util-5.0.0-M4-SNAPSHOT.pom
[INFO] Installing <https://builds.apache.org/job/openmeetings/ws/openmeetings-util/target/openmeetings-util-5.0.0-M4-SNAPSHOT-tests.jar> to /home/jenkins/jenkins-slave/maven-repositories/1/org/apache/openmeetings/openmeetings-util/5.0.0-M4-SNAPSHOT/openmeetings-util-5.0.0-M4-SNAPSHOT-tests.jar
[INFO] 
[INFO] --------------< org.apache.openmeetings:openmeetings-db >---------------
[INFO] Building Openmeetings DB 5.0.0-M4-SNAPSHOT                        [3/10]
[INFO] --------------------------------[ jar ]---------------------------------
[INFO] Downloading from central: https://repo.maven.apache.org/maven2/org/apache/openjpa/openjpa-maven-plugin/3.1.1/openjpa-maven-plugin-3.1.1.pom
[INFO] Downloaded from central: https://repo.maven.apache.org/maven2/org/apache/openjpa/openjpa-maven-plugin/3.1.1/openjpa-maven-plugin-3.1.1.pom (7.9 kB at 80 kB/s)
[INFO] Downloading from central: https://repo.maven.apache.org/maven2/org/apache/openjpa/openjpa-tools/3.1.1/openjpa-tools-3.1.1.pom
[INFO] Downloaded from central: https://repo.maven.apache.org/maven2/org/apache/openjpa/openjpa-tools/3.1.1/openjpa-tools-3.1.1.pom (2.1 kB at 153 kB/s)
[INFO] Downloading from central: https://repo.maven.apache.org/maven2/org/apache/openjpa/openjpa-maven-plugin/3.1.1/openjpa-maven-plugin-3.1.1.jar
[INFO] Downloaded from central: https://repo.maven.apache.org/maven2/org/apache/openjpa/openjpa-maven-plugin/3.1.1/openjpa-maven-plugin-3.1.1.jar (38 kB at 2.2 MB/s)
[WARNING] Failure to transfer org.wicketstuff:wicketstuff-datastore-hazelcast:9.0.0-M5-SNAPSHOT/maven-metadata.xml from https://oss.sonatype.org/content/repositories/snapshots/ was cached in the local repository, resolution will not be reattempted until the update interval of sonatype-snapshots has elapsed or updates are forced. Original error: Could not transfer metadata org.wicketstuff:wicketstuff-datastore-hazelcast:9.0.0-M5-SNAPSHOT/maven-metadata.xml from/to sonatype-snapshots (https://oss.sonatype.org/content/repositories/snapshots/): Access denied to: https://oss.sonatype.org/content/repositories/snapshots/org/wicketstuff/wicketstuff-datastore-hazelcast/9.0.0-M5-SNAPSHOT/maven-metadata.xml
[INFO] ------------------------------------------------------------------------
[INFO] Reactor Summary for Openmeetings 5.0.0-M4-SNAPSHOT:
[INFO] 
[INFO] Openmeetings ....................................... SUCCESS [02:11 min]
[INFO] Openmeetings Util .................................. SUCCESS [11:41 min]
[INFO] Openmeetings DB .................................... FAILURE [  0.860 s]
[INFO] Openmeetings Core .................................. SKIPPED
[INFO] Openmeetings Install ............................... SKIPPED
[INFO] Openmeetings Service ............................... SKIPPED
[INFO] Openmeetings Webservices ........................... SKIPPED
[INFO] Openmeetings Web ................................... SKIPPED
[INFO] Openmeetings Screen Sharing applet ................. SKIPPED
[INFO] Openmeetings Server ................................ SKIPPED
[INFO] ------------------------------------------------------------------------
[INFO] BUILD FAILURE
[INFO] ------------------------------------------------------------------------
[INFO] Total time:  14:17 min
[INFO] Finished at: 2020-03-25T04:00:59Z
[INFO] ------------------------------------------------------------------------
Waiting for Jenkins to finish collecting data[ERROR] Failed to execute goal on project openmeetings-db: Could not resolve dependencies for project org.apache.openmeetings:openmeetings-db:jar:5.0.0-M4-SNAPSHOT: Failed to collect dependencies at org.wicketstuff:wicketstuff-datastore-hazelcast:jar:9.0.0-M5-SNAPSHOT: Failed to read artifact descriptor for org.wicketstuff:wicketstuff-datastore-hazelcast:jar:9.0.0-M5-SNAPSHOT: Failure to transfer org.wicketstuff:wicketstuff-datastore-hazelcast:pom:9.0.0-M5-SNAPSHOT from https://oss.sonatype.org/content/repositories/snapshots/ was cached in the local repository, resolution will not be reattempted until the update interval of sonatype-snapshots has elapsed or updates are forced. Original error: Could not transfer artifact org.wicketstuff:wicketstuff-datastore-hazelcast:pom:9.0.0-M5-SNAPSHOT from/to sonatype-snapshots (https://oss.sonatype.org/content/repositories/snapshots/): Access denied to: https://oss.sonatype.org/content/repositories/snapshots/org/wicketstuff/wicketstuff-datastore-hazelcast/9.0.0-M5-SNAPSHOT/wicketstuff-datastore-hazelcast-9.0.0-M5-SNAPSHOT.pom -> [Help 1]
[ERROR] 
[ERROR] To see the full stack trace of the errors, re-run Maven with the -e switch.
[ERROR] Re-run Maven using the -X switch to enable full debug logging.
[ERROR] 
[ERROR] For more information about the errors and possible solutions, please read the following articles:
[ERROR] [Help 1] http://cwiki.apache.org/confluence/display/MAVEN/DependencyResolutionException
[ERROR] 
[ERROR] After correcting the problems, you can resume the build with the command
[ERROR]   mvn <goals> -rf :openmeetings-db

[JENKINS] Archiving <https://builds.apache.org/job/openmeetings/ws/openmeetings-server/pom.xml> to org.apache.openmeetings/openmeetings-server/5.0.0-M4-SNAPSHOT/openmeetings-server-5.0.0-M4-SNAPSHOT.pom
[JENKINS] Archiving <https://builds.apache.org/job/openmeetings/ws/openmeetings-screenshare/pom.xml> to org.apache.openmeetings/openmeetings-screenshare/5.0.0-M4-SNAPSHOT/openmeetings-screenshare-5.0.0-M4-SNAPSHOT.pom
[JENKINS] Archiving <https://builds.apache.org/job/openmeetings/ws/openmeetings-util/pom.xml> to org.apache.openmeetings/openmeetings-util/5.0.0-M4-SNAPSHOT/openmeetings-util-5.0.0-M4-SNAPSHOT.pom
[JENKINS] Archiving <https://builds.apache.org/job/openmeetings/ws/openmeetings-util/target/openmeetings-util-5.0.0-M4-SNAPSHOT.jar> to org.apache.openmeetings/openmeetings-util/5.0.0-M4-SNAPSHOT/openmeetings-util-5.0.0-M4-SNAPSHOT.jar
[JENKINS] Archiving <https://builds.apache.org/job/openmeetings/ws/openmeetings-util/target/openmeetings-util-5.0.0-M4-SNAPSHOT-tests.jar> to org.apache.openmeetings/openmeetings-util/5.0.0-M4-SNAPSHOT/openmeetings-util-5.0.0-M4-SNAPSHOT-tests.jar
[JENKINS] Archiving <https://builds.apache.org/job/openmeetings/ws/openmeetings-install/pom.xml> to org.apache.openmeetings/openmeetings-install/5.0.0-M4-SNAPSHOT/openmeetings-install-5.0.0-M4-SNAPSHOT.pom
[JENKINS] Archiving <https://builds.apache.org/job/openmeetings/ws/openmeetings-service/pom.xml> to org.apache.openmeetings/openmeetings-service/5.0.0-M4-SNAPSHOT/openmeetings-service-5.0.0-M4-SNAPSHOT.pom
[JENKINS] Archiving <https://builds.apache.org/job/openmeetings/ws/pom.xml> to org.apache.openmeetings/openmeetings-parent/5.0.0-M4-SNAPSHOT/openmeetings-parent-5.0.0-M4-SNAPSHOT.pom
[JENKINS] Archiving <https://builds.apache.org/job/openmeetings/ws/target/openmeetings-parent-5.0.0-M4-SNAPSHOT-site.xml> to org.apache.openmeetings/openmeetings-parent/5.0.0-M4-SNAPSHOT/openmeetings-parent-5.0.0-M4-SNAPSHOT-site.xml
[Fast Archiver] Compressed 51.16 KB of artifacts by 62.6% relative to #3061
[JENKINS] Archiving <https://builds.apache.org/job/openmeetings/ws/openmeetings-db/pom.xml> to org.apache.openmeetings/openmeetings-db/5.0.0-M4-SNAPSHOT/openmeetings-db-5.0.0-M4-SNAPSHOT.pom
[JENKINS] Archiving <https://builds.apache.org/job/openmeetings/ws/openmeetings-web/pom.xml> to org.apache.openmeetings/openmeetings-web/5.0.0-M4-SNAPSHOT/openmeetings-web-5.0.0-M4-SNAPSHOT.pom
[JENKINS] Archiving <https://builds.apache.org/job/openmeetings/ws/openmeetings-webservice/pom.xml> to org.apache.openmeetings/openmeetings-webservice/5.0.0-M4-SNAPSHOT/openmeetings-webservice-5.0.0-M4-SNAPSHOT.pom
[JENKINS] Archiving <https://builds.apache.org/job/openmeetings/ws/openmeetings-core/pom.xml> to org.apache.openmeetings/openmeetings-core/5.0.0-M4-SNAPSHOT/openmeetings-core-5.0.0-M4-SNAPSHOT.pom
No mail will be sent out, as 'openmeetings » Openmeetings Server #3062' does not have a result yet. Please make sure you set a proper result in case of pipeline/build scripts.
No mail will be sent out, as 'openmeetings » Openmeetings Screen Sharing applet #3062' does not have a result yet. Please make sure you set a proper result in case of pipeline/build scripts.
No mail will be sent out, as 'openmeetings » Openmeetings Util #3062' does not have a result yet. Please make sure you set a proper result in case of pipeline/build scripts.
No mail will be sent out, as 'openmeetings » Openmeetings Install #3062' does not have a result yet. Please make sure you set a proper result in case of pipeline/build scripts.
No mail will be sent out, as 'openmeetings » Openmeetings Service #3062' does not have a result yet. Please make sure you set a proper result in case of pipeline/build scripts.
No mail will be sent out, as 'openmeetings » Openmeetings #3062' does not have a result yet. Please make sure you set a proper result in case of pipeline/build scripts.
Sending e-mails to: dev@openmeetings.apache.org
No mail will be sent out, as 'openmeetings » Openmeetings Web #3062' does not have a result yet. Please make sure you set a proper result in case of pipeline/build scripts.
No mail will be sent out, as 'openmeetings » Openmeetings Webservices #3062' does not have a result yet. Please make sure you set a proper result in case of pipeline/build scripts.
No mail will be sent out, as 'openmeetings » Openmeetings Core #3062' does not have a result yet. Please make sure you set a proper result in case of pipeline/build scripts.
channel stopped
Archiving artifacts
Not sending mail to unregistered user solomax666@gmail.com