You are viewing a plain text version of this content. The canonical link for it is here.
Posted to builds@beam.apache.org by Apache Jenkins Server <je...@builds.apache.org> on 2023/05/14 16:33:53 UTC
Build failed in Jenkins: beam_Publish_Beam_SDK_Snapshots #5361
See <https://ci-beam.apache.org/job/beam_Publish_Beam_SDK_Snapshots/5361/display/redirect>
Changes:
------------------------------------------
[...truncated 2.46 MB...]
#16 1.331 MarkupSafe==2.1.2
#16 1.331 ml-dtypes==0.0.4
#16 1.331 mmh3==3.1.0
#16 1.331 mock==5.0.1
#16 1.331 nltk==3.8.1
#16 1.331 nose==1.3.7
#16 1.331 numpy==1.23.5
#16 1.331 oauth2client==4.1.3
#16 1.331 oauthlib==3.2.2
#16 1.331 objsize==0.6.1
#16 1.331 opt-einsum==3.3.0
#16 1.331 orjson==3.8.9
#16 1.331 overrides==6.5.0
#16 1.331 packaging==23.0
#16 1.331 pandas==1.5.3
#16 1.331 parameterized==0.8.1
#16 1.331 pip==23.1.2
#16 1.331 pluggy==1.0.0
#16 1.331 proto-plus==1.22.2
#16 1.331 protobuf==4.22.1
#16 1.331 psycopg2-binary==2.9.6
#16 1.331 pyarrow==11.0.0
#16 1.331 pyasn1==0.4.8
#16 1.331 pyasn1-modules==0.2.8
#16 1.331 pycparser==2.21
#16 1.331 pydot==1.4.2
#16 1.331 PyHamcrest==1.10.1
#16 1.331 pymongo==4.3.3
#16 1.331 PyMySQL==1.0.3
#16 1.331 pyparsing==3.0.9
#16 1.331 pytest==7.2.2
#16 1.331 pytest-timeout==2.1.0
#16 1.331 pytest-xdist==3.2.1
#16 1.331 python-dateutil==2.8.2
#16 1.331 python-snappy==0.6.1
#16 1.331 pytz==2023.3
#16 1.331 PyYAML==6.0
#16 1.331 regex==2023.3.23
#16 1.331 requests==2.28.2
#16 1.331 requests-mock==1.10.0
#16 1.331 requests-oauthlib==1.3.1
#16 1.331 rsa==4.9
#16 1.331 scikit-learn==1.2.2
#16 1.331 scipy==1.10.1
#16 1.331 setuptools==67.7.2
#16 1.331 six==1.16.0
#16 1.331 sortedcontainers==2.4.0
#16 1.331 soupsieve==2.4
#16 1.331 SQLAlchemy==1.4.47
#16 1.331 sqlparse==0.4.3
#16 1.331 tenacity==8.2.2
#16 1.331 tensorboard==2.12.1
#16 1.331 tensorboard-data-server==0.7.0
#16 1.331 tensorboard-plugin-wit==1.8.1
#16 1.331 tensorflow==2.12.0
#16 1.331 tensorflow-estimator==2.12.0
#16 1.331 tensorflow-io-gcs-filesystem==0.32.0
#16 1.331 termcolor==2.2.0
#16 1.331 testcontainers==3.7.1
#16 1.331 threadpoolctl==3.1.0
#16 1.331 tomli==2.0.1
#16 1.331 tqdm==4.65.0
#16 1.331 typing_extensions==4.5.0
#16 1.331 urllib3==1.26.15
#16 1.331 websocket-client==1.5.1
#16 1.331 Werkzeug==2.2.3
#16 1.331 wheel==0.40.0
#16 1.331 wrapt==1.14.1
#16 1.331 zipp==3.15.0
#16 1.331 zstandard==0.20.0
#16 DONE 1.5s
#17 [beam 13/16] COPY target/LICENSE /opt/apache/beam/
#17 DONE 0.0s
#18 [beam 14/16] COPY target/LICENSE.python /opt/apache/beam/
#18 DONE 0.1s
#19 [beam 15/16] COPY target/NOTICE /opt/apache/beam/
#19 DONE 0.2s
#20 [beam 16/16] COPY target/launcher/linux_amd64/boot /opt/apache/beam/
#20 DONE 0.2s
#21 [third_party_licenses 1/4] COPY target/license_scripts /tmp/license_scripts/
#21 DONE 0.1s
#22 [third_party_licenses 2/4] COPY target/go-licenses/* /opt/apache/beam/third_party_licenses/golang/
#22 DONE 0.1s
#23 [third_party_licenses 3/4] COPY target/license_scripts /tmp/license_scripts/
#23 DONE 0.1s
#24 [third_party_licenses 4/4] RUN if [ "true" = "true" ] ; then pip install 'pip-licenses<5' pyyaml tenacity && python /tmp/license_scripts/pull_licenses_py.py ; fi
#24 1.059 Collecting pip-licenses<5
#24 1.122 Downloading pip_licenses-4.3.1-py3-none-any.whl (19 kB)
#24 1.136 Requirement already satisfied: pyyaml in /usr/local/lib/python3.8/site-packages (6.0)
#24 1.141 Requirement already satisfied: tenacity in /usr/local/lib/python3.8/site-packages (8.2.2)
#24 1.219 Collecting prettytable>=2.3.0 (from pip-licenses<5)
#24 1.234 Downloading prettytable-3.7.0-py3-none-any.whl (27 kB)
#24 1.328 Collecting wcwidth (from prettytable>=2.3.0->pip-licenses<5)
#24 1.343 Downloading wcwidth-0.2.6-py2.py3-none-any.whl (29 kB)
#24 2.531 Installing collected packages: wcwidth, prettytable, pip-licenses
#24 2.692 Successfully installed pip-licenses-4.3.1 prettytable-3.7.0 wcwidth-0.2.6
#24 2.692 WARNING: Running pip as the 'root' user can result in broken permissions and conflicting behaviour with the system package manager. It is recommended to use a virtual environment instead: https://pip.pypa.io/warnings/venv
#24 11.26 INFO:root:Successfully pulled licenses for 133 dependencies
#24 11.26 Skip pulling license for bs4
#24 DONE 11.4s
#25 [stage-2 1/2] COPY --from=third_party_licenses /opt/apache/beam/third_party_licenses /opt/apache/beam/third_party_licenses
#25 DONE 0.6s
#26 [stage-2 2/2] RUN if [ "true" != "true" ] ; then rm -rf /opt/apache/beam/third_party_licenses ; fi
#26 DONE 0.7s
#27 exporting to image
#27 exporting layers
> Task :sdks:python:container:py39:docker
#24 2.670 Installing collected packages: wcwidth, prettytable, pip-licenses
#24 3.085 Successfully installed pip-licenses-4.3.1 prettytable-3.7.0 wcwidth-0.2.6
#24 3.085 WARNING: Running pip as the 'root' user can result in broken permissions and conflicting behaviour with the system package manager. It is recommended to use a virtual environment instead: https://pip.pypa.io/warnings/venv
#24 13.19 INFO:root:Successfully pulled licenses for 133 dependencies
#24 13.19 Skip pulling license for bs4
#24 DONE 13.4s
#25 [stage-2 1/2] COPY --from=third_party_licenses /opt/apache/beam/third_party_licenses /opt/apache/beam/third_party_licenses
#25 DONE 0.5s
#26 [stage-2 2/2] RUN if [ "true" != "true" ] ; then rm -rf /opt/apache/beam/third_party_licenses ; fi
#26 DONE 0.8s
#27 exporting to image
#27 exporting layers
> Task :sdks:python:container:py37:docker
#24 9.963 INFO:root:Successfully pulled licenses for 109 dependencies
#24 9.963 Skip pulling license for bs4
#24 DONE 10.1s
#25 [stage-2 1/2] COPY --from=third_party_licenses /opt/apache/beam/third_party_licenses /opt/apache/beam/third_party_licenses
#25 DONE 0.5s
#26 [stage-2 2/2] RUN if [ "true" != "true" ] ; then rm -rf /opt/apache/beam/third_party_licenses ; fi
#26 DONE 1.3s
#27 exporting to image
#27 exporting layers
#27 exporting layers 17.0s done
#27 writing image sha256:394c5f92dadb87768d383db7881c0999fb88619157109cf1ee369a16d51e3722
#27 writing image sha256:394c5f92dadb87768d383db7881c0999fb88619157109cf1ee369a16d51e3722 0.1s done
#27 naming to gcr.io/apache-beam-testing/beam-sdk/beam_python3.7_sdk:2.48.0.dev done
#27 DONE 17.1s
> Task :sdks:python:container:py37:dockerTag2.48.0-SNAPSHOT
> Task :sdks:python:container:py38:docker
#27 exporting layers 19.6s done
#27 writing image sha256:0673fb617c16eb4b4a8408d0d6fe3175560c4276412b9cfe69552f015588079c
> Task :sdks:python:container:py39:docker
#27 exporting layers 19.5s done
#27 writing image sha256:a658e1aea90d12de8e1125d7546530a10f5530b713dc1287343f54dcd7b05c7d 0.0s done
#27 naming to gcr.io/apache-beam-testing/beam-sdk/beam_python3.9_sdk:2.48.0.dev done
#27 DONE 19.6s
> Task :sdks:python:container:py38:docker
#27 writing image sha256:0673fb617c16eb4b4a8408d0d6fe3175560c4276412b9cfe69552f015588079c 0.1s done
#27 naming to gcr.io/apache-beam-testing/beam-sdk/beam_python3.8_sdk:2.48.0.dev done
#27 DONE 19.7s
> Task :sdks:python:container:py39:dockerTag2.48.0-SNAPSHOT
> Task :sdks:python:container:py38:dockerTag2.48.0-SNAPSHOT
> Task :sdks:python:container:py310:docker
#27 exporting layers 19.5s done
#27 writing image sha256:2ddb0704b6ef2cea94db2b48c12a5b809d0fa90708a6f70292fc1b5ec708e7a4 0.0s done
#27 naming to gcr.io/apache-beam-testing/beam-sdk/beam_python3.10_sdk:2.48.0.dev done
#27 DONE 19.6s
> Task :sdks:python:container:py310:dockerTag2.48.0-SNAPSHOT
> Task :sdks:python:container:py311:docker
#27 exporting layers 20.4s done
#27 writing image sha256:c065898e362b94b8afc115ea460503b4881df686332dcafb1f885aeee3defd68 done
#27 naming to gcr.io/apache-beam-testing/beam-sdk/beam_python3.11_sdk:2.48.0.dev done
#27 DONE 20.4s
> Task :sdks:python:container:py311:dockerTag2.48.0-SNAPSHOT
> Task :sdks:python:container:py37:dockerPush2.48.0-SNAPSHOT
> Task :sdks:python:container:py39:dockerPush2.48.0-SNAPSHOT
> Task :sdks:python:container:py38:dockerPush2.48.0-SNAPSHOT
> Task :sdks:python:container:py310:dockerPush2.48.0-SNAPSHOT
> Task :sdks:python:container:py311:dockerPush2.48.0-SNAPSHOT
> Task :sdks:python:container:py37:dockerTag6fedef1786688437b4ec53e5a78c4e76a26f714c
> Task :sdks:python:container:py37:dockerPush6fedef1786688437b4ec53e5a78c4e76a26f714c
> Task :sdks:python:container:py38:dockerTag6fedef1786688437b4ec53e5a78c4e76a26f714c
> Task :sdks:python:container:py37:dockerTagLatest
> Task :sdks:python:container:py38:dockerPush6fedef1786688437b4ec53e5a78c4e76a26f714c
> Task :sdks:python:container:py38:dockerTagLatest
> Task :sdks:python:container:py37:dockerPushLatest
> Task :sdks:python:container:py37:dockerTagsPush
> Task :sdks:python:container:py38:dockerPushLatest
> Task :sdks:python:container:py38:dockerTagsPush
> Task :sdks:python:container:py39:dockerTag6fedef1786688437b4ec53e5a78c4e76a26f714c
> Task :sdks:python:container:py39:dockerPush6fedef1786688437b4ec53e5a78c4e76a26f714c
> Task :sdks:python:container:py39:dockerTagLatest
> Task :sdks:python:container:py39:dockerPushLatest
> Task :sdks:python:container:py39:dockerTagsPush
> Task :sdks:python:container:py310:dockerTag6fedef1786688437b4ec53e5a78c4e76a26f714c
> Task :sdks:python:container:py310:dockerPush6fedef1786688437b4ec53e5a78c4e76a26f714c
> Task :sdks:python:container:py310:dockerTagLatest
> Task :sdks:python:container:py310:dockerPushLatest
> Task :sdks:python:container:py310:dockerTagsPush
> Task :sdks:python:container:py311:dockerTag6fedef1786688437b4ec53e5a78c4e76a26f714c
> Task :sdks:python:container:py311:dockerPush6fedef1786688437b4ec53e5a78c4e76a26f714c
> Task :sdks:python:container:py311:dockerTagLatest
> Task :sdks:python:container:py311:dockerPushLatest
> Task :sdks:python:container:py311:dockerTagsPush
FAILURE: Build failed with an exception.
* What went wrong:
Execution failed for task ':sdks:java:container:java8:docker'.
> Process 'command 'docker'' finished with non-zero exit value 1
* Try:
> Run with --stacktrace option to get the stack trace.
> Run with --info or --debug option to get more log output.
* Get more help at https://help.gradle.org
Deprecated Gradle features were used in this build, making it incompatible with Gradle 8.0.
You can use '--warning-mode all' to show the individual deprecation warnings and determine if they come from your own scripts or plugins.
See https://docs.gradle.org/7.5.1/userguide/command_line_interface.html#sec:command_line_warnings
Execution optimizations have been disabled for 3 invalid unit(s) of work during this build to ensure correctness.
Please consult deprecation warnings for more details.
BUILD FAILED in 20m 26s
200 actionable tasks: 188 executed, 12 up-to-date
Publishing build scan...
https://ge.apache.org/s/pcqv7nevrah2u
Build step 'Invoke Gradle script' changed build result to FAILURE
Build step 'Invoke Gradle script' marked build as failure
---------------------------------------------------------------------
To unsubscribe, e-mail: builds-unsubscribe@beam.apache.org
For additional commands, e-mail: builds-help@beam.apache.org
Jenkins build is back to normal : beam_Publish_Beam_SDK_Snapshots #5362
Posted by Apache Jenkins Server <je...@builds.apache.org>.
See <https://ci-beam.apache.org/job/beam_Publish_Beam_SDK_Snapshots/5362/display/redirect>
---------------------------------------------------------------------
To unsubscribe, e-mail: builds-unsubscribe@beam.apache.org
For additional commands, e-mail: builds-help@beam.apache.org