You are viewing a plain text version of this content. The canonical link for it is here.
Posted to builds@beam.apache.org by Apache Jenkins Server <je...@builds.apache.org> on 2019/07/06 01:08:25 UTC

Build failed in Jenkins: beam_PerformanceTests_WordCountIT_Py35 #204

See <https://builds.apache.org/job/beam_PerformanceTests_WordCountIT_Py35/204/display/redirect>

------------------------------------------
[...truncated 46.80 KB...]
Collecting hdfs<3.0.0,>=2.1.0 (from apache-beam==2.15.0.dev0)
Collecting httplib2<=0.12.0,>=0.8 (from apache-beam==2.15.0.dev0)
Collecting mock<3.0.0,>=1.0.1 (from apache-beam==2.15.0.dev0)
  Using cached https://files.pythonhosted.org/packages/e6/35/f187bdf23be87092bd0f1200d43d23076cee4d0dec109f195173fd3ebc79/mock-2.0.0-py2.py3-none-any.whl
Collecting pymongo<4.0.0,>=3.8.0 (from apache-beam==2.15.0.dev0)
  Using cached https://files.pythonhosted.org/packages/6e/6a/ededed811c0b19edb1fd6e381baefc8fef4e2bddc452b43e0bc56bf56e79/pymongo-3.8.0-cp35-cp35m-manylinux1_x86_64.whl
Collecting oauth2client<4,>=2.0.1 (from apache-beam==2.15.0.dev0)
Requirement already satisfied: protobuf<4,>=3.5.0.post1 in <https://builds.apache.org/job/beam_PerformanceTests_WordCountIT_Py35/ws/src/build/gradleenv/-1734967054/lib/python3.5/site-packages> (from apache-beam==2.15.0.dev0) (3.8.0)
Collecting pydot<1.3,>=1.2.0 (from apache-beam==2.15.0.dev0)
Collecting pytz>=2018.3 (from apache-beam==2.15.0.dev0)
  Using cached https://files.pythonhosted.org/packages/3d/73/fe30c2daaaa0713420d0382b16fbb761409f532c56bdcc514bf7b6262bb6/pytz-2019.1-py2.py3-none-any.whl
Collecting pyyaml<4.0.0,>=3.12 (from apache-beam==2.15.0.dev0)
Collecting pyarrow<0.14.0,>=0.11.1 (from apache-beam==2.15.0.dev0)
  Using cached https://files.pythonhosted.org/packages/0e/ee/71955f715d65afa1fc319b33dfe1976cd09a1a349af7756b232dbae85409/pyarrow-0.13.0-cp35-cp35m-manylinux1_x86_64.whl
Collecting avro-python3<2.0.0,>=1.8.1 (from apache-beam==2.15.0.dev0)
Collecting cachetools<4,>=3.1.0 (from apache-beam==2.15.0.dev0)
  Using cached https://files.pythonhosted.org/packages/2f/a6/30b0a0bef12283e83e58c1d6e7b5aabc7acfc4110df81a4471655d33e704/cachetools-3.1.1-py2.py3-none-any.whl
Collecting google-apitools<0.5.29,>=0.5.28 (from apache-beam==2.15.0.dev0)
Collecting google-cloud-datastore<1.8.0,>=1.7.1 (from apache-beam==2.15.0.dev0)
  Using cached https://files.pythonhosted.org/packages/d0/aa/29cbcf8cf7d08ce2d55b9dce858f7c632b434cb6451bed17cb4275804217/google_cloud_datastore-1.7.4-py2.py3-none-any.whl
Collecting google-cloud-pubsub<0.40.0,>=0.39.0 (from apache-beam==2.15.0.dev0)
  Using cached https://files.pythonhosted.org/packages/c0/9a/4455b1c1450e9b912855b58ca6eee7a27ff1e9b52e4d98c243d93256f469/google_cloud_pubsub-0.39.1-py2.py3-none-any.whl
Collecting google-cloud-bigquery<1.7.0,>=1.6.0 (from apache-beam==2.15.0.dev0)
  Using cached https://files.pythonhosted.org/packages/b7/1b/2b95f2fefddbbece38110712c225bfb5649206f4056445653bd5ca4dc86d/google_cloud_bigquery-1.6.1-py2.py3-none-any.whl
Collecting google-cloud-core<0.30.0,>=0.28.1 (from apache-beam==2.15.0.dev0)
  Using cached https://files.pythonhosted.org/packages/0c/f2/3c225e7a69cb27d283b68bff867722bd066bc1858611180197f711815ea5/google_cloud_core-0.29.1-py2.py3-none-any.whl
Collecting google-cloud-bigtable<0.33.0,>=0.31.1 (from apache-beam==2.15.0.dev0)
  Using cached https://files.pythonhosted.org/packages/08/77/b468e209dbb0a6f614e6781f06a4894299a4c6167c2c525cc086caa7c075/google_cloud_bigtable-0.32.2-py2.py3-none-any.whl
Collecting nose>=1.3.7 (from apache-beam==2.15.0.dev0)
  Using cached https://files.pythonhosted.org/packages/15/d8/dd071918c040f50fa1cf80da16423af51ff8ce4a0f2399b7bf8de45ac3d9/nose-1.3.7-py3-none-any.whl
Collecting numpy<2,>=1.14.3 (from apache-beam==2.15.0.dev0)
  Using cached https://files.pythonhosted.org/packages/bb/ef/d5a21cbc094d3f4d5b5336494dbcc9550b70c766a8345513c7c24ed18418/numpy-1.16.4-cp35-cp35m-manylinux1_x86_64.whl
Collecting pandas<0.24,>=0.23.4 (from apache-beam==2.15.0.dev0)
  Using cached https://files.pythonhosted.org/packages/5d/d4/6e9c56a561f1d27407bf29318ca43f36ccaa289271b805a30034eb3a8ec4/pandas-0.23.4-cp35-cp35m-manylinux1_x86_64.whl
Collecting parameterized<0.7.0,>=0.6.0 (from apache-beam==2.15.0.dev0)
  Using cached https://files.pythonhosted.org/packages/3a/49/75f6dadb09e2f8ace3cdffe0c99a04f1b98dff41fbf9e768665d8b469e29/parameterized-0.6.3-py2.py3-none-any.whl
Collecting pyhamcrest<2.0,>=1.9 (from apache-beam==2.15.0.dev0)
  Using cached https://files.pythonhosted.org/packages/9a/d5/d37fd731b7d0e91afcc84577edeccf4638b4f9b82f5ffe2f8b62e2ddc609/PyHamcrest-1.9.0-py2.py3-none-any.whl
Collecting tenacity<6.0,>=5.0.2 (from apache-beam==2.15.0.dev0)
  Using cached https://files.pythonhosted.org/packages/6a/93/dfcf5b1b46ab29196274b78dcba69fab5e54b6dc303a7eed90a79194d277/tenacity-5.0.4-py2.py3-none-any.whl
Requirement already satisfied: six>=1.5.2 in <https://builds.apache.org/job/beam_PerformanceTests_WordCountIT_Py35/ws/src/build/gradleenv/-1734967054/lib/python3.5/site-packages> (from grpcio<2,>=1.8->apache-beam==2.15.0.dev0) (1.12.0)
Collecting docopt (from hdfs<3.0.0,>=2.1.0->apache-beam==2.15.0.dev0)
Collecting requests>=2.7.0 (from hdfs<3.0.0,>=2.1.0->apache-beam==2.15.0.dev0)
  Using cached https://files.pythonhosted.org/packages/51/bd/23c926cd341ea6b7dd0b2a00aba99ae0f828be89d72b2190f27c11d4b7fb/requests-2.22.0-py2.py3-none-any.whl
Collecting pbr>=0.11 (from mock<3.0.0,>=1.0.1->apache-beam==2.15.0.dev0)
  Using cached https://files.pythonhosted.org/packages/f1/f3/9c1fa6496f0adf575441eda21baa6d936395df6c8473c8465d2c525585f6/pbr-5.4.0-py2.py3-none-any.whl
Collecting rsa>=3.1.4 (from oauth2client<4,>=2.0.1->apache-beam==2.15.0.dev0)
  Using cached https://files.pythonhosted.org/packages/02/e5/38518af393f7c214357079ce67a317307936896e961e35450b70fad2a9cf/rsa-4.0-py2.py3-none-any.whl
Collecting pyasn1-modules>=0.0.5 (from oauth2client<4,>=2.0.1->apache-beam==2.15.0.dev0)
  Using cached https://files.pythonhosted.org/packages/91/f0/b03e00ce9fddf4827c42df1c3ce10c74eadebfb706231e8d6d1c356a4062/pyasn1_modules-0.2.5-py2.py3-none-any.whl
Collecting pyasn1>=0.1.7 (from oauth2client<4,>=2.0.1->apache-beam==2.15.0.dev0)
  Using cached https://files.pythonhosted.org/packages/7b/7c/c9386b82a25115cccf1903441bba3cbadcfae7b678a20167347fa8ded34c/pyasn1-0.4.5-py2.py3-none-any.whl
Requirement already satisfied: setuptools in <https://builds.apache.org/job/beam_PerformanceTests_WordCountIT_Py35/ws/src/build/gradleenv/-1734967054/lib/python3.5/site-packages> (from protobuf<4,>=3.5.0.post1->apache-beam==2.15.0.dev0) (41.0.1)
Collecting pyparsing>=2.1.4 (from pydot<1.3,>=1.2.0->apache-beam==2.15.0.dev0)
  Using cached https://files.pythonhosted.org/packages/dd/d9/3ec19e966301a6e25769976999bd7bbe552016f0d32b577dc9d63d2e0c49/pyparsing-2.4.0-py2.py3-none-any.whl
Collecting fasteners>=0.14 (from google-apitools<0.5.29,>=0.5.28->apache-beam==2.15.0.dev0)
  Using cached https://files.pythonhosted.org/packages/18/bd/55eb2d6397b9c0e263af9d091ebdb756b15756029b3cededf6461481bc63/fasteners-0.15-py2.py3-none-any.whl
Collecting google-api-core[grpc]<2.0.0dev,>=1.6.0 (from google-cloud-datastore<1.8.0,>=1.7.1->apache-beam==2.15.0.dev0)
  Using cached https://files.pythonhosted.org/packages/a2/78/bbd685dda48a291b4cc81568ed3e1a89af7a61958dc88a3d52a819b1919d/google_api_core-1.13.0-py2.py3-none-any.whl
Collecting grpc-google-iam-v1<0.12dev,>=0.11.4 (from google-cloud-pubsub<0.40.0,>=0.39.0->apache-beam==2.15.0.dev0)
Collecting google-resumable-media>=0.2.1 (from google-cloud-bigquery<1.7.0,>=1.6.0->apache-beam==2.15.0.dev0)
  Using cached https://files.pythonhosted.org/packages/e2/5d/4bc5c28c252a62efe69ed1a1561da92bd5af8eca0cdcdf8e60354fae9b29/google_resumable_media-0.3.2-py2.py3-none-any.whl
Collecting python-dateutil>=2.5.0 (from pandas<0.24,>=0.23.4->apache-beam==2.15.0.dev0)
  Using cached https://files.pythonhosted.org/packages/41/17/c62faccbfbd163c7f57f3844689e3a78bae1f403648a6afb1d0866d87fbb/python_dateutil-2.8.0-py2.py3-none-any.whl
Collecting certifi>=2017.4.17 (from requests>=2.7.0->hdfs<3.0.0,>=2.1.0->apache-beam==2.15.0.dev0)
  Using cached https://files.pythonhosted.org/packages/69/1b/b853c7a9d4f6a6d00749e94eb6f3a041e342a885b87340b79c1ef73e3a78/certifi-2019.6.16-py2.py3-none-any.whl
Collecting idna<2.9,>=2.5 (from requests>=2.7.0->hdfs<3.0.0,>=2.1.0->apache-beam==2.15.0.dev0)
  Using cached https://files.pythonhosted.org/packages/14/2c/cd551d81dbe15200be1cf41cd03869a46fe7226e7450af7a6545bfc474c9/idna-2.8-py2.py3-none-any.whl
Collecting chardet<3.1.0,>=3.0.2 (from requests>=2.7.0->hdfs<3.0.0,>=2.1.0->apache-beam==2.15.0.dev0)
  Using cached https://files.pythonhosted.org/packages/bc/a9/01ffebfb562e4274b6487b4bb1ddec7ca55ec7510b22e4c51f14098443b8/chardet-3.0.4-py2.py3-none-any.whl
Collecting urllib3!=1.25.0,!=1.25.1,<1.26,>=1.21.1 (from requests>=2.7.0->hdfs<3.0.0,>=2.1.0->apache-beam==2.15.0.dev0)
  Using cached https://files.pythonhosted.org/packages/e6/60/247f23a7121ae632d62811ba7f273d0e58972d75e58a94d329d51550a47d/urllib3-1.25.3-py2.py3-none-any.whl
Collecting monotonic>=0.1 (from fasteners>=0.14->google-apitools<0.5.29,>=0.5.28->apache-beam==2.15.0.dev0)
  Using cached https://files.pythonhosted.org/packages/ac/aa/063eca6a416f397bd99552c534c6d11d57f58f2e94c14780f3bbf818c4cf/monotonic-1.5-py2.py3-none-any.whl
Collecting googleapis-common-protos!=1.5.4,<2.0dev,>=1.5.3 (from google-api-core[grpc]<2.0.0dev,>=1.6.0->google-cloud-datastore<1.8.0,>=1.7.1->apache-beam==2.15.0.dev0)
Collecting google-auth<2.0dev,>=0.4.0 (from google-api-core[grpc]<2.0.0dev,>=1.6.0->google-cloud-datastore<1.8.0,>=1.7.1->apache-beam==2.15.0.dev0)
  Using cached https://files.pythonhosted.org/packages/c5/9b/ed0516cc1f7609fb0217e3057ff4f0f9f3e3ce79a369c6af4a6c5ca25664/google_auth-1.6.3-py2.py3-none-any.whl
Installing collected packages: crcmod, dill, fastavro, docopt, certifi, idna, chardet, urllib3, requests, hdfs, httplib2, pbr, mock, pymongo, pyasn1, rsa, pyasn1-modules, oauth2client, pyparsing, pydot, pytz, pyyaml, numpy, pyarrow, avro-python3, cachetools, monotonic, fasteners, google-apitools, googleapis-common-protos, google-auth, google-api-core, google-cloud-core, google-cloud-datastore, grpc-google-iam-v1, google-cloud-pubsub, google-resumable-media, google-cloud-bigquery, google-cloud-bigtable, nose, python-dateutil, pandas, parameterized, pyhamcrest, tenacity, apache-beam
  Running setup.py develop for apache-beam
Successfully installed apache-beam avro-python3-1.9.0 cachetools-3.1.1 certifi-2019.6.16 chardet-3.0.4 crcmod-1.7 dill-0.2.9 docopt-0.6.2 fastavro-0.21.24 fasteners-0.15 google-api-core-1.13.0 google-apitools-0.5.28 google-auth-1.6.3 google-cloud-bigquery-1.6.1 google-cloud-bigtable-0.32.2 google-cloud-core-0.29.1 google-cloud-datastore-1.7.4 google-cloud-pubsub-0.39.1 google-resumable-media-0.3.2 googleapis-common-protos-1.6.0 grpc-google-iam-v1-0.11.4 hdfs-2.5.8 httplib2-0.12.0 idna-2.8 mock-2.0.0 monotonic-1.5 nose-1.3.7 numpy-1.16.4 oauth2client-3.0.0 pandas-0.23.4 parameterized-0.6.3 pbr-5.4.0 pyarrow-0.13.0 pyasn1-0.4.5 pyasn1-modules-0.2.5 pydot-1.2.4 pyhamcrest-1.9.0 pymongo-3.8.0 pyparsing-2.4.0 python-dateutil-2.8.0 pytz-2019.1 pyyaml-3.13 requests-2.22.0 rsa-4.0 tenacity-5.0.4 urllib3-1.25.3
:sdks:python:test-suites:dataflow:py35:installGcpTest (Thread[Execution worker for ':',5,main]) completed. Took 22.285 secs.
:sdks:python:test-suites:dataflow:py35:integrationTest (Thread[Execution worker for ':',5,main]) started.

> Task :sdks:python:test-suites:dataflow:py35:integrationTest
Caching disabled for task ':sdks:python:test-suites:dataflow:py35:integrationTest': Caching has not been enabled for the task
Task ':sdks:python:test-suites:dataflow:py35:integrationTest' is not up-to-date because:
  Task has not declared any outputs despite executing actions.
Custom actions are attached to task ':sdks:python:test-suites:dataflow:py35:integrationTest'.
Starting process 'command 'sh''. Working directory: <https://builds.apache.org/job/beam_PerformanceTests_WordCountIT_Py35/ws/src/sdks/python/test-suites/dataflow/py35> Command: sh -c . <https://builds.apache.org/job/beam_PerformanceTests_WordCountIT_Py35/ws/src/build/gradleenv/-1734967054/bin/activate> && <https://builds.apache.org/job/beam_PerformanceTests_WordCountIT_Py35/ws/src/sdks/python/scripts/run_integration_test.sh> --test_opts "--tests=apache_beam.examples.wordcount_it_test:WordCountIT.test_wordcount_it --attr=IT --nocapture" --pipeline_opts "--project=apache-beam-testing --staging_location=gs://temp-storage-for-end-to-end-tests/staging-it --temp_location=gs://temp-storage-for-end-to-end-tests/temp-it --input=gs://apache-beam-samples/input_small_files/ascii_sort_1MB_input.0000* --output=gs://temp-storage-for-end-to-end-tests/py-it-cloud/output --expect_checksum=ea0ca2e5ee4ea5f218790f28d0b9fe7d09d8d710 --num_workers=10 --autoscaling_algorithm=NONE --runner=TestDataflowRunner --sdk_location=test-suites/dataflow/py35/build/apache-beam.tar.gz"
Successfully started process 'command 'sh''
>>> RUNNING integration tests with pipeline options: --project=apache-beam-testing --staging_location=gs://temp-storage-for-end-to-end-tests/staging-it --temp_location=gs://temp-storage-for-end-to-end-tests/temp-it --input=gs://apache-beam-samples/input_small_files/ascii_sort_1MB_input.0000* --output=gs://temp-storage-for-end-to-end-tests/py-it-cloud/output --expect_checksum=ea0ca2e5ee4ea5f218790f28d0b9fe7d09d8d710 --num_workers=10 --autoscaling_algorithm=NONE --runner=TestDataflowRunner --sdk_location=test-suites/dataflow/py35/build/apache-beam.tar.gz
>>>   test options: --tests=apache_beam.examples.wordcount_it_test:WordCountIT.test_wordcount_it --attr=IT --nocapture
running nosetests
running egg_info
writing apache_beam.egg-info/PKG-INFO
writing top-level names to apache_beam.egg-info/top_level.txt
writing requirements to apache_beam.egg-info/requires.txt
writing entry points to apache_beam.egg-info/entry_points.txt
writing dependency_links to apache_beam.egg-info/dependency_links.txt
reading manifest file 'apache_beam.egg-info/SOURCES.txt'
reading manifest template 'MANIFEST.in'
writing manifest file 'apache_beam.egg-info/SOURCES.txt'

STDERR: beam_fn_api.proto: warning: Import google/protobuf/descriptor.proto but not used.
beam_fn_api.proto: warning: Import google/protobuf/wrappers.proto but not used.
root: Generating grammar tables from /usr/lib/python3.5/lib2to3/PatternGrammar.txt
root: Generating grammar tables from /usr/lib/python3.5/lib2to3/PatternGrammar.txt
root: Generating grammar tables from /usr/lib/python3.5/lib2to3/PatternGrammar.txt
root: Generating grammar tables from /usr/lib/python3.5/lib2to3/PatternGrammar.txt
root: Generating grammar tables from /usr/lib/python3.5/lib2to3/PatternGrammar.txt
root: Generating grammar tables from /usr/lib/python3.5/lib2to3/PatternGrammar.txt
root: Generating grammar tables from /usr/lib/python3.5/lib2to3/PatternGrammar.txt
root: Generating grammar tables from /usr/lib/python3.5/lib2to3/PatternGrammar.txt
root: Generating grammar tables from /usr/lib/python3.5/lib2to3/PatternGrammar.txt
root: Generating grammar tables from /usr/lib/python3.5/lib2to3/PatternGrammar.txt
root: Generating grammar tables from /usr/lib/python3.5/lib2to3/PatternGrammar.txt
root: Generating grammar tables from /usr/lib/python3.5/lib2to3/PatternGrammar.txt
RefactoringTool: Skipping optional fixer: idioms
root: Generating grammar tables from /usr/lib/python3.5/lib2to3/PatternGrammar.txt
root: Generating grammar tables from /usr/lib/python3.5/lib2to3/PatternGrammar.txt
root: Generating grammar tables from /usr/lib/python3.5/lib2to3/PatternGrammar.txt
root: Generating grammar tables from /usr/lib/python3.5/lib2to3/PatternGrammar.txt
root: Generating grammar tables from /usr/lib/python3.5/lib2to3/PatternGrammar.txt
root: Generating grammar tables from /usr/lib/python3.5/lib2to3/PatternGrammar.txt
root: Generating grammar tables from /usr/lib/python3.5/lib2to3/PatternGrammar.txt
root: Generating grammar tables from /usr/lib/python3.5/lib2to3/PatternGrammar.txt
root: Generating grammar tables from /usr/lib/python3.5/lib2to3/PatternGrammar.txt
root: Generating grammar tables from /usr/lib/python3.5/lib2to3/PatternGrammar.txt
root: Generating grammar tables from /usr/lib/python3.5/lib2to3/PatternGrammar.txt
root: Generating grammar tables from /usr/lib/python3.5/lib2to3/PatternGrammar.txt
root: Generating grammar tables from /usr/lib/python3.5/lib2to3/PatternGrammar.txt
root: Generating grammar tables from /usr/lib/python3.5/lib2to3/PatternGrammar.txt
root: Generating grammar tables from /usr/lib/python3.5/lib2to3/PatternGrammar.txt
root: Generating grammar tables from /usr/lib/python3.5/lib2to3/PatternGrammar.txt
root: Generating grammar tables from /usr/lib/python3.5/lib2to3/PatternGrammar.txt
root: Generating grammar tables from /usr/lib/python3.5/lib2to3/PatternGrammar.txt
root: Generating grammar tables from /usr/lib/python3.5/lib2to3/PatternGrammar.txt
root: Generating grammar tables from /usr/lib/python3.5/lib2to3/PatternGrammar.txt
root: Generating grammar tables from /usr/lib/python3.5/lib2to3/PatternGrammar.txt
root: Generating grammar tables from /usr/lib/python3.5/lib2to3/PatternGrammar.txt
root: Generating grammar tables from /usr/lib/python3.5/lib2to3/PatternGrammar.txt
RefactoringTool: Skipping optional fixer: ws_comma
root: Generating grammar tables from /usr/lib/python3.5/lib2to3/PatternGrammar.txt
root: Generating grammar tables from /usr/lib/python3.5/lib2to3/PatternGrammar.txt
root: Generating grammar tables from /usr/lib/python3.5/lib2to3/PatternGrammar.txt
root: Generating grammar tables from /usr/lib/python3.5/lib2to3/PatternGrammar.txt
root: Generating grammar tables from /usr/lib/python3.5/lib2to3/PatternGrammar.txt
root: Generating grammar tables from /usr/lib/python3.5/lib2to3/PatternGrammar.txt
root: Generating grammar tables from /usr/lib/python3.5/lib2to3/PatternGrammar.txt
root: Generating grammar tables from /usr/lib/python3.5/lib2to3/PatternGrammar.txt
root: Generating grammar tables from /usr/lib/python3.5/lib2to3/PatternGrammar.txt
root: Generating grammar tables from /usr/lib/python3.5/lib2to3/PatternGrammar.txt
root: Generating grammar tables from /usr/lib/python3.5/lib2to3/PatternGrammar.txt
root: Generating grammar tables from /usr/lib/python3.5/lib2to3/PatternGrammar.txt
root: Generating grammar tables from /usr/lib/python3.5/lib2to3/PatternGrammar.txt
root: Generating grammar tables from /usr/lib/python3.5/lib2to3/PatternGrammar.txt
root: Generating grammar tables from /usr/lib/python3.5/lib2to3/PatternGrammar.txt
root: Generating grammar tables from /usr/lib/python3.5/lib2to3/PatternGrammar.txt
root: Generating grammar tables from /usr/lib/python3.5/lib2to3/PatternGrammar.txt
root: Generating grammar tables from /usr/lib/python3.5/lib2to3/PatternGrammar.txt
root: Generating grammar tables from /usr/lib/python3.5/lib2to3/PatternGrammar.txt
root: Generating grammar tables from /usr/lib/python3.5/lib2to3/PatternGrammar.txt
root: Generating grammar tables from /usr/lib/python3.5/lib2to3/PatternGrammar.txt
RefactoringTool: No changes to <https://builds.apache.org/job/beam_PerformanceTests_WordCountIT_Py35/ws/src/sdks/python/test-suites/dataflow/py35/build/srcs/sdks/python/apache_beam/portability/api/beam_artifact_api_pb2.py>
RefactoringTool: Refactored <https://builds.apache.org/job/beam_PerformanceTests_WordCountIT_Py35/ws/src/sdks/python/test-suites/dataflow/py35/build/srcs/sdks/python/apache_beam/portability/api/beam_artifact_api_pb2_grpc.py>
RefactoringTool: Refactored <https://builds.apache.org/job/beam_PerformanceTests_WordCountIT_Py35/ws/src/sdks/python/test-suites/dataflow/py35/build/srcs/sdks/python/apache_beam/portability/api/beam_expansion_api_pb2.py>
RefactoringTool: Refactored <https://builds.apache.org/job/beam_PerformanceTests_WordCountIT_Py35/ws/src/sdks/python/test-suites/dataflow/py35/build/srcs/sdks/python/apache_beam/portability/api/beam_expansion_api_pb2_grpc.py>
RefactoringTool: Refactored <https://builds.apache.org/job/beam_PerformanceTests_WordCountIT_Py35/ws/src/sdks/python/test-suites/dataflow/py35/build/srcs/sdks/python/apache_beam/portability/api/beam_fn_api_pb2.py>
RefactoringTool: Refactored <https://builds.apache.org/job/beam_PerformanceTests_WordCountIT_Py35/ws/src/sdks/python/test-suites/dataflow/py35/build/srcs/sdks/python/apache_beam/portability/api/beam_fn_api_pb2_grpc.py>
RefactoringTool: Refactored <https://builds.apache.org/job/beam_PerformanceTests_WordCountIT_Py35/ws/src/sdks/python/test-suites/dataflow/py35/build/srcs/sdks/python/apache_beam/portability/api/beam_job_api_pb2.py>
RefactoringTool: Refactored <https://builds.apache.org/job/beam_PerformanceTests_WordCountIT_Py35/ws/src/sdks/python/test-suites/dataflow/py35/build/srcs/sdks/python/apache_beam/portability/api/beam_job_api_pb2_grpc.py>
RefactoringTool: No changes to <https://builds.apache.org/job/beam_PerformanceTests_WordCountIT_Py35/ws/src/sdks/python/test-suites/dataflow/py35/build/srcs/sdks/python/apache_beam/portability/api/beam_provision_api_pb2.py>
RefactoringTool: Refactored <https://builds.apache.org/job/beam_PerformanceTests_WordCountIT_Py35/ws/src/sdks/python/test-suites/dataflow/py35/build/srcs/sdks/python/apache_beam/portability/api/beam_provision_api_pb2_grpc.py>
RefactoringTool: Refactored <https://builds.apache.org/job/beam_PerformanceTests_WordCountIT_Py35/ws/src/sdks/python/test-suites/dataflow/py35/build/srcs/sdks/python/apache_beam/portability/api/beam_runner_api_pb2.py>
RefactoringTool: No changes to <https://builds.apache.org/job/beam_PerformanceTests_WordCountIT_Py35/ws/src/sdks/python/test-suites/dataflow/py35/build/srcs/sdks/python/apache_beam/portability/api/endpoints_pb2.py>
RefactoringTool: Refactored <https://builds.apache.org/job/beam_PerformanceTests_WordCountIT_Py35/ws/src/sdks/python/test-suites/dataflow/py35/build/srcs/sdks/python/apache_beam/portability/api/external_transforms_pb2.py>
RefactoringTool: Refactored <https://builds.apache.org/job/beam_PerformanceTests_WordCountIT_Py35/ws/src/sdks/python/test-suites/dataflow/py35/build/srcs/sdks/python/apache_beam/portability/api/metrics_pb2.py>
RefactoringTool: Refactored <https://builds.apache.org/job/beam_PerformanceTests_WordCountIT_Py35/ws/src/sdks/python/test-suites/dataflow/py35/build/srcs/sdks/python/apache_beam/portability/api/standard_window_fns_pb2.py>
RefactoringTool: Files that were modified:
RefactoringTool: <https://builds.apache.org/job/beam_PerformanceTests_WordCountIT_Py35/ws/src/sdks/python/test-suites/dataflow/py35/build/srcs/sdks/python/apache_beam/portability/api/beam_artifact_api_pb2.py>
RefactoringTool: <https://builds.apache.org/job/beam_PerformanceTests_WordCountIT_Py35/ws/src/sdks/python/test-suites/dataflow/py35/build/srcs/sdks/python/apache_beam/portability/api/beam_artifact_api_pb2_grpc.py>
RefactoringTool: <https://builds.apache.org/job/beam_PerformanceTests_WordCountIT_Py35/ws/src/sdks/python/test-suites/dataflow/py35/build/srcs/sdks/python/apache_beam/portability/api/beam_expansion_api_pb2.py>
RefactoringTool: <https://builds.apache.org/job/beam_PerformanceTests_WordCountIT_Py35/ws/src/sdks/python/test-suites/dataflow/py35/build/srcs/sdks/python/apache_beam/portability/api/beam_expansion_api_pb2_grpc.py>
RefactoringTool: <https://builds.apache.org/job/beam_PerformanceTests_WordCountIT_Py35/ws/src/sdks/python/test-suites/dataflow/py35/build/srcs/sdks/python/apache_beam/portability/api/beam_fn_api_pb2.py>
RefactoringTool: <https://builds.apache.org/job/beam_PerformanceTests_WordCountIT_Py35/ws/src/sdks/python/test-suites/dataflow/py35/build/srcs/sdks/python/apache_beam/portability/api/beam_fn_api_pb2_grpc.py>
RefactoringTool: <https://builds.apache.org/job/beam_PerformanceTests_WordCountIT_Py35/ws/src/sdks/python/test-suites/dataflow/py35/build/srcs/sdks/python/apache_beam/portability/api/beam_job_api_pb2.py>
RefactoringTool: <https://builds.apache.org/job/beam_PerformanceTests_WordCountIT_Py35/ws/src/sdks/python/test-suites/dataflow/py35/build/srcs/sdks/python/apache_beam/portability/api/beam_job_api_pb2_grpc.py>
RefactoringTool: <https://builds.apache.org/job/beam_PerformanceTests_WordCountIT_Py35/ws/src/sdks/python/test-suites/dataflow/py35/build/srcs/sdks/python/apache_beam/portability/api/beam_provision_api_pb2.py>
RefactoringTool: <https://builds.apache.org/job/beam_PerformanceTests_WordCountIT_Py35/ws/src/sdks/python/test-suites/dataflow/py35/build/srcs/sdks/python/apache_beam/portability/api/beam_provision_api_pb2_grpc.py>
RefactoringTool: <https://builds.apache.org/job/beam_PerformanceTests_WordCountIT_Py35/ws/src/sdks/python/test-suites/dataflow/py35/build/srcs/sdks/python/apache_beam/portability/api/beam_runner_api_pb2.py>
RefactoringTool: <https://builds.apache.org/job/beam_PerformanceTests_WordCountIT_Py35/ws/src/sdks/python/test-suites/dataflow/py35/build/srcs/sdks/python/apache_beam/portability/api/endpoints_pb2.py>
RefactoringTool: <https://builds.apache.org/job/beam_PerformanceTests_WordCountIT_Py35/ws/src/sdks/python/test-suites/dataflow/py35/build/srcs/sdks/python/apache_beam/portability/api/external_transforms_pb2.py>
RefactoringTool: <https://builds.apache.org/job/beam_PerformanceTests_WordCountIT_Py35/ws/src/sdks/python/test-suites/dataflow/py35/build/srcs/sdks/python/apache_beam/portability/api/metrics_pb2.py>
RefactoringTool: <https://builds.apache.org/job/beam_PerformanceTests_WordCountIT_Py35/ws/src/sdks/python/test-suites/dataflow/py35/build/srcs/sdks/python/apache_beam/portability/api/standard_window_fns_pb2.py>
setup.py:177: UserWarning: Some syntactic constructs of Python 3 are not yet fully supported by Apache Beam.
  'Some syntactic constructs of Python 3 are not yet fully supported by '
<https://builds.apache.org/job/beam_PerformanceTests_WordCountIT_Py35/ws/src/build/gradleenv/-1734967054/lib/python3.5/site-packages/setuptools/dist.py>:472: UserWarning: Normalizing '2.15.0.dev' to '2.15.0.dev0'
  normalized_version,
warning: no files found matching 'README.md'
warning: no files found matching 'NOTICE'
warning: no files found matching 'LICENSE'
warning: cmd: standard file not found: should have one of README, README.rst, README.txt, README.md

setup.py:177: UserWarning: Some syntactic constructs of Python 3 are not yet fully supported by Apache Beam.
  'Some syntactic constructs of Python 3 are not yet fully supported by '
<https://builds.apache.org/job/beam_PerformanceTests_WordCountIT_Py35/ws/src/build/gradleenv/-1734967054/lib/python3.5/site-packages/setuptools/dist.py>:472: UserWarning: Normalizing '2.15.0.dev' to '2.15.0.dev0'
  normalized_version,
warning: no files found matching 'README.md'
warning: no files found matching 'NOTICE'
warning: no files found matching 'LICENSE'
<https://builds.apache.org/job/beam_PerformanceTests_WordCountIT_Py35/ws/src/sdks/python/apache_beam/__init__.py>:84: UserWarning: Some syntactic constructs of Python 3 are not yet fully supported by Apache Beam.
  'Some syntactic constructs of Python 3 are not yet fully supported by '
test_wordcount_it (apache_beam.examples.wordcount_it_test.WordCountIT) ... 
2019-07-06 01:08:24,090 b89f8376 MainThread beam_integration_benchmark(1/1) ERROR    Error during benchmark beam_integration_benchmark
Traceback (most recent call last):
  File "<https://builds.apache.org/job/beam_PerformanceTests_WordCountIT_Py35/ws/PerfKitBenchmarker/perfkitbenchmarker/pkb.py",> line 760, in RunBenchmark
    DoRunPhase(spec, collector, detailed_timer)
  File "<https://builds.apache.org/job/beam_PerformanceTests_WordCountIT_Py35/ws/PerfKitBenchmarker/perfkitbenchmarker/pkb.py",> line 609, in DoRunPhase
    samples = spec.BenchmarkRun(spec)
  File "<https://builds.apache.org/job/beam_PerformanceTests_WordCountIT_Py35/ws/PerfKitBenchmarker/perfkitbenchmarker/linux_benchmarks/beam_integration_benchmark.py",> line 160, in Run
    job_type=job_type)
  File "<https://builds.apache.org/job/beam_PerformanceTests_WordCountIT_Py35/ws/PerfKitBenchmarker/perfkitbenchmarker/providers/gcp/gcp_dpb_dataflow.py",> line 90, in SubmitJob
    assert retcode == 0, "Integration Test Failed."
AssertionError: Integration Test Failed.
2019-07-06 01:08:24,091 b89f8376 MainThread beam_integration_benchmark(1/1) INFO     Cleaning up benchmark beam_integration_benchmark
2019-07-06 01:08:24,094 b89f8376 MainThread beam_integration_benchmark(1/1) ERROR    Exception running benchmark
Traceback (most recent call last):
  File "<https://builds.apache.org/job/beam_PerformanceTests_WordCountIT_Py35/ws/PerfKitBenchmarker/perfkitbenchmarker/pkb.py",> line 903, in RunBenchmarkTask
    RunBenchmark(spec, collector)
  File "<https://builds.apache.org/job/beam_PerformanceTests_WordCountIT_Py35/ws/PerfKitBenchmarker/perfkitbenchmarker/pkb.py",> line 760, in RunBenchmark
    DoRunPhase(spec, collector, detailed_timer)
  File "<https://builds.apache.org/job/beam_PerformanceTests_WordCountIT_Py35/ws/PerfKitBenchmarker/perfkitbenchmarker/pkb.py",> line 609, in DoRunPhase
    samples = spec.BenchmarkRun(spec)
  File "<https://builds.apache.org/job/beam_PerformanceTests_WordCountIT_Py35/ws/PerfKitBenchmarker/perfkitbenchmarker/linux_benchmarks/beam_integration_benchmark.py",> line 160, in Run
    job_type=job_type)
  File "<https://builds.apache.org/job/beam_PerformanceTests_WordCountIT_Py35/ws/PerfKitBenchmarker/perfkitbenchmarker/providers/gcp/gcp_dpb_dataflow.py",> line 90, in SubmitJob
    assert retcode == 0, "Integration Test Failed."
AssertionError: Integration Test Failed.
2019-07-06 01:08:24,094 b89f8376 MainThread beam_integration_benchmark(1/1) ERROR    Benchmark 1/1 beam_integration_benchmark (UID: beam_integration_benchmark0) failed. Execution will continue.
2019-07-06 01:08:24,094 b89f8376 MainThread beam_integration_benchmark(1/1) INFO     Benchmark run statuses:
---------------------------------------------------------------------------------
Name                        UID                          Status  Failed Substatus
---------------------------------------------------------------------------------
beam_integration_benchmark  beam_integration_benchmark0  FAILED                  
---------------------------------------------------------------------------------
Success rate: 0.00% (0/1)
2019-07-06 01:08:24,094 b89f8376 MainThread beam_integration_benchmark(1/1) INFO     Complete logs can be found at: <https://builds.apache.org/job/beam_PerformanceTests_WordCountIT_Py35/ws/runs/b89f8376/pkb.log>
2019-07-06 01:08:24,095 b89f8376 MainThread beam_integration_benchmark(1/1) INFO     Completion statuses can be found at: <https://builds.apache.org/job/beam_PerformanceTests_WordCountIT_Py35/ws/runs/b89f8376/completion_statuses.json>
Build step 'Execute shell' marked build as failure

---------------------------------------------------------------------
To unsubscribe, e-mail: builds-unsubscribe@beam.apache.org
For additional commands, e-mail: builds-help@beam.apache.org


Jenkins build is back to normal : beam_PerformanceTests_WordCountIT_Py35 #211

Posted by Apache Jenkins Server <je...@builds.apache.org>.
See <https://builds.apache.org/job/beam_PerformanceTests_WordCountIT_Py35/211/display/redirect>


---------------------------------------------------------------------
To unsubscribe, e-mail: builds-unsubscribe@beam.apache.org
For additional commands, e-mail: builds-help@beam.apache.org


Build failed in Jenkins: beam_PerformanceTests_WordCountIT_Py35 #210

Posted by Apache Jenkins Server <je...@builds.apache.org>.
See <https://builds.apache.org/job/beam_PerformanceTests_WordCountIT_Py35/210/display/redirect>

------------------------------------------
[...truncated 47.18 KB...]
Collecting hdfs<3.0.0,>=2.1.0 (from apache-beam==2.15.0.dev0)
Collecting httplib2<=0.12.0,>=0.8 (from apache-beam==2.15.0.dev0)
Collecting mock<3.0.0,>=1.0.1 (from apache-beam==2.15.0.dev0)
  Using cached https://files.pythonhosted.org/packages/e6/35/f187bdf23be87092bd0f1200d43d23076cee4d0dec109f195173fd3ebc79/mock-2.0.0-py2.py3-none-any.whl
Collecting pymongo<4.0.0,>=3.8.0 (from apache-beam==2.15.0.dev0)
  Using cached https://files.pythonhosted.org/packages/6e/6a/ededed811c0b19edb1fd6e381baefc8fef4e2bddc452b43e0bc56bf56e79/pymongo-3.8.0-cp35-cp35m-manylinux1_x86_64.whl
Collecting oauth2client<4,>=2.0.1 (from apache-beam==2.15.0.dev0)
Requirement already satisfied: protobuf<4,>=3.5.0.post1 in <https://builds.apache.org/job/beam_PerformanceTests_WordCountIT_Py35/ws/src/build/gradleenv/-1734967054/lib/python3.5/site-packages> (from apache-beam==2.15.0.dev0) (3.8.0)
Collecting pydot<1.3,>=1.2.0 (from apache-beam==2.15.0.dev0)
Collecting pytz>=2018.3 (from apache-beam==2.15.0.dev0)
  Using cached https://files.pythonhosted.org/packages/3d/73/fe30c2daaaa0713420d0382b16fbb761409f532c56bdcc514bf7b6262bb6/pytz-2019.1-py2.py3-none-any.whl
Collecting pyyaml<4.0.0,>=3.12 (from apache-beam==2.15.0.dev0)
Collecting avro-python3<2.0.0,>=1.8.1 (from apache-beam==2.15.0.dev0)
Collecting pyarrow<0.14.0,>=0.11.1 (from apache-beam==2.15.0.dev0)
  Using cached https://files.pythonhosted.org/packages/0e/ee/71955f715d65afa1fc319b33dfe1976cd09a1a349af7756b232dbae85409/pyarrow-0.13.0-cp35-cp35m-manylinux1_x86_64.whl
Collecting cachetools<4,>=3.1.0 (from apache-beam==2.15.0.dev0)
  Using cached https://files.pythonhosted.org/packages/2f/a6/30b0a0bef12283e83e58c1d6e7b5aabc7acfc4110df81a4471655d33e704/cachetools-3.1.1-py2.py3-none-any.whl
Collecting google-apitools<0.5.29,>=0.5.28 (from apache-beam==2.15.0.dev0)
Collecting google-cloud-datastore<1.8.0,>=1.7.1 (from apache-beam==2.15.0.dev0)
  Using cached https://files.pythonhosted.org/packages/d0/aa/29cbcf8cf7d08ce2d55b9dce858f7c632b434cb6451bed17cb4275804217/google_cloud_datastore-1.7.4-py2.py3-none-any.whl
Collecting google-cloud-pubsub<0.40.0,>=0.39.0 (from apache-beam==2.15.0.dev0)
  Using cached https://files.pythonhosted.org/packages/c0/9a/4455b1c1450e9b912855b58ca6eee7a27ff1e9b52e4d98c243d93256f469/google_cloud_pubsub-0.39.1-py2.py3-none-any.whl
Collecting google-cloud-bigquery<1.7.0,>=1.6.0 (from apache-beam==2.15.0.dev0)
  Using cached https://files.pythonhosted.org/packages/b7/1b/2b95f2fefddbbece38110712c225bfb5649206f4056445653bd5ca4dc86d/google_cloud_bigquery-1.6.1-py2.py3-none-any.whl
Collecting google-cloud-core<0.30.0,>=0.28.1 (from apache-beam==2.15.0.dev0)
  Using cached https://files.pythonhosted.org/packages/0c/f2/3c225e7a69cb27d283b68bff867722bd066bc1858611180197f711815ea5/google_cloud_core-0.29.1-py2.py3-none-any.whl
Collecting google-cloud-bigtable<0.33.0,>=0.31.1 (from apache-beam==2.15.0.dev0)
  Using cached https://files.pythonhosted.org/packages/08/77/b468e209dbb0a6f614e6781f06a4894299a4c6167c2c525cc086caa7c075/google_cloud_bigtable-0.32.2-py2.py3-none-any.whl
Collecting nose>=1.3.7 (from apache-beam==2.15.0.dev0)
  Using cached https://files.pythonhosted.org/packages/15/d8/dd071918c040f50fa1cf80da16423af51ff8ce4a0f2399b7bf8de45ac3d9/nose-1.3.7-py3-none-any.whl
Collecting numpy<2,>=1.14.3 (from apache-beam==2.15.0.dev0)
  Using cached https://files.pythonhosted.org/packages/bb/ef/d5a21cbc094d3f4d5b5336494dbcc9550b70c766a8345513c7c24ed18418/numpy-1.16.4-cp35-cp35m-manylinux1_x86_64.whl
Collecting pandas<0.24,>=0.23.4 (from apache-beam==2.15.0.dev0)
  Using cached https://files.pythonhosted.org/packages/5d/d4/6e9c56a561f1d27407bf29318ca43f36ccaa289271b805a30034eb3a8ec4/pandas-0.23.4-cp35-cp35m-manylinux1_x86_64.whl
Collecting parameterized<0.7.0,>=0.6.0 (from apache-beam==2.15.0.dev0)
  Using cached https://files.pythonhosted.org/packages/3a/49/75f6dadb09e2f8ace3cdffe0c99a04f1b98dff41fbf9e768665d8b469e29/parameterized-0.6.3-py2.py3-none-any.whl
Collecting pyhamcrest<2.0,>=1.9 (from apache-beam==2.15.0.dev0)
  Using cached https://files.pythonhosted.org/packages/9a/d5/d37fd731b7d0e91afcc84577edeccf4638b4f9b82f5ffe2f8b62e2ddc609/PyHamcrest-1.9.0-py2.py3-none-any.whl
Collecting tenacity<6.0,>=5.0.2 (from apache-beam==2.15.0.dev0)
  Using cached https://files.pythonhosted.org/packages/6a/93/dfcf5b1b46ab29196274b78dcba69fab5e54b6dc303a7eed90a79194d277/tenacity-5.0.4-py2.py3-none-any.whl
Requirement already satisfied: six>=1.5.2 in <https://builds.apache.org/job/beam_PerformanceTests_WordCountIT_Py35/ws/src/build/gradleenv/-1734967054/lib/python3.5/site-packages> (from grpcio<2,>=1.8->apache-beam==2.15.0.dev0) (1.12.0)
Collecting requests>=2.7.0 (from hdfs<3.0.0,>=2.1.0->apache-beam==2.15.0.dev0)
  Using cached https://files.pythonhosted.org/packages/51/bd/23c926cd341ea6b7dd0b2a00aba99ae0f828be89d72b2190f27c11d4b7fb/requests-2.22.0-py2.py3-none-any.whl
Collecting docopt (from hdfs<3.0.0,>=2.1.0->apache-beam==2.15.0.dev0)
Collecting pbr>=0.11 (from mock<3.0.0,>=1.0.1->apache-beam==2.15.0.dev0)
  Using cached https://files.pythonhosted.org/packages/f1/f3/9c1fa6496f0adf575441eda21baa6d936395df6c8473c8465d2c525585f6/pbr-5.4.0-py2.py3-none-any.whl
Collecting pyasn1>=0.1.7 (from oauth2client<4,>=2.0.1->apache-beam==2.15.0.dev0)
  Using cached https://files.pythonhosted.org/packages/7b/7c/c9386b82a25115cccf1903441bba3cbadcfae7b678a20167347fa8ded34c/pyasn1-0.4.5-py2.py3-none-any.whl
Collecting pyasn1-modules>=0.0.5 (from oauth2client<4,>=2.0.1->apache-beam==2.15.0.dev0)
  Using cached https://files.pythonhosted.org/packages/91/f0/b03e00ce9fddf4827c42df1c3ce10c74eadebfb706231e8d6d1c356a4062/pyasn1_modules-0.2.5-py2.py3-none-any.whl
Collecting rsa>=3.1.4 (from oauth2client<4,>=2.0.1->apache-beam==2.15.0.dev0)
  Using cached https://files.pythonhosted.org/packages/02/e5/38518af393f7c214357079ce67a317307936896e961e35450b70fad2a9cf/rsa-4.0-py2.py3-none-any.whl
Requirement already satisfied: setuptools in <https://builds.apache.org/job/beam_PerformanceTests_WordCountIT_Py35/ws/src/build/gradleenv/-1734967054/lib/python3.5/site-packages> (from protobuf<4,>=3.5.0.post1->apache-beam==2.15.0.dev0) (41.0.1)
Collecting pyparsing>=2.1.4 (from pydot<1.3,>=1.2.0->apache-beam==2.15.0.dev0)
  Using cached https://files.pythonhosted.org/packages/dd/d9/3ec19e966301a6e25769976999bd7bbe552016f0d32b577dc9d63d2e0c49/pyparsing-2.4.0-py2.py3-none-any.whl
Collecting fasteners>=0.14 (from google-apitools<0.5.29,>=0.5.28->apache-beam==2.15.0.dev0)
  Using cached https://files.pythonhosted.org/packages/18/bd/55eb2d6397b9c0e263af9d091ebdb756b15756029b3cededf6461481bc63/fasteners-0.15-py2.py3-none-any.whl
Collecting google-api-core[grpc]<2.0.0dev,>=1.6.0 (from google-cloud-datastore<1.8.0,>=1.7.1->apache-beam==2.15.0.dev0)
  Using cached https://files.pythonhosted.org/packages/a2/78/bbd685dda48a291b4cc81568ed3e1a89af7a61958dc88a3d52a819b1919d/google_api_core-1.13.0-py2.py3-none-any.whl
Collecting grpc-google-iam-v1<0.12dev,>=0.11.4 (from google-cloud-pubsub<0.40.0,>=0.39.0->apache-beam==2.15.0.dev0)
Collecting google-resumable-media>=0.2.1 (from google-cloud-bigquery<1.7.0,>=1.6.0->apache-beam==2.15.0.dev0)
  Using cached https://files.pythonhosted.org/packages/e2/5d/4bc5c28c252a62efe69ed1a1561da92bd5af8eca0cdcdf8e60354fae9b29/google_resumable_media-0.3.2-py2.py3-none-any.whl
Collecting python-dateutil>=2.5.0 (from pandas<0.24,>=0.23.4->apache-beam==2.15.0.dev0)
  Using cached https://files.pythonhosted.org/packages/41/17/c62faccbfbd163c7f57f3844689e3a78bae1f403648a6afb1d0866d87fbb/python_dateutil-2.8.0-py2.py3-none-any.whl
Collecting chardet<3.1.0,>=3.0.2 (from requests>=2.7.0->hdfs<3.0.0,>=2.1.0->apache-beam==2.15.0.dev0)
  Using cached https://files.pythonhosted.org/packages/bc/a9/01ffebfb562e4274b6487b4bb1ddec7ca55ec7510b22e4c51f14098443b8/chardet-3.0.4-py2.py3-none-any.whl
Collecting certifi>=2017.4.17 (from requests>=2.7.0->hdfs<3.0.0,>=2.1.0->apache-beam==2.15.0.dev0)
  Using cached https://files.pythonhosted.org/packages/69/1b/b853c7a9d4f6a6d00749e94eb6f3a041e342a885b87340b79c1ef73e3a78/certifi-2019.6.16-py2.py3-none-any.whl
Collecting urllib3!=1.25.0,!=1.25.1,<1.26,>=1.21.1 (from requests>=2.7.0->hdfs<3.0.0,>=2.1.0->apache-beam==2.15.0.dev0)
  Using cached https://files.pythonhosted.org/packages/e6/60/247f23a7121ae632d62811ba7f273d0e58972d75e58a94d329d51550a47d/urllib3-1.25.3-py2.py3-none-any.whl
Collecting idna<2.9,>=2.5 (from requests>=2.7.0->hdfs<3.0.0,>=2.1.0->apache-beam==2.15.0.dev0)
  Using cached https://files.pythonhosted.org/packages/14/2c/cd551d81dbe15200be1cf41cd03869a46fe7226e7450af7a6545bfc474c9/idna-2.8-py2.py3-none-any.whl
Collecting monotonic>=0.1 (from fasteners>=0.14->google-apitools<0.5.29,>=0.5.28->apache-beam==2.15.0.dev0)
  Using cached https://files.pythonhosted.org/packages/ac/aa/063eca6a416f397bd99552c534c6d11d57f58f2e94c14780f3bbf818c4cf/monotonic-1.5-py2.py3-none-any.whl
Collecting google-auth<2.0dev,>=0.4.0 (from google-api-core[grpc]<2.0.0dev,>=1.6.0->google-cloud-datastore<1.8.0,>=1.7.1->apache-beam==2.15.0.dev0)
  Using cached https://files.pythonhosted.org/packages/c5/9b/ed0516cc1f7609fb0217e3057ff4f0f9f3e3ce79a369c6af4a6c5ca25664/google_auth-1.6.3-py2.py3-none-any.whl
Collecting googleapis-common-protos!=1.5.4,<2.0dev,>=1.5.3 (from google-api-core[grpc]<2.0.0dev,>=1.6.0->google-cloud-datastore<1.8.0,>=1.7.1->apache-beam==2.15.0.dev0)
Installing collected packages: crcmod, dill, fastavro, chardet, certifi, urllib3, idna, requests, docopt, hdfs, httplib2, pbr, mock, pymongo, pyasn1, pyasn1-modules, rsa, oauth2client, pyparsing, pydot, pytz, pyyaml, avro-python3, numpy, pyarrow, cachetools, monotonic, fasteners, google-apitools, google-auth, googleapis-common-protos, google-api-core, google-cloud-core, google-cloud-datastore, grpc-google-iam-v1, google-cloud-pubsub, google-resumable-media, google-cloud-bigquery, google-cloud-bigtable, nose, python-dateutil, pandas, parameterized, pyhamcrest, tenacity, apache-beam
  Running setup.py develop for apache-beam
Successfully installed apache-beam avro-python3-1.9.0 cachetools-3.1.1 certifi-2019.6.16 chardet-3.0.4 crcmod-1.7 dill-0.2.9 docopt-0.6.2 fastavro-0.21.24 fasteners-0.15 google-api-core-1.13.0 google-apitools-0.5.28 google-auth-1.6.3 google-cloud-bigquery-1.6.1 google-cloud-bigtable-0.32.2 google-cloud-core-0.29.1 google-cloud-datastore-1.7.4 google-cloud-pubsub-0.39.1 google-resumable-media-0.3.2 googleapis-common-protos-1.6.0 grpc-google-iam-v1-0.11.4 hdfs-2.5.8 httplib2-0.12.0 idna-2.8 mock-2.0.0 monotonic-1.5 nose-1.3.7 numpy-1.16.4 oauth2client-3.0.0 pandas-0.23.4 parameterized-0.6.3 pbr-5.4.0 pyarrow-0.13.0 pyasn1-0.4.5 pyasn1-modules-0.2.5 pydot-1.2.4 pyhamcrest-1.9.0 pymongo-3.8.0 pyparsing-2.4.0 python-dateutil-2.8.0 pytz-2019.1 pyyaml-3.13 requests-2.22.0 rsa-4.0 tenacity-5.0.4 urllib3-1.25.3
:sdks:python:test-suites:dataflow:py35:installGcpTest (Thread[Execution worker for ':',5,main]) completed. Took 21.832 secs.
:sdks:python:test-suites:dataflow:py35:integrationTest (Thread[Execution worker for ':',5,main]) started.

> Task :sdks:python:test-suites:dataflow:py35:integrationTest
Caching disabled for task ':sdks:python:test-suites:dataflow:py35:integrationTest': Caching has not been enabled for the task
Task ':sdks:python:test-suites:dataflow:py35:integrationTest' is not up-to-date because:
  Task has not declared any outputs despite executing actions.
Custom actions are attached to task ':sdks:python:test-suites:dataflow:py35:integrationTest'.
Starting process 'command 'sh''. Working directory: <https://builds.apache.org/job/beam_PerformanceTests_WordCountIT_Py35/ws/src/sdks/python/test-suites/dataflow/py35> Command: sh -c . <https://builds.apache.org/job/beam_PerformanceTests_WordCountIT_Py35/ws/src/build/gradleenv/-1734967054/bin/activate> && <https://builds.apache.org/job/beam_PerformanceTests_WordCountIT_Py35/ws/src/sdks/python/scripts/run_integration_test.sh> --test_opts "--tests=apache_beam.examples.wordcount_it_test:WordCountIT.test_wordcount_it --attr=IT --nocapture" --pipeline_opts "--project=apache-beam-testing --staging_location=gs://temp-storage-for-end-to-end-tests/staging-it --temp_location=gs://temp-storage-for-end-to-end-tests/temp-it --input=gs://apache-beam-samples/input_small_files/ascii_sort_1MB_input.0000* --output=gs://temp-storage-for-end-to-end-tests/py-it-cloud/output --expect_checksum=ea0ca2e5ee4ea5f218790f28d0b9fe7d09d8d710 --num_workers=10 --autoscaling_algorithm=NONE --runner=TestDataflowRunner --sdk_location=test-suites/dataflow/py35/build/apache-beam.tar.gz"
Successfully started process 'command 'sh''
>>> RUNNING integration tests with pipeline options: --project=apache-beam-testing --staging_location=gs://temp-storage-for-end-to-end-tests/staging-it --temp_location=gs://temp-storage-for-end-to-end-tests/temp-it --input=gs://apache-beam-samples/input_small_files/ascii_sort_1MB_input.0000* --output=gs://temp-storage-for-end-to-end-tests/py-it-cloud/output --expect_checksum=ea0ca2e5ee4ea5f218790f28d0b9fe7d09d8d710 --num_workers=10 --autoscaling_algorithm=NONE --runner=TestDataflowRunner --sdk_location=test-suites/dataflow/py35/build/apache-beam.tar.gz
>>>   test options: --tests=apache_beam.examples.wordcount_it_test:WordCountIT.test_wordcount_it --attr=IT --nocapture
running nosetests
running egg_info
writing apache_beam.egg-info/PKG-INFO
writing dependency_links to apache_beam.egg-info/dependency_links.txt
writing top-level names to apache_beam.egg-info/top_level.txt
writing requirements to apache_beam.egg-info/requires.txt
writing entry points to apache_beam.egg-info/entry_points.txt
reading manifest file 'apache_beam.egg-info/SOURCES.txt'
reading manifest template 'MANIFEST.in'
writing manifest file 'apache_beam.egg-info/SOURCES.txt'

STDERR: beam_fn_api.proto: warning: Import google/protobuf/descriptor.proto but not used.
beam_fn_api.proto: warning: Import google/protobuf/wrappers.proto but not used.
root: Generating grammar tables from /usr/lib/python3.5/lib2to3/PatternGrammar.txt
root: Generating grammar tables from /usr/lib/python3.5/lib2to3/PatternGrammar.txt
root: Generating grammar tables from /usr/lib/python3.5/lib2to3/PatternGrammar.txt
root: Generating grammar tables from /usr/lib/python3.5/lib2to3/PatternGrammar.txt
root: Generating grammar tables from /usr/lib/python3.5/lib2to3/PatternGrammar.txt
root: Generating grammar tables from /usr/lib/python3.5/lib2to3/PatternGrammar.txt
root: Generating grammar tables from /usr/lib/python3.5/lib2to3/PatternGrammar.txt
root: Generating grammar tables from /usr/lib/python3.5/lib2to3/PatternGrammar.txt
root: Generating grammar tables from /usr/lib/python3.5/lib2to3/PatternGrammar.txt
root: Generating grammar tables from /usr/lib/python3.5/lib2to3/PatternGrammar.txt
root: Generating grammar tables from /usr/lib/python3.5/lib2to3/PatternGrammar.txt
root: Generating grammar tables from /usr/lib/python3.5/lib2to3/PatternGrammar.txt
RefactoringTool: Skipping optional fixer: idioms
root: Generating grammar tables from /usr/lib/python3.5/lib2to3/PatternGrammar.txt
root: Generating grammar tables from /usr/lib/python3.5/lib2to3/PatternGrammar.txt
root: Generating grammar tables from /usr/lib/python3.5/lib2to3/PatternGrammar.txt
root: Generating grammar tables from /usr/lib/python3.5/lib2to3/PatternGrammar.txt
root: Generating grammar tables from /usr/lib/python3.5/lib2to3/PatternGrammar.txt
root: Generating grammar tables from /usr/lib/python3.5/lib2to3/PatternGrammar.txt
root: Generating grammar tables from /usr/lib/python3.5/lib2to3/PatternGrammar.txt
root: Generating grammar tables from /usr/lib/python3.5/lib2to3/PatternGrammar.txt
root: Generating grammar tables from /usr/lib/python3.5/lib2to3/PatternGrammar.txt
root: Generating grammar tables from /usr/lib/python3.5/lib2to3/PatternGrammar.txt
root: Generating grammar tables from /usr/lib/python3.5/lib2to3/PatternGrammar.txt
root: Generating grammar tables from /usr/lib/python3.5/lib2to3/PatternGrammar.txt
root: Generating grammar tables from /usr/lib/python3.5/lib2to3/PatternGrammar.txt
root: Generating grammar tables from /usr/lib/python3.5/lib2to3/PatternGrammar.txt
root: Generating grammar tables from /usr/lib/python3.5/lib2to3/PatternGrammar.txt
root: Generating grammar tables from /usr/lib/python3.5/lib2to3/PatternGrammar.txt
root: Generating grammar tables from /usr/lib/python3.5/lib2to3/PatternGrammar.txt
root: Generating grammar tables from /usr/lib/python3.5/lib2to3/PatternGrammar.txt
root: Generating grammar tables from /usr/lib/python3.5/lib2to3/PatternGrammar.txt
root: Generating grammar tables from /usr/lib/python3.5/lib2to3/PatternGrammar.txt
root: Generating grammar tables from /usr/lib/python3.5/lib2to3/PatternGrammar.txt
root: Generating grammar tables from /usr/lib/python3.5/lib2to3/PatternGrammar.txt
root: Generating grammar tables from /usr/lib/python3.5/lib2to3/PatternGrammar.txt
RefactoringTool: Skipping optional fixer: ws_comma
root: Generating grammar tables from /usr/lib/python3.5/lib2to3/PatternGrammar.txt
root: Generating grammar tables from /usr/lib/python3.5/lib2to3/PatternGrammar.txt
root: Generating grammar tables from /usr/lib/python3.5/lib2to3/PatternGrammar.txt
root: Generating grammar tables from /usr/lib/python3.5/lib2to3/PatternGrammar.txt
root: Generating grammar tables from /usr/lib/python3.5/lib2to3/PatternGrammar.txt
root: Generating grammar tables from /usr/lib/python3.5/lib2to3/PatternGrammar.txt
root: Generating grammar tables from /usr/lib/python3.5/lib2to3/PatternGrammar.txt
root: Generating grammar tables from /usr/lib/python3.5/lib2to3/PatternGrammar.txt
root: Generating grammar tables from /usr/lib/python3.5/lib2to3/PatternGrammar.txt
root: Generating grammar tables from /usr/lib/python3.5/lib2to3/PatternGrammar.txt
root: Generating grammar tables from /usr/lib/python3.5/lib2to3/PatternGrammar.txt
root: Generating grammar tables from /usr/lib/python3.5/lib2to3/PatternGrammar.txt
root: Generating grammar tables from /usr/lib/python3.5/lib2to3/PatternGrammar.txt
root: Generating grammar tables from /usr/lib/python3.5/lib2to3/PatternGrammar.txt
root: Generating grammar tables from /usr/lib/python3.5/lib2to3/PatternGrammar.txt
root: Generating grammar tables from /usr/lib/python3.5/lib2to3/PatternGrammar.txt
root: Generating grammar tables from /usr/lib/python3.5/lib2to3/PatternGrammar.txt
root: Generating grammar tables from /usr/lib/python3.5/lib2to3/PatternGrammar.txt
root: Generating grammar tables from /usr/lib/python3.5/lib2to3/PatternGrammar.txt
root: Generating grammar tables from /usr/lib/python3.5/lib2to3/PatternGrammar.txt
root: Generating grammar tables from /usr/lib/python3.5/lib2to3/PatternGrammar.txt
RefactoringTool: No changes to <https://builds.apache.org/job/beam_PerformanceTests_WordCountIT_Py35/ws/src/sdks/python/test-suites/dataflow/py35/build/srcs/sdks/python/apache_beam/portability/api/beam_artifact_api_pb2.py>
RefactoringTool: Refactored <https://builds.apache.org/job/beam_PerformanceTests_WordCountIT_Py35/ws/src/sdks/python/test-suites/dataflow/py35/build/srcs/sdks/python/apache_beam/portability/api/beam_artifact_api_pb2_grpc.py>
RefactoringTool: Refactored <https://builds.apache.org/job/beam_PerformanceTests_WordCountIT_Py35/ws/src/sdks/python/test-suites/dataflow/py35/build/srcs/sdks/python/apache_beam/portability/api/beam_expansion_api_pb2.py>
RefactoringTool: Refactored <https://builds.apache.org/job/beam_PerformanceTests_WordCountIT_Py35/ws/src/sdks/python/test-suites/dataflow/py35/build/srcs/sdks/python/apache_beam/portability/api/beam_expansion_api_pb2_grpc.py>
RefactoringTool: Refactored <https://builds.apache.org/job/beam_PerformanceTests_WordCountIT_Py35/ws/src/sdks/python/test-suites/dataflow/py35/build/srcs/sdks/python/apache_beam/portability/api/beam_fn_api_pb2.py>
RefactoringTool: Refactored <https://builds.apache.org/job/beam_PerformanceTests_WordCountIT_Py35/ws/src/sdks/python/test-suites/dataflow/py35/build/srcs/sdks/python/apache_beam/portability/api/beam_fn_api_pb2_grpc.py>
RefactoringTool: Refactored <https://builds.apache.org/job/beam_PerformanceTests_WordCountIT_Py35/ws/src/sdks/python/test-suites/dataflow/py35/build/srcs/sdks/python/apache_beam/portability/api/beam_job_api_pb2.py>
RefactoringTool: Refactored <https://builds.apache.org/job/beam_PerformanceTests_WordCountIT_Py35/ws/src/sdks/python/test-suites/dataflow/py35/build/srcs/sdks/python/apache_beam/portability/api/beam_job_api_pb2_grpc.py>
RefactoringTool: No changes to <https://builds.apache.org/job/beam_PerformanceTests_WordCountIT_Py35/ws/src/sdks/python/test-suites/dataflow/py35/build/srcs/sdks/python/apache_beam/portability/api/beam_provision_api_pb2.py>
RefactoringTool: Refactored <https://builds.apache.org/job/beam_PerformanceTests_WordCountIT_Py35/ws/src/sdks/python/test-suites/dataflow/py35/build/srcs/sdks/python/apache_beam/portability/api/beam_provision_api_pb2_grpc.py>
RefactoringTool: Refactored <https://builds.apache.org/job/beam_PerformanceTests_WordCountIT_Py35/ws/src/sdks/python/test-suites/dataflow/py35/build/srcs/sdks/python/apache_beam/portability/api/beam_runner_api_pb2.py>
RefactoringTool: No changes to <https://builds.apache.org/job/beam_PerformanceTests_WordCountIT_Py35/ws/src/sdks/python/test-suites/dataflow/py35/build/srcs/sdks/python/apache_beam/portability/api/endpoints_pb2.py>
RefactoringTool: Refactored <https://builds.apache.org/job/beam_PerformanceTests_WordCountIT_Py35/ws/src/sdks/python/test-suites/dataflow/py35/build/srcs/sdks/python/apache_beam/portability/api/external_transforms_pb2.py>
RefactoringTool: Refactored <https://builds.apache.org/job/beam_PerformanceTests_WordCountIT_Py35/ws/src/sdks/python/test-suites/dataflow/py35/build/srcs/sdks/python/apache_beam/portability/api/metrics_pb2.py>
RefactoringTool: Refactored <https://builds.apache.org/job/beam_PerformanceTests_WordCountIT_Py35/ws/src/sdks/python/test-suites/dataflow/py35/build/srcs/sdks/python/apache_beam/portability/api/standard_window_fns_pb2.py>
RefactoringTool: Files that were modified:
RefactoringTool: <https://builds.apache.org/job/beam_PerformanceTests_WordCountIT_Py35/ws/src/sdks/python/test-suites/dataflow/py35/build/srcs/sdks/python/apache_beam/portability/api/beam_artifact_api_pb2.py>
RefactoringTool: <https://builds.apache.org/job/beam_PerformanceTests_WordCountIT_Py35/ws/src/sdks/python/test-suites/dataflow/py35/build/srcs/sdks/python/apache_beam/portability/api/beam_artifact_api_pb2_grpc.py>
RefactoringTool: <https://builds.apache.org/job/beam_PerformanceTests_WordCountIT_Py35/ws/src/sdks/python/test-suites/dataflow/py35/build/srcs/sdks/python/apache_beam/portability/api/beam_expansion_api_pb2.py>
RefactoringTool: <https://builds.apache.org/job/beam_PerformanceTests_WordCountIT_Py35/ws/src/sdks/python/test-suites/dataflow/py35/build/srcs/sdks/python/apache_beam/portability/api/beam_expansion_api_pb2_grpc.py>
RefactoringTool: <https://builds.apache.org/job/beam_PerformanceTests_WordCountIT_Py35/ws/src/sdks/python/test-suites/dataflow/py35/build/srcs/sdks/python/apache_beam/portability/api/beam_fn_api_pb2.py>
RefactoringTool: <https://builds.apache.org/job/beam_PerformanceTests_WordCountIT_Py35/ws/src/sdks/python/test-suites/dataflow/py35/build/srcs/sdks/python/apache_beam/portability/api/beam_fn_api_pb2_grpc.py>
RefactoringTool: <https://builds.apache.org/job/beam_PerformanceTests_WordCountIT_Py35/ws/src/sdks/python/test-suites/dataflow/py35/build/srcs/sdks/python/apache_beam/portability/api/beam_job_api_pb2.py>
RefactoringTool: <https://builds.apache.org/job/beam_PerformanceTests_WordCountIT_Py35/ws/src/sdks/python/test-suites/dataflow/py35/build/srcs/sdks/python/apache_beam/portability/api/beam_job_api_pb2_grpc.py>
RefactoringTool: <https://builds.apache.org/job/beam_PerformanceTests_WordCountIT_Py35/ws/src/sdks/python/test-suites/dataflow/py35/build/srcs/sdks/python/apache_beam/portability/api/beam_provision_api_pb2.py>
RefactoringTool: <https://builds.apache.org/job/beam_PerformanceTests_WordCountIT_Py35/ws/src/sdks/python/test-suites/dataflow/py35/build/srcs/sdks/python/apache_beam/portability/api/beam_provision_api_pb2_grpc.py>
RefactoringTool: <https://builds.apache.org/job/beam_PerformanceTests_WordCountIT_Py35/ws/src/sdks/python/test-suites/dataflow/py35/build/srcs/sdks/python/apache_beam/portability/api/beam_runner_api_pb2.py>
RefactoringTool: <https://builds.apache.org/job/beam_PerformanceTests_WordCountIT_Py35/ws/src/sdks/python/test-suites/dataflow/py35/build/srcs/sdks/python/apache_beam/portability/api/endpoints_pb2.py>
RefactoringTool: <https://builds.apache.org/job/beam_PerformanceTests_WordCountIT_Py35/ws/src/sdks/python/test-suites/dataflow/py35/build/srcs/sdks/python/apache_beam/portability/api/external_transforms_pb2.py>
RefactoringTool: <https://builds.apache.org/job/beam_PerformanceTests_WordCountIT_Py35/ws/src/sdks/python/test-suites/dataflow/py35/build/srcs/sdks/python/apache_beam/portability/api/metrics_pb2.py>
RefactoringTool: <https://builds.apache.org/job/beam_PerformanceTests_WordCountIT_Py35/ws/src/sdks/python/test-suites/dataflow/py35/build/srcs/sdks/python/apache_beam/portability/api/standard_window_fns_pb2.py>
setup.py:177: UserWarning: Some syntactic constructs of Python 3 are not yet fully supported by Apache Beam.
  'Some syntactic constructs of Python 3 are not yet fully supported by '
<https://builds.apache.org/job/beam_PerformanceTests_WordCountIT_Py35/ws/src/build/gradleenv/-1734967054/lib/python3.5/site-packages/setuptools/dist.py>:472: UserWarning: Normalizing '2.15.0.dev' to '2.15.0.dev0'
  normalized_version,
warning: no files found matching 'README.md'
warning: no files found matching 'NOTICE'
warning: no files found matching 'LICENSE'
warning: cmd: standard file not found: should have one of README, README.rst, README.txt, README.md

setup.py:177: UserWarning: Some syntactic constructs of Python 3 are not yet fully supported by Apache Beam.
  'Some syntactic constructs of Python 3 are not yet fully supported by '
<https://builds.apache.org/job/beam_PerformanceTests_WordCountIT_Py35/ws/src/build/gradleenv/-1734967054/lib/python3.5/site-packages/setuptools/dist.py>:472: UserWarning: Normalizing '2.15.0.dev' to '2.15.0.dev0'
  normalized_version,
warning: no files found matching 'README.md'
warning: no files found matching 'NOTICE'
warning: no files found matching 'LICENSE'
<https://builds.apache.org/job/beam_PerformanceTests_WordCountIT_Py35/ws/src/sdks/python/apache_beam/__init__.py>:84: UserWarning: Some syntactic constructs of Python 3 are not yet fully supported by Apache Beam.
  'Some syntactic constructs of Python 3 are not yet fully supported by '
test_wordcount_it (apache_beam.examples.wordcount_it_test.WordCountIT) ... 
2019-07-07 13:08:23,600 f5c92b8c MainThread beam_integration_benchmark(1/1) ERROR    Error during benchmark beam_integration_benchmark
Traceback (most recent call last):
  File "<https://builds.apache.org/job/beam_PerformanceTests_WordCountIT_Py35/ws/PerfKitBenchmarker/perfkitbenchmarker/pkb.py",> line 760, in RunBenchmark
    DoRunPhase(spec, collector, detailed_timer)
  File "<https://builds.apache.org/job/beam_PerformanceTests_WordCountIT_Py35/ws/PerfKitBenchmarker/perfkitbenchmarker/pkb.py",> line 609, in DoRunPhase
    samples = spec.BenchmarkRun(spec)
  File "<https://builds.apache.org/job/beam_PerformanceTests_WordCountIT_Py35/ws/PerfKitBenchmarker/perfkitbenchmarker/linux_benchmarks/beam_integration_benchmark.py",> line 160, in Run
    job_type=job_type)
  File "<https://builds.apache.org/job/beam_PerformanceTests_WordCountIT_Py35/ws/PerfKitBenchmarker/perfkitbenchmarker/providers/gcp/gcp_dpb_dataflow.py",> line 90, in SubmitJob
    assert retcode == 0, "Integration Test Failed."
AssertionError: Integration Test Failed.
2019-07-07 13:08:23,601 f5c92b8c MainThread beam_integration_benchmark(1/1) INFO     Cleaning up benchmark beam_integration_benchmark
2019-07-07 13:08:23,603 f5c92b8c MainThread beam_integration_benchmark(1/1) ERROR    Exception running benchmark
Traceback (most recent call last):
  File "<https://builds.apache.org/job/beam_PerformanceTests_WordCountIT_Py35/ws/PerfKitBenchmarker/perfkitbenchmarker/pkb.py",> line 903, in RunBenchmarkTask
    RunBenchmark(spec, collector)
  File "<https://builds.apache.org/job/beam_PerformanceTests_WordCountIT_Py35/ws/PerfKitBenchmarker/perfkitbenchmarker/pkb.py",> line 760, in RunBenchmark
    DoRunPhase(spec, collector, detailed_timer)
  File "<https://builds.apache.org/job/beam_PerformanceTests_WordCountIT_Py35/ws/PerfKitBenchmarker/perfkitbenchmarker/pkb.py",> line 609, in DoRunPhase
    samples = spec.BenchmarkRun(spec)
  File "<https://builds.apache.org/job/beam_PerformanceTests_WordCountIT_Py35/ws/PerfKitBenchmarker/perfkitbenchmarker/linux_benchmarks/beam_integration_benchmark.py",> line 160, in Run
    job_type=job_type)
  File "<https://builds.apache.org/job/beam_PerformanceTests_WordCountIT_Py35/ws/PerfKitBenchmarker/perfkitbenchmarker/providers/gcp/gcp_dpb_dataflow.py",> line 90, in SubmitJob
    assert retcode == 0, "Integration Test Failed."
AssertionError: Integration Test Failed.
2019-07-07 13:08:23,604 f5c92b8c MainThread beam_integration_benchmark(1/1) ERROR    Benchmark 1/1 beam_integration_benchmark (UID: beam_integration_benchmark0) failed. Execution will continue.
2019-07-07 13:08:23,604 f5c92b8c MainThread beam_integration_benchmark(1/1) INFO     Benchmark run statuses:
---------------------------------------------------------------------------------
Name                        UID                          Status  Failed Substatus
---------------------------------------------------------------------------------
beam_integration_benchmark  beam_integration_benchmark0  FAILED                  
---------------------------------------------------------------------------------
Success rate: 0.00% (0/1)
2019-07-07 13:08:23,604 f5c92b8c MainThread beam_integration_benchmark(1/1) INFO     Complete logs can be found at: <https://builds.apache.org/job/beam_PerformanceTests_WordCountIT_Py35/ws/runs/f5c92b8c/pkb.log>
2019-07-07 13:08:23,604 f5c92b8c MainThread beam_integration_benchmark(1/1) INFO     Completion statuses can be found at: <https://builds.apache.org/job/beam_PerformanceTests_WordCountIT_Py35/ws/runs/f5c92b8c/completion_statuses.json>
Build step 'Execute shell' marked build as failure

---------------------------------------------------------------------
To unsubscribe, e-mail: builds-unsubscribe@beam.apache.org
For additional commands, e-mail: builds-help@beam.apache.org


Build failed in Jenkins: beam_PerformanceTests_WordCountIT_Py35 #209

Posted by Apache Jenkins Server <je...@builds.apache.org>.
See <https://builds.apache.org/job/beam_PerformanceTests_WordCountIT_Py35/209/display/redirect>

------------------------------------------
[...truncated 46.80 KB...]
Collecting hdfs<3.0.0,>=2.1.0 (from apache-beam==2.15.0.dev0)
Collecting httplib2<=0.12.0,>=0.8 (from apache-beam==2.15.0.dev0)
Collecting mock<3.0.0,>=1.0.1 (from apache-beam==2.15.0.dev0)
  Using cached https://files.pythonhosted.org/packages/e6/35/f187bdf23be87092bd0f1200d43d23076cee4d0dec109f195173fd3ebc79/mock-2.0.0-py2.py3-none-any.whl
Collecting pymongo<4.0.0,>=3.8.0 (from apache-beam==2.15.0.dev0)
  Using cached https://files.pythonhosted.org/packages/6e/6a/ededed811c0b19edb1fd6e381baefc8fef4e2bddc452b43e0bc56bf56e79/pymongo-3.8.0-cp35-cp35m-manylinux1_x86_64.whl
Collecting oauth2client<4,>=2.0.1 (from apache-beam==2.15.0.dev0)
Requirement already satisfied: protobuf<4,>=3.5.0.post1 in <https://builds.apache.org/job/beam_PerformanceTests_WordCountIT_Py35/ws/src/build/gradleenv/-1734967054/lib/python3.5/site-packages> (from apache-beam==2.15.0.dev0) (3.8.0)
Collecting pydot<1.3,>=1.2.0 (from apache-beam==2.15.0.dev0)
Collecting pytz>=2018.3 (from apache-beam==2.15.0.dev0)
  Using cached https://files.pythonhosted.org/packages/3d/73/fe30c2daaaa0713420d0382b16fbb761409f532c56bdcc514bf7b6262bb6/pytz-2019.1-py2.py3-none-any.whl
Collecting pyyaml<4.0.0,>=3.12 (from apache-beam==2.15.0.dev0)
Collecting pyarrow<0.14.0,>=0.11.1 (from apache-beam==2.15.0.dev0)
  Using cached https://files.pythonhosted.org/packages/0e/ee/71955f715d65afa1fc319b33dfe1976cd09a1a349af7756b232dbae85409/pyarrow-0.13.0-cp35-cp35m-manylinux1_x86_64.whl
Collecting avro-python3<2.0.0,>=1.8.1 (from apache-beam==2.15.0.dev0)
Collecting cachetools<4,>=3.1.0 (from apache-beam==2.15.0.dev0)
  Using cached https://files.pythonhosted.org/packages/2f/a6/30b0a0bef12283e83e58c1d6e7b5aabc7acfc4110df81a4471655d33e704/cachetools-3.1.1-py2.py3-none-any.whl
Collecting google-apitools<0.5.29,>=0.5.28 (from apache-beam==2.15.0.dev0)
Collecting google-cloud-datastore<1.8.0,>=1.7.1 (from apache-beam==2.15.0.dev0)
  Using cached https://files.pythonhosted.org/packages/d0/aa/29cbcf8cf7d08ce2d55b9dce858f7c632b434cb6451bed17cb4275804217/google_cloud_datastore-1.7.4-py2.py3-none-any.whl
Collecting google-cloud-pubsub<0.40.0,>=0.39.0 (from apache-beam==2.15.0.dev0)
  Using cached https://files.pythonhosted.org/packages/c0/9a/4455b1c1450e9b912855b58ca6eee7a27ff1e9b52e4d98c243d93256f469/google_cloud_pubsub-0.39.1-py2.py3-none-any.whl
Collecting google-cloud-bigquery<1.7.0,>=1.6.0 (from apache-beam==2.15.0.dev0)
  Using cached https://files.pythonhosted.org/packages/b7/1b/2b95f2fefddbbece38110712c225bfb5649206f4056445653bd5ca4dc86d/google_cloud_bigquery-1.6.1-py2.py3-none-any.whl
Collecting google-cloud-core<0.30.0,>=0.28.1 (from apache-beam==2.15.0.dev0)
  Using cached https://files.pythonhosted.org/packages/0c/f2/3c225e7a69cb27d283b68bff867722bd066bc1858611180197f711815ea5/google_cloud_core-0.29.1-py2.py3-none-any.whl
Collecting google-cloud-bigtable<0.33.0,>=0.31.1 (from apache-beam==2.15.0.dev0)
  Using cached https://files.pythonhosted.org/packages/08/77/b468e209dbb0a6f614e6781f06a4894299a4c6167c2c525cc086caa7c075/google_cloud_bigtable-0.32.2-py2.py3-none-any.whl
Collecting nose>=1.3.7 (from apache-beam==2.15.0.dev0)
  Using cached https://files.pythonhosted.org/packages/15/d8/dd071918c040f50fa1cf80da16423af51ff8ce4a0f2399b7bf8de45ac3d9/nose-1.3.7-py3-none-any.whl
Collecting numpy<2,>=1.14.3 (from apache-beam==2.15.0.dev0)
  Using cached https://files.pythonhosted.org/packages/bb/ef/d5a21cbc094d3f4d5b5336494dbcc9550b70c766a8345513c7c24ed18418/numpy-1.16.4-cp35-cp35m-manylinux1_x86_64.whl
Collecting pandas<0.24,>=0.23.4 (from apache-beam==2.15.0.dev0)
  Using cached https://files.pythonhosted.org/packages/5d/d4/6e9c56a561f1d27407bf29318ca43f36ccaa289271b805a30034eb3a8ec4/pandas-0.23.4-cp35-cp35m-manylinux1_x86_64.whl
Collecting parameterized<0.7.0,>=0.6.0 (from apache-beam==2.15.0.dev0)
  Using cached https://files.pythonhosted.org/packages/3a/49/75f6dadb09e2f8ace3cdffe0c99a04f1b98dff41fbf9e768665d8b469e29/parameterized-0.6.3-py2.py3-none-any.whl
Collecting pyhamcrest<2.0,>=1.9 (from apache-beam==2.15.0.dev0)
  Using cached https://files.pythonhosted.org/packages/9a/d5/d37fd731b7d0e91afcc84577edeccf4638b4f9b82f5ffe2f8b62e2ddc609/PyHamcrest-1.9.0-py2.py3-none-any.whl
Collecting tenacity<6.0,>=5.0.2 (from apache-beam==2.15.0.dev0)
  Using cached https://files.pythonhosted.org/packages/6a/93/dfcf5b1b46ab29196274b78dcba69fab5e54b6dc303a7eed90a79194d277/tenacity-5.0.4-py2.py3-none-any.whl
Requirement already satisfied: six>=1.5.2 in <https://builds.apache.org/job/beam_PerformanceTests_WordCountIT_Py35/ws/src/build/gradleenv/-1734967054/lib/python3.5/site-packages> (from grpcio<2,>=1.8->apache-beam==2.15.0.dev0) (1.12.0)
Collecting requests>=2.7.0 (from hdfs<3.0.0,>=2.1.0->apache-beam==2.15.0.dev0)
  Using cached https://files.pythonhosted.org/packages/51/bd/23c926cd341ea6b7dd0b2a00aba99ae0f828be89d72b2190f27c11d4b7fb/requests-2.22.0-py2.py3-none-any.whl
Collecting docopt (from hdfs<3.0.0,>=2.1.0->apache-beam==2.15.0.dev0)
Collecting pbr>=0.11 (from mock<3.0.0,>=1.0.1->apache-beam==2.15.0.dev0)
  Using cached https://files.pythonhosted.org/packages/f1/f3/9c1fa6496f0adf575441eda21baa6d936395df6c8473c8465d2c525585f6/pbr-5.4.0-py2.py3-none-any.whl
Collecting pyasn1-modules>=0.0.5 (from oauth2client<4,>=2.0.1->apache-beam==2.15.0.dev0)
  Using cached https://files.pythonhosted.org/packages/91/f0/b03e00ce9fddf4827c42df1c3ce10c74eadebfb706231e8d6d1c356a4062/pyasn1_modules-0.2.5-py2.py3-none-any.whl
Collecting rsa>=3.1.4 (from oauth2client<4,>=2.0.1->apache-beam==2.15.0.dev0)
  Using cached https://files.pythonhosted.org/packages/02/e5/38518af393f7c214357079ce67a317307936896e961e35450b70fad2a9cf/rsa-4.0-py2.py3-none-any.whl
Collecting pyasn1>=0.1.7 (from oauth2client<4,>=2.0.1->apache-beam==2.15.0.dev0)
  Using cached https://files.pythonhosted.org/packages/7b/7c/c9386b82a25115cccf1903441bba3cbadcfae7b678a20167347fa8ded34c/pyasn1-0.4.5-py2.py3-none-any.whl
Requirement already satisfied: setuptools in <https://builds.apache.org/job/beam_PerformanceTests_WordCountIT_Py35/ws/src/build/gradleenv/-1734967054/lib/python3.5/site-packages> (from protobuf<4,>=3.5.0.post1->apache-beam==2.15.0.dev0) (41.0.1)
Collecting pyparsing>=2.1.4 (from pydot<1.3,>=1.2.0->apache-beam==2.15.0.dev0)
  Using cached https://files.pythonhosted.org/packages/dd/d9/3ec19e966301a6e25769976999bd7bbe552016f0d32b577dc9d63d2e0c49/pyparsing-2.4.0-py2.py3-none-any.whl
Collecting fasteners>=0.14 (from google-apitools<0.5.29,>=0.5.28->apache-beam==2.15.0.dev0)
  Using cached https://files.pythonhosted.org/packages/18/bd/55eb2d6397b9c0e263af9d091ebdb756b15756029b3cededf6461481bc63/fasteners-0.15-py2.py3-none-any.whl
Collecting google-api-core[grpc]<2.0.0dev,>=1.6.0 (from google-cloud-datastore<1.8.0,>=1.7.1->apache-beam==2.15.0.dev0)
  Using cached https://files.pythonhosted.org/packages/a2/78/bbd685dda48a291b4cc81568ed3e1a89af7a61958dc88a3d52a819b1919d/google_api_core-1.13.0-py2.py3-none-any.whl
Collecting grpc-google-iam-v1<0.12dev,>=0.11.4 (from google-cloud-pubsub<0.40.0,>=0.39.0->apache-beam==2.15.0.dev0)
Collecting google-resumable-media>=0.2.1 (from google-cloud-bigquery<1.7.0,>=1.6.0->apache-beam==2.15.0.dev0)
  Using cached https://files.pythonhosted.org/packages/e2/5d/4bc5c28c252a62efe69ed1a1561da92bd5af8eca0cdcdf8e60354fae9b29/google_resumable_media-0.3.2-py2.py3-none-any.whl
Collecting python-dateutil>=2.5.0 (from pandas<0.24,>=0.23.4->apache-beam==2.15.0.dev0)
  Using cached https://files.pythonhosted.org/packages/41/17/c62faccbfbd163c7f57f3844689e3a78bae1f403648a6afb1d0866d87fbb/python_dateutil-2.8.0-py2.py3-none-any.whl
Collecting certifi>=2017.4.17 (from requests>=2.7.0->hdfs<3.0.0,>=2.1.0->apache-beam==2.15.0.dev0)
  Using cached https://files.pythonhosted.org/packages/69/1b/b853c7a9d4f6a6d00749e94eb6f3a041e342a885b87340b79c1ef73e3a78/certifi-2019.6.16-py2.py3-none-any.whl
Collecting idna<2.9,>=2.5 (from requests>=2.7.0->hdfs<3.0.0,>=2.1.0->apache-beam==2.15.0.dev0)
  Using cached https://files.pythonhosted.org/packages/14/2c/cd551d81dbe15200be1cf41cd03869a46fe7226e7450af7a6545bfc474c9/idna-2.8-py2.py3-none-any.whl
Collecting urllib3!=1.25.0,!=1.25.1,<1.26,>=1.21.1 (from requests>=2.7.0->hdfs<3.0.0,>=2.1.0->apache-beam==2.15.0.dev0)
  Using cached https://files.pythonhosted.org/packages/e6/60/247f23a7121ae632d62811ba7f273d0e58972d75e58a94d329d51550a47d/urllib3-1.25.3-py2.py3-none-any.whl
Collecting chardet<3.1.0,>=3.0.2 (from requests>=2.7.0->hdfs<3.0.0,>=2.1.0->apache-beam==2.15.0.dev0)
  Using cached https://files.pythonhosted.org/packages/bc/a9/01ffebfb562e4274b6487b4bb1ddec7ca55ec7510b22e4c51f14098443b8/chardet-3.0.4-py2.py3-none-any.whl
Collecting monotonic>=0.1 (from fasteners>=0.14->google-apitools<0.5.29,>=0.5.28->apache-beam==2.15.0.dev0)
  Using cached https://files.pythonhosted.org/packages/ac/aa/063eca6a416f397bd99552c534c6d11d57f58f2e94c14780f3bbf818c4cf/monotonic-1.5-py2.py3-none-any.whl
Collecting googleapis-common-protos!=1.5.4,<2.0dev,>=1.5.3 (from google-api-core[grpc]<2.0.0dev,>=1.6.0->google-cloud-datastore<1.8.0,>=1.7.1->apache-beam==2.15.0.dev0)
Collecting google-auth<2.0dev,>=0.4.0 (from google-api-core[grpc]<2.0.0dev,>=1.6.0->google-cloud-datastore<1.8.0,>=1.7.1->apache-beam==2.15.0.dev0)
  Using cached https://files.pythonhosted.org/packages/c5/9b/ed0516cc1f7609fb0217e3057ff4f0f9f3e3ce79a369c6af4a6c5ca25664/google_auth-1.6.3-py2.py3-none-any.whl
Installing collected packages: crcmod, dill, fastavro, certifi, idna, urllib3, chardet, requests, docopt, hdfs, httplib2, pbr, mock, pymongo, pyasn1, pyasn1-modules, rsa, oauth2client, pyparsing, pydot, pytz, pyyaml, numpy, pyarrow, avro-python3, cachetools, monotonic, fasteners, google-apitools, googleapis-common-protos, google-auth, google-api-core, google-cloud-core, google-cloud-datastore, grpc-google-iam-v1, google-cloud-pubsub, google-resumable-media, google-cloud-bigquery, google-cloud-bigtable, nose, python-dateutil, pandas, parameterized, pyhamcrest, tenacity, apache-beam
  Running setup.py develop for apache-beam
Successfully installed apache-beam avro-python3-1.9.0 cachetools-3.1.1 certifi-2019.6.16 chardet-3.0.4 crcmod-1.7 dill-0.2.9 docopt-0.6.2 fastavro-0.21.24 fasteners-0.15 google-api-core-1.13.0 google-apitools-0.5.28 google-auth-1.6.3 google-cloud-bigquery-1.6.1 google-cloud-bigtable-0.32.2 google-cloud-core-0.29.1 google-cloud-datastore-1.7.4 google-cloud-pubsub-0.39.1 google-resumable-media-0.3.2 googleapis-common-protos-1.6.0 grpc-google-iam-v1-0.11.4 hdfs-2.5.8 httplib2-0.12.0 idna-2.8 mock-2.0.0 monotonic-1.5 nose-1.3.7 numpy-1.16.4 oauth2client-3.0.0 pandas-0.23.4 parameterized-0.6.3 pbr-5.4.0 pyarrow-0.13.0 pyasn1-0.4.5 pyasn1-modules-0.2.5 pydot-1.2.4 pyhamcrest-1.9.0 pymongo-3.8.0 pyparsing-2.4.0 python-dateutil-2.8.0 pytz-2019.1 pyyaml-3.13 requests-2.22.0 rsa-4.0 tenacity-5.0.4 urllib3-1.25.3
:sdks:python:test-suites:dataflow:py35:installGcpTest (Thread[Execution worker for ':',5,main]) completed. Took 21.967 secs.
:sdks:python:test-suites:dataflow:py35:integrationTest (Thread[Execution worker for ':',5,main]) started.

> Task :sdks:python:test-suites:dataflow:py35:integrationTest
Caching disabled for task ':sdks:python:test-suites:dataflow:py35:integrationTest': Caching has not been enabled for the task
Task ':sdks:python:test-suites:dataflow:py35:integrationTest' is not up-to-date because:
  Task has not declared any outputs despite executing actions.
Custom actions are attached to task ':sdks:python:test-suites:dataflow:py35:integrationTest'.
Starting process 'command 'sh''. Working directory: <https://builds.apache.org/job/beam_PerformanceTests_WordCountIT_Py35/ws/src/sdks/python/test-suites/dataflow/py35> Command: sh -c . <https://builds.apache.org/job/beam_PerformanceTests_WordCountIT_Py35/ws/src/build/gradleenv/-1734967054/bin/activate> && <https://builds.apache.org/job/beam_PerformanceTests_WordCountIT_Py35/ws/src/sdks/python/scripts/run_integration_test.sh> --test_opts "--tests=apache_beam.examples.wordcount_it_test:WordCountIT.test_wordcount_it --attr=IT --nocapture" --pipeline_opts "--project=apache-beam-testing --staging_location=gs://temp-storage-for-end-to-end-tests/staging-it --temp_location=gs://temp-storage-for-end-to-end-tests/temp-it --input=gs://apache-beam-samples/input_small_files/ascii_sort_1MB_input.0000* --output=gs://temp-storage-for-end-to-end-tests/py-it-cloud/output --expect_checksum=ea0ca2e5ee4ea5f218790f28d0b9fe7d09d8d710 --num_workers=10 --autoscaling_algorithm=NONE --runner=TestDataflowRunner --sdk_location=test-suites/dataflow/py35/build/apache-beam.tar.gz"
Successfully started process 'command 'sh''
>>> RUNNING integration tests with pipeline options: --project=apache-beam-testing --staging_location=gs://temp-storage-for-end-to-end-tests/staging-it --temp_location=gs://temp-storage-for-end-to-end-tests/temp-it --input=gs://apache-beam-samples/input_small_files/ascii_sort_1MB_input.0000* --output=gs://temp-storage-for-end-to-end-tests/py-it-cloud/output --expect_checksum=ea0ca2e5ee4ea5f218790f28d0b9fe7d09d8d710 --num_workers=10 --autoscaling_algorithm=NONE --runner=TestDataflowRunner --sdk_location=test-suites/dataflow/py35/build/apache-beam.tar.gz
>>>   test options: --tests=apache_beam.examples.wordcount_it_test:WordCountIT.test_wordcount_it --attr=IT --nocapture
running nosetests
running egg_info
writing apache_beam.egg-info/PKG-INFO
writing top-level names to apache_beam.egg-info/top_level.txt
writing entry points to apache_beam.egg-info/entry_points.txt
writing requirements to apache_beam.egg-info/requires.txt
writing dependency_links to apache_beam.egg-info/dependency_links.txt
reading manifest file 'apache_beam.egg-info/SOURCES.txt'
reading manifest template 'MANIFEST.in'
writing manifest file 'apache_beam.egg-info/SOURCES.txt'

STDERR: beam_fn_api.proto: warning: Import google/protobuf/descriptor.proto but not used.
beam_fn_api.proto: warning: Import google/protobuf/wrappers.proto but not used.
root: Generating grammar tables from /usr/lib/python3.5/lib2to3/PatternGrammar.txt
root: Generating grammar tables from /usr/lib/python3.5/lib2to3/PatternGrammar.txt
root: Generating grammar tables from /usr/lib/python3.5/lib2to3/PatternGrammar.txt
root: Generating grammar tables from /usr/lib/python3.5/lib2to3/PatternGrammar.txt
root: Generating grammar tables from /usr/lib/python3.5/lib2to3/PatternGrammar.txt
root: Generating grammar tables from /usr/lib/python3.5/lib2to3/PatternGrammar.txt
root: Generating grammar tables from /usr/lib/python3.5/lib2to3/PatternGrammar.txt
root: Generating grammar tables from /usr/lib/python3.5/lib2to3/PatternGrammar.txt
root: Generating grammar tables from /usr/lib/python3.5/lib2to3/PatternGrammar.txt
root: Generating grammar tables from /usr/lib/python3.5/lib2to3/PatternGrammar.txt
root: Generating grammar tables from /usr/lib/python3.5/lib2to3/PatternGrammar.txt
root: Generating grammar tables from /usr/lib/python3.5/lib2to3/PatternGrammar.txt
RefactoringTool: Skipping optional fixer: idioms
root: Generating grammar tables from /usr/lib/python3.5/lib2to3/PatternGrammar.txt
root: Generating grammar tables from /usr/lib/python3.5/lib2to3/PatternGrammar.txt
root: Generating grammar tables from /usr/lib/python3.5/lib2to3/PatternGrammar.txt
root: Generating grammar tables from /usr/lib/python3.5/lib2to3/PatternGrammar.txt
root: Generating grammar tables from /usr/lib/python3.5/lib2to3/PatternGrammar.txt
root: Generating grammar tables from /usr/lib/python3.5/lib2to3/PatternGrammar.txt
root: Generating grammar tables from /usr/lib/python3.5/lib2to3/PatternGrammar.txt
root: Generating grammar tables from /usr/lib/python3.5/lib2to3/PatternGrammar.txt
root: Generating grammar tables from /usr/lib/python3.5/lib2to3/PatternGrammar.txt
root: Generating grammar tables from /usr/lib/python3.5/lib2to3/PatternGrammar.txt
root: Generating grammar tables from /usr/lib/python3.5/lib2to3/PatternGrammar.txt
root: Generating grammar tables from /usr/lib/python3.5/lib2to3/PatternGrammar.txt
root: Generating grammar tables from /usr/lib/python3.5/lib2to3/PatternGrammar.txt
root: Generating grammar tables from /usr/lib/python3.5/lib2to3/PatternGrammar.txt
root: Generating grammar tables from /usr/lib/python3.5/lib2to3/PatternGrammar.txt
root: Generating grammar tables from /usr/lib/python3.5/lib2to3/PatternGrammar.txt
root: Generating grammar tables from /usr/lib/python3.5/lib2to3/PatternGrammar.txt
root: Generating grammar tables from /usr/lib/python3.5/lib2to3/PatternGrammar.txt
root: Generating grammar tables from /usr/lib/python3.5/lib2to3/PatternGrammar.txt
root: Generating grammar tables from /usr/lib/python3.5/lib2to3/PatternGrammar.txt
root: Generating grammar tables from /usr/lib/python3.5/lib2to3/PatternGrammar.txt
root: Generating grammar tables from /usr/lib/python3.5/lib2to3/PatternGrammar.txt
root: Generating grammar tables from /usr/lib/python3.5/lib2to3/PatternGrammar.txt
RefactoringTool: Skipping optional fixer: ws_comma
root: Generating grammar tables from /usr/lib/python3.5/lib2to3/PatternGrammar.txt
root: Generating grammar tables from /usr/lib/python3.5/lib2to3/PatternGrammar.txt
root: Generating grammar tables from /usr/lib/python3.5/lib2to3/PatternGrammar.txt
root: Generating grammar tables from /usr/lib/python3.5/lib2to3/PatternGrammar.txt
root: Generating grammar tables from /usr/lib/python3.5/lib2to3/PatternGrammar.txt
root: Generating grammar tables from /usr/lib/python3.5/lib2to3/PatternGrammar.txt
root: Generating grammar tables from /usr/lib/python3.5/lib2to3/PatternGrammar.txt
root: Generating grammar tables from /usr/lib/python3.5/lib2to3/PatternGrammar.txt
root: Generating grammar tables from /usr/lib/python3.5/lib2to3/PatternGrammar.txt
root: Generating grammar tables from /usr/lib/python3.5/lib2to3/PatternGrammar.txt
root: Generating grammar tables from /usr/lib/python3.5/lib2to3/PatternGrammar.txt
root: Generating grammar tables from /usr/lib/python3.5/lib2to3/PatternGrammar.txt
root: Generating grammar tables from /usr/lib/python3.5/lib2to3/PatternGrammar.txt
root: Generating grammar tables from /usr/lib/python3.5/lib2to3/PatternGrammar.txt
root: Generating grammar tables from /usr/lib/python3.5/lib2to3/PatternGrammar.txt
root: Generating grammar tables from /usr/lib/python3.5/lib2to3/PatternGrammar.txt
root: Generating grammar tables from /usr/lib/python3.5/lib2to3/PatternGrammar.txt
root: Generating grammar tables from /usr/lib/python3.5/lib2to3/PatternGrammar.txt
root: Generating grammar tables from /usr/lib/python3.5/lib2to3/PatternGrammar.txt
root: Generating grammar tables from /usr/lib/python3.5/lib2to3/PatternGrammar.txt
root: Generating grammar tables from /usr/lib/python3.5/lib2to3/PatternGrammar.txt
RefactoringTool: No changes to <https://builds.apache.org/job/beam_PerformanceTests_WordCountIT_Py35/ws/src/sdks/python/test-suites/dataflow/py35/build/srcs/sdks/python/apache_beam/portability/api/beam_artifact_api_pb2.py>
RefactoringTool: Refactored <https://builds.apache.org/job/beam_PerformanceTests_WordCountIT_Py35/ws/src/sdks/python/test-suites/dataflow/py35/build/srcs/sdks/python/apache_beam/portability/api/beam_artifact_api_pb2_grpc.py>
RefactoringTool: Refactored <https://builds.apache.org/job/beam_PerformanceTests_WordCountIT_Py35/ws/src/sdks/python/test-suites/dataflow/py35/build/srcs/sdks/python/apache_beam/portability/api/beam_expansion_api_pb2.py>
RefactoringTool: Refactored <https://builds.apache.org/job/beam_PerformanceTests_WordCountIT_Py35/ws/src/sdks/python/test-suites/dataflow/py35/build/srcs/sdks/python/apache_beam/portability/api/beam_expansion_api_pb2_grpc.py>
RefactoringTool: Refactored <https://builds.apache.org/job/beam_PerformanceTests_WordCountIT_Py35/ws/src/sdks/python/test-suites/dataflow/py35/build/srcs/sdks/python/apache_beam/portability/api/beam_fn_api_pb2.py>
RefactoringTool: Refactored <https://builds.apache.org/job/beam_PerformanceTests_WordCountIT_Py35/ws/src/sdks/python/test-suites/dataflow/py35/build/srcs/sdks/python/apache_beam/portability/api/beam_fn_api_pb2_grpc.py>
RefactoringTool: Refactored <https://builds.apache.org/job/beam_PerformanceTests_WordCountIT_Py35/ws/src/sdks/python/test-suites/dataflow/py35/build/srcs/sdks/python/apache_beam/portability/api/beam_job_api_pb2.py>
RefactoringTool: Refactored <https://builds.apache.org/job/beam_PerformanceTests_WordCountIT_Py35/ws/src/sdks/python/test-suites/dataflow/py35/build/srcs/sdks/python/apache_beam/portability/api/beam_job_api_pb2_grpc.py>
RefactoringTool: No changes to <https://builds.apache.org/job/beam_PerformanceTests_WordCountIT_Py35/ws/src/sdks/python/test-suites/dataflow/py35/build/srcs/sdks/python/apache_beam/portability/api/beam_provision_api_pb2.py>
RefactoringTool: Refactored <https://builds.apache.org/job/beam_PerformanceTests_WordCountIT_Py35/ws/src/sdks/python/test-suites/dataflow/py35/build/srcs/sdks/python/apache_beam/portability/api/beam_provision_api_pb2_grpc.py>
RefactoringTool: Refactored <https://builds.apache.org/job/beam_PerformanceTests_WordCountIT_Py35/ws/src/sdks/python/test-suites/dataflow/py35/build/srcs/sdks/python/apache_beam/portability/api/beam_runner_api_pb2.py>
RefactoringTool: No changes to <https://builds.apache.org/job/beam_PerformanceTests_WordCountIT_Py35/ws/src/sdks/python/test-suites/dataflow/py35/build/srcs/sdks/python/apache_beam/portability/api/endpoints_pb2.py>
RefactoringTool: Refactored <https://builds.apache.org/job/beam_PerformanceTests_WordCountIT_Py35/ws/src/sdks/python/test-suites/dataflow/py35/build/srcs/sdks/python/apache_beam/portability/api/external_transforms_pb2.py>
RefactoringTool: Refactored <https://builds.apache.org/job/beam_PerformanceTests_WordCountIT_Py35/ws/src/sdks/python/test-suites/dataflow/py35/build/srcs/sdks/python/apache_beam/portability/api/metrics_pb2.py>
RefactoringTool: Refactored <https://builds.apache.org/job/beam_PerformanceTests_WordCountIT_Py35/ws/src/sdks/python/test-suites/dataflow/py35/build/srcs/sdks/python/apache_beam/portability/api/standard_window_fns_pb2.py>
RefactoringTool: Files that were modified:
RefactoringTool: <https://builds.apache.org/job/beam_PerformanceTests_WordCountIT_Py35/ws/src/sdks/python/test-suites/dataflow/py35/build/srcs/sdks/python/apache_beam/portability/api/beam_artifact_api_pb2.py>
RefactoringTool: <https://builds.apache.org/job/beam_PerformanceTests_WordCountIT_Py35/ws/src/sdks/python/test-suites/dataflow/py35/build/srcs/sdks/python/apache_beam/portability/api/beam_artifact_api_pb2_grpc.py>
RefactoringTool: <https://builds.apache.org/job/beam_PerformanceTests_WordCountIT_Py35/ws/src/sdks/python/test-suites/dataflow/py35/build/srcs/sdks/python/apache_beam/portability/api/beam_expansion_api_pb2.py>
RefactoringTool: <https://builds.apache.org/job/beam_PerformanceTests_WordCountIT_Py35/ws/src/sdks/python/test-suites/dataflow/py35/build/srcs/sdks/python/apache_beam/portability/api/beam_expansion_api_pb2_grpc.py>
RefactoringTool: <https://builds.apache.org/job/beam_PerformanceTests_WordCountIT_Py35/ws/src/sdks/python/test-suites/dataflow/py35/build/srcs/sdks/python/apache_beam/portability/api/beam_fn_api_pb2.py>
RefactoringTool: <https://builds.apache.org/job/beam_PerformanceTests_WordCountIT_Py35/ws/src/sdks/python/test-suites/dataflow/py35/build/srcs/sdks/python/apache_beam/portability/api/beam_fn_api_pb2_grpc.py>
RefactoringTool: <https://builds.apache.org/job/beam_PerformanceTests_WordCountIT_Py35/ws/src/sdks/python/test-suites/dataflow/py35/build/srcs/sdks/python/apache_beam/portability/api/beam_job_api_pb2.py>
RefactoringTool: <https://builds.apache.org/job/beam_PerformanceTests_WordCountIT_Py35/ws/src/sdks/python/test-suites/dataflow/py35/build/srcs/sdks/python/apache_beam/portability/api/beam_job_api_pb2_grpc.py>
RefactoringTool: <https://builds.apache.org/job/beam_PerformanceTests_WordCountIT_Py35/ws/src/sdks/python/test-suites/dataflow/py35/build/srcs/sdks/python/apache_beam/portability/api/beam_provision_api_pb2.py>
RefactoringTool: <https://builds.apache.org/job/beam_PerformanceTests_WordCountIT_Py35/ws/src/sdks/python/test-suites/dataflow/py35/build/srcs/sdks/python/apache_beam/portability/api/beam_provision_api_pb2_grpc.py>
RefactoringTool: <https://builds.apache.org/job/beam_PerformanceTests_WordCountIT_Py35/ws/src/sdks/python/test-suites/dataflow/py35/build/srcs/sdks/python/apache_beam/portability/api/beam_runner_api_pb2.py>
RefactoringTool: <https://builds.apache.org/job/beam_PerformanceTests_WordCountIT_Py35/ws/src/sdks/python/test-suites/dataflow/py35/build/srcs/sdks/python/apache_beam/portability/api/endpoints_pb2.py>
RefactoringTool: <https://builds.apache.org/job/beam_PerformanceTests_WordCountIT_Py35/ws/src/sdks/python/test-suites/dataflow/py35/build/srcs/sdks/python/apache_beam/portability/api/external_transforms_pb2.py>
RefactoringTool: <https://builds.apache.org/job/beam_PerformanceTests_WordCountIT_Py35/ws/src/sdks/python/test-suites/dataflow/py35/build/srcs/sdks/python/apache_beam/portability/api/metrics_pb2.py>
RefactoringTool: <https://builds.apache.org/job/beam_PerformanceTests_WordCountIT_Py35/ws/src/sdks/python/test-suites/dataflow/py35/build/srcs/sdks/python/apache_beam/portability/api/standard_window_fns_pb2.py>
setup.py:177: UserWarning: Some syntactic constructs of Python 3 are not yet fully supported by Apache Beam.
  'Some syntactic constructs of Python 3 are not yet fully supported by '
<https://builds.apache.org/job/beam_PerformanceTests_WordCountIT_Py35/ws/src/build/gradleenv/-1734967054/lib/python3.5/site-packages/setuptools/dist.py>:472: UserWarning: Normalizing '2.15.0.dev' to '2.15.0.dev0'
  normalized_version,
warning: no files found matching 'README.md'
warning: no files found matching 'NOTICE'
warning: no files found matching 'LICENSE'
warning: cmd: standard file not found: should have one of README, README.rst, README.txt, README.md

setup.py:177: UserWarning: Some syntactic constructs of Python 3 are not yet fully supported by Apache Beam.
  'Some syntactic constructs of Python 3 are not yet fully supported by '
<https://builds.apache.org/job/beam_PerformanceTests_WordCountIT_Py35/ws/src/build/gradleenv/-1734967054/lib/python3.5/site-packages/setuptools/dist.py>:472: UserWarning: Normalizing '2.15.0.dev' to '2.15.0.dev0'
  normalized_version,
warning: no files found matching 'README.md'
warning: no files found matching 'NOTICE'
warning: no files found matching 'LICENSE'
<https://builds.apache.org/job/beam_PerformanceTests_WordCountIT_Py35/ws/src/sdks/python/apache_beam/__init__.py>:84: UserWarning: Some syntactic constructs of Python 3 are not yet fully supported by Apache Beam.
  'Some syntactic constructs of Python 3 are not yet fully supported by '
test_wordcount_it (apache_beam.examples.wordcount_it_test.WordCountIT) ... 
2019-07-07 07:08:23,764 60c44d63 MainThread beam_integration_benchmark(1/1) ERROR    Error during benchmark beam_integration_benchmark
Traceback (most recent call last):
  File "<https://builds.apache.org/job/beam_PerformanceTests_WordCountIT_Py35/ws/PerfKitBenchmarker/perfkitbenchmarker/pkb.py",> line 760, in RunBenchmark
    DoRunPhase(spec, collector, detailed_timer)
  File "<https://builds.apache.org/job/beam_PerformanceTests_WordCountIT_Py35/ws/PerfKitBenchmarker/perfkitbenchmarker/pkb.py",> line 609, in DoRunPhase
    samples = spec.BenchmarkRun(spec)
  File "<https://builds.apache.org/job/beam_PerformanceTests_WordCountIT_Py35/ws/PerfKitBenchmarker/perfkitbenchmarker/linux_benchmarks/beam_integration_benchmark.py",> line 160, in Run
    job_type=job_type)
  File "<https://builds.apache.org/job/beam_PerformanceTests_WordCountIT_Py35/ws/PerfKitBenchmarker/perfkitbenchmarker/providers/gcp/gcp_dpb_dataflow.py",> line 90, in SubmitJob
    assert retcode == 0, "Integration Test Failed."
AssertionError: Integration Test Failed.
2019-07-07 07:08:23,765 60c44d63 MainThread beam_integration_benchmark(1/1) INFO     Cleaning up benchmark beam_integration_benchmark
2019-07-07 07:08:23,768 60c44d63 MainThread beam_integration_benchmark(1/1) ERROR    Exception running benchmark
Traceback (most recent call last):
  File "<https://builds.apache.org/job/beam_PerformanceTests_WordCountIT_Py35/ws/PerfKitBenchmarker/perfkitbenchmarker/pkb.py",> line 903, in RunBenchmarkTask
    RunBenchmark(spec, collector)
  File "<https://builds.apache.org/job/beam_PerformanceTests_WordCountIT_Py35/ws/PerfKitBenchmarker/perfkitbenchmarker/pkb.py",> line 760, in RunBenchmark
    DoRunPhase(spec, collector, detailed_timer)
  File "<https://builds.apache.org/job/beam_PerformanceTests_WordCountIT_Py35/ws/PerfKitBenchmarker/perfkitbenchmarker/pkb.py",> line 609, in DoRunPhase
    samples = spec.BenchmarkRun(spec)
  File "<https://builds.apache.org/job/beam_PerformanceTests_WordCountIT_Py35/ws/PerfKitBenchmarker/perfkitbenchmarker/linux_benchmarks/beam_integration_benchmark.py",> line 160, in Run
    job_type=job_type)
  File "<https://builds.apache.org/job/beam_PerformanceTests_WordCountIT_Py35/ws/PerfKitBenchmarker/perfkitbenchmarker/providers/gcp/gcp_dpb_dataflow.py",> line 90, in SubmitJob
    assert retcode == 0, "Integration Test Failed."
AssertionError: Integration Test Failed.
2019-07-07 07:08:23,768 60c44d63 MainThread beam_integration_benchmark(1/1) ERROR    Benchmark 1/1 beam_integration_benchmark (UID: beam_integration_benchmark0) failed. Execution will continue.
2019-07-07 07:08:23,768 60c44d63 MainThread beam_integration_benchmark(1/1) INFO     Benchmark run statuses:
---------------------------------------------------------------------------------
Name                        UID                          Status  Failed Substatus
---------------------------------------------------------------------------------
beam_integration_benchmark  beam_integration_benchmark0  FAILED                  
---------------------------------------------------------------------------------
Success rate: 0.00% (0/1)
2019-07-07 07:08:23,769 60c44d63 MainThread beam_integration_benchmark(1/1) INFO     Complete logs can be found at: <https://builds.apache.org/job/beam_PerformanceTests_WordCountIT_Py35/ws/runs/60c44d63/pkb.log>
2019-07-07 07:08:23,769 60c44d63 MainThread beam_integration_benchmark(1/1) INFO     Completion statuses can be found at: <https://builds.apache.org/job/beam_PerformanceTests_WordCountIT_Py35/ws/runs/60c44d63/completion_statuses.json>
Build step 'Execute shell' marked build as failure

---------------------------------------------------------------------
To unsubscribe, e-mail: builds-unsubscribe@beam.apache.org
For additional commands, e-mail: builds-help@beam.apache.org


Build failed in Jenkins: beam_PerformanceTests_WordCountIT_Py35 #208

Posted by Apache Jenkins Server <je...@builds.apache.org>.
See <https://builds.apache.org/job/beam_PerformanceTests_WordCountIT_Py35/208/display/redirect>

------------------------------------------
[...truncated 47.17 KB...]
Collecting hdfs<3.0.0,>=2.1.0 (from apache-beam==2.15.0.dev0)
Collecting httplib2<=0.12.0,>=0.8 (from apache-beam==2.15.0.dev0)
Collecting mock<3.0.0,>=1.0.1 (from apache-beam==2.15.0.dev0)
  Using cached https://files.pythonhosted.org/packages/e6/35/f187bdf23be87092bd0f1200d43d23076cee4d0dec109f195173fd3ebc79/mock-2.0.0-py2.py3-none-any.whl
Collecting pymongo<4.0.0,>=3.8.0 (from apache-beam==2.15.0.dev0)
  Using cached https://files.pythonhosted.org/packages/6e/6a/ededed811c0b19edb1fd6e381baefc8fef4e2bddc452b43e0bc56bf56e79/pymongo-3.8.0-cp35-cp35m-manylinux1_x86_64.whl
Collecting oauth2client<4,>=2.0.1 (from apache-beam==2.15.0.dev0)
Requirement already satisfied: protobuf<4,>=3.5.0.post1 in <https://builds.apache.org/job/beam_PerformanceTests_WordCountIT_Py35/ws/src/build/gradleenv/-1734967054/lib/python3.5/site-packages> (from apache-beam==2.15.0.dev0) (3.8.0)
Collecting pydot<1.3,>=1.2.0 (from apache-beam==2.15.0.dev0)
Collecting pytz>=2018.3 (from apache-beam==2.15.0.dev0)
  Using cached https://files.pythonhosted.org/packages/3d/73/fe30c2daaaa0713420d0382b16fbb761409f532c56bdcc514bf7b6262bb6/pytz-2019.1-py2.py3-none-any.whl
Collecting pyyaml<4.0.0,>=3.12 (from apache-beam==2.15.0.dev0)
Collecting avro-python3<2.0.0,>=1.8.1 (from apache-beam==2.15.0.dev0)
Collecting pyarrow<0.14.0,>=0.11.1 (from apache-beam==2.15.0.dev0)
  Using cached https://files.pythonhosted.org/packages/0e/ee/71955f715d65afa1fc319b33dfe1976cd09a1a349af7756b232dbae85409/pyarrow-0.13.0-cp35-cp35m-manylinux1_x86_64.whl
Collecting cachetools<4,>=3.1.0 (from apache-beam==2.15.0.dev0)
  Using cached https://files.pythonhosted.org/packages/2f/a6/30b0a0bef12283e83e58c1d6e7b5aabc7acfc4110df81a4471655d33e704/cachetools-3.1.1-py2.py3-none-any.whl
Collecting google-apitools<0.5.29,>=0.5.28 (from apache-beam==2.15.0.dev0)
Collecting google-cloud-datastore<1.8.0,>=1.7.1 (from apache-beam==2.15.0.dev0)
  Using cached https://files.pythonhosted.org/packages/d0/aa/29cbcf8cf7d08ce2d55b9dce858f7c632b434cb6451bed17cb4275804217/google_cloud_datastore-1.7.4-py2.py3-none-any.whl
Collecting google-cloud-pubsub<0.40.0,>=0.39.0 (from apache-beam==2.15.0.dev0)
  Using cached https://files.pythonhosted.org/packages/c0/9a/4455b1c1450e9b912855b58ca6eee7a27ff1e9b52e4d98c243d93256f469/google_cloud_pubsub-0.39.1-py2.py3-none-any.whl
Collecting google-cloud-bigquery<1.7.0,>=1.6.0 (from apache-beam==2.15.0.dev0)
  Using cached https://files.pythonhosted.org/packages/b7/1b/2b95f2fefddbbece38110712c225bfb5649206f4056445653bd5ca4dc86d/google_cloud_bigquery-1.6.1-py2.py3-none-any.whl
Collecting google-cloud-core<0.30.0,>=0.28.1 (from apache-beam==2.15.0.dev0)
  Using cached https://files.pythonhosted.org/packages/0c/f2/3c225e7a69cb27d283b68bff867722bd066bc1858611180197f711815ea5/google_cloud_core-0.29.1-py2.py3-none-any.whl
Collecting google-cloud-bigtable<0.33.0,>=0.31.1 (from apache-beam==2.15.0.dev0)
  Using cached https://files.pythonhosted.org/packages/08/77/b468e209dbb0a6f614e6781f06a4894299a4c6167c2c525cc086caa7c075/google_cloud_bigtable-0.32.2-py2.py3-none-any.whl
Collecting nose>=1.3.7 (from apache-beam==2.15.0.dev0)
  Using cached https://files.pythonhosted.org/packages/15/d8/dd071918c040f50fa1cf80da16423af51ff8ce4a0f2399b7bf8de45ac3d9/nose-1.3.7-py3-none-any.whl
Collecting numpy<2,>=1.14.3 (from apache-beam==2.15.0.dev0)
  Using cached https://files.pythonhosted.org/packages/bb/ef/d5a21cbc094d3f4d5b5336494dbcc9550b70c766a8345513c7c24ed18418/numpy-1.16.4-cp35-cp35m-manylinux1_x86_64.whl
Collecting pandas<0.24,>=0.23.4 (from apache-beam==2.15.0.dev0)
  Using cached https://files.pythonhosted.org/packages/5d/d4/6e9c56a561f1d27407bf29318ca43f36ccaa289271b805a30034eb3a8ec4/pandas-0.23.4-cp35-cp35m-manylinux1_x86_64.whl
Collecting parameterized<0.7.0,>=0.6.0 (from apache-beam==2.15.0.dev0)
  Using cached https://files.pythonhosted.org/packages/3a/49/75f6dadb09e2f8ace3cdffe0c99a04f1b98dff41fbf9e768665d8b469e29/parameterized-0.6.3-py2.py3-none-any.whl
Collecting pyhamcrest<2.0,>=1.9 (from apache-beam==2.15.0.dev0)
  Using cached https://files.pythonhosted.org/packages/9a/d5/d37fd731b7d0e91afcc84577edeccf4638b4f9b82f5ffe2f8b62e2ddc609/PyHamcrest-1.9.0-py2.py3-none-any.whl
Collecting tenacity<6.0,>=5.0.2 (from apache-beam==2.15.0.dev0)
  Using cached https://files.pythonhosted.org/packages/6a/93/dfcf5b1b46ab29196274b78dcba69fab5e54b6dc303a7eed90a79194d277/tenacity-5.0.4-py2.py3-none-any.whl
Requirement already satisfied: six>=1.5.2 in <https://builds.apache.org/job/beam_PerformanceTests_WordCountIT_Py35/ws/src/build/gradleenv/-1734967054/lib/python3.5/site-packages> (from grpcio<2,>=1.8->apache-beam==2.15.0.dev0) (1.12.0)
Collecting requests>=2.7.0 (from hdfs<3.0.0,>=2.1.0->apache-beam==2.15.0.dev0)
  Using cached https://files.pythonhosted.org/packages/51/bd/23c926cd341ea6b7dd0b2a00aba99ae0f828be89d72b2190f27c11d4b7fb/requests-2.22.0-py2.py3-none-any.whl
Collecting docopt (from hdfs<3.0.0,>=2.1.0->apache-beam==2.15.0.dev0)
Collecting pbr>=0.11 (from mock<3.0.0,>=1.0.1->apache-beam==2.15.0.dev0)
  Using cached https://files.pythonhosted.org/packages/f1/f3/9c1fa6496f0adf575441eda21baa6d936395df6c8473c8465d2c525585f6/pbr-5.4.0-py2.py3-none-any.whl
Collecting pyasn1>=0.1.7 (from oauth2client<4,>=2.0.1->apache-beam==2.15.0.dev0)
  Using cached https://files.pythonhosted.org/packages/7b/7c/c9386b82a25115cccf1903441bba3cbadcfae7b678a20167347fa8ded34c/pyasn1-0.4.5-py2.py3-none-any.whl
Collecting rsa>=3.1.4 (from oauth2client<4,>=2.0.1->apache-beam==2.15.0.dev0)
  Using cached https://files.pythonhosted.org/packages/02/e5/38518af393f7c214357079ce67a317307936896e961e35450b70fad2a9cf/rsa-4.0-py2.py3-none-any.whl
Collecting pyasn1-modules>=0.0.5 (from oauth2client<4,>=2.0.1->apache-beam==2.15.0.dev0)
  Using cached https://files.pythonhosted.org/packages/91/f0/b03e00ce9fddf4827c42df1c3ce10c74eadebfb706231e8d6d1c356a4062/pyasn1_modules-0.2.5-py2.py3-none-any.whl
Requirement already satisfied: setuptools in <https://builds.apache.org/job/beam_PerformanceTests_WordCountIT_Py35/ws/src/build/gradleenv/-1734967054/lib/python3.5/site-packages> (from protobuf<4,>=3.5.0.post1->apache-beam==2.15.0.dev0) (41.0.1)
Collecting pyparsing>=2.1.4 (from pydot<1.3,>=1.2.0->apache-beam==2.15.0.dev0)
  Using cached https://files.pythonhosted.org/packages/dd/d9/3ec19e966301a6e25769976999bd7bbe552016f0d32b577dc9d63d2e0c49/pyparsing-2.4.0-py2.py3-none-any.whl
Collecting fasteners>=0.14 (from google-apitools<0.5.29,>=0.5.28->apache-beam==2.15.0.dev0)
  Using cached https://files.pythonhosted.org/packages/18/bd/55eb2d6397b9c0e263af9d091ebdb756b15756029b3cededf6461481bc63/fasteners-0.15-py2.py3-none-any.whl
Collecting google-api-core[grpc]<2.0.0dev,>=1.6.0 (from google-cloud-datastore<1.8.0,>=1.7.1->apache-beam==2.15.0.dev0)
  Using cached https://files.pythonhosted.org/packages/a2/78/bbd685dda48a291b4cc81568ed3e1a89af7a61958dc88a3d52a819b1919d/google_api_core-1.13.0-py2.py3-none-any.whl
Collecting grpc-google-iam-v1<0.12dev,>=0.11.4 (from google-cloud-pubsub<0.40.0,>=0.39.0->apache-beam==2.15.0.dev0)
Collecting google-resumable-media>=0.2.1 (from google-cloud-bigquery<1.7.0,>=1.6.0->apache-beam==2.15.0.dev0)
  Using cached https://files.pythonhosted.org/packages/e2/5d/4bc5c28c252a62efe69ed1a1561da92bd5af8eca0cdcdf8e60354fae9b29/google_resumable_media-0.3.2-py2.py3-none-any.whl
Collecting python-dateutil>=2.5.0 (from pandas<0.24,>=0.23.4->apache-beam==2.15.0.dev0)
  Using cached https://files.pythonhosted.org/packages/41/17/c62faccbfbd163c7f57f3844689e3a78bae1f403648a6afb1d0866d87fbb/python_dateutil-2.8.0-py2.py3-none-any.whl
Collecting urllib3!=1.25.0,!=1.25.1,<1.26,>=1.21.1 (from requests>=2.7.0->hdfs<3.0.0,>=2.1.0->apache-beam==2.15.0.dev0)
  Using cached https://files.pythonhosted.org/packages/e6/60/247f23a7121ae632d62811ba7f273d0e58972d75e58a94d329d51550a47d/urllib3-1.25.3-py2.py3-none-any.whl
Collecting idna<2.9,>=2.5 (from requests>=2.7.0->hdfs<3.0.0,>=2.1.0->apache-beam==2.15.0.dev0)
  Using cached https://files.pythonhosted.org/packages/14/2c/cd551d81dbe15200be1cf41cd03869a46fe7226e7450af7a6545bfc474c9/idna-2.8-py2.py3-none-any.whl
Collecting certifi>=2017.4.17 (from requests>=2.7.0->hdfs<3.0.0,>=2.1.0->apache-beam==2.15.0.dev0)
  Using cached https://files.pythonhosted.org/packages/69/1b/b853c7a9d4f6a6d00749e94eb6f3a041e342a885b87340b79c1ef73e3a78/certifi-2019.6.16-py2.py3-none-any.whl
Collecting chardet<3.1.0,>=3.0.2 (from requests>=2.7.0->hdfs<3.0.0,>=2.1.0->apache-beam==2.15.0.dev0)
  Using cached https://files.pythonhosted.org/packages/bc/a9/01ffebfb562e4274b6487b4bb1ddec7ca55ec7510b22e4c51f14098443b8/chardet-3.0.4-py2.py3-none-any.whl
Collecting monotonic>=0.1 (from fasteners>=0.14->google-apitools<0.5.29,>=0.5.28->apache-beam==2.15.0.dev0)
  Using cached https://files.pythonhosted.org/packages/ac/aa/063eca6a416f397bd99552c534c6d11d57f58f2e94c14780f3bbf818c4cf/monotonic-1.5-py2.py3-none-any.whl
Collecting google-auth<2.0dev,>=0.4.0 (from google-api-core[grpc]<2.0.0dev,>=1.6.0->google-cloud-datastore<1.8.0,>=1.7.1->apache-beam==2.15.0.dev0)
  Using cached https://files.pythonhosted.org/packages/c5/9b/ed0516cc1f7609fb0217e3057ff4f0f9f3e3ce79a369c6af4a6c5ca25664/google_auth-1.6.3-py2.py3-none-any.whl
Collecting googleapis-common-protos!=1.5.4,<2.0dev,>=1.5.3 (from google-api-core[grpc]<2.0.0dev,>=1.6.0->google-cloud-datastore<1.8.0,>=1.7.1->apache-beam==2.15.0.dev0)
Installing collected packages: crcmod, dill, fastavro, urllib3, idna, certifi, chardet, requests, docopt, hdfs, httplib2, pbr, mock, pymongo, pyasn1, rsa, pyasn1-modules, oauth2client, pyparsing, pydot, pytz, pyyaml, avro-python3, numpy, pyarrow, cachetools, monotonic, fasteners, google-apitools, google-auth, googleapis-common-protos, google-api-core, google-cloud-core, google-cloud-datastore, grpc-google-iam-v1, google-cloud-pubsub, google-resumable-media, google-cloud-bigquery, google-cloud-bigtable, nose, python-dateutil, pandas, parameterized, pyhamcrest, tenacity, apache-beam
  Running setup.py develop for apache-beam
Successfully installed apache-beam avro-python3-1.9.0 cachetools-3.1.1 certifi-2019.6.16 chardet-3.0.4 crcmod-1.7 dill-0.2.9 docopt-0.6.2 fastavro-0.21.24 fasteners-0.15 google-api-core-1.13.0 google-apitools-0.5.28 google-auth-1.6.3 google-cloud-bigquery-1.6.1 google-cloud-bigtable-0.32.2 google-cloud-core-0.29.1 google-cloud-datastore-1.7.4 google-cloud-pubsub-0.39.1 google-resumable-media-0.3.2 googleapis-common-protos-1.6.0 grpc-google-iam-v1-0.11.4 hdfs-2.5.8 httplib2-0.12.0 idna-2.8 mock-2.0.0 monotonic-1.5 nose-1.3.7 numpy-1.16.4 oauth2client-3.0.0 pandas-0.23.4 parameterized-0.6.3 pbr-5.4.0 pyarrow-0.13.0 pyasn1-0.4.5 pyasn1-modules-0.2.5 pydot-1.2.4 pyhamcrest-1.9.0 pymongo-3.8.0 pyparsing-2.4.0 python-dateutil-2.8.0 pytz-2019.1 pyyaml-3.13 requests-2.22.0 rsa-4.0 tenacity-5.0.4 urllib3-1.25.3
:sdks:python:test-suites:dataflow:py35:installGcpTest (Thread[Execution worker for ':',5,main]) completed. Took 23.654 secs.
:sdks:python:test-suites:dataflow:py35:integrationTest (Thread[Execution worker for ':',5,main]) started.

> Task :sdks:python:test-suites:dataflow:py35:integrationTest
Caching disabled for task ':sdks:python:test-suites:dataflow:py35:integrationTest': Caching has not been enabled for the task
Task ':sdks:python:test-suites:dataflow:py35:integrationTest' is not up-to-date because:
  Task has not declared any outputs despite executing actions.
Custom actions are attached to task ':sdks:python:test-suites:dataflow:py35:integrationTest'.
Starting process 'command 'sh''. Working directory: <https://builds.apache.org/job/beam_PerformanceTests_WordCountIT_Py35/ws/src/sdks/python/test-suites/dataflow/py35> Command: sh -c . <https://builds.apache.org/job/beam_PerformanceTests_WordCountIT_Py35/ws/src/build/gradleenv/-1734967054/bin/activate> && <https://builds.apache.org/job/beam_PerformanceTests_WordCountIT_Py35/ws/src/sdks/python/scripts/run_integration_test.sh> --test_opts "--tests=apache_beam.examples.wordcount_it_test:WordCountIT.test_wordcount_it --attr=IT --nocapture" --pipeline_opts "--project=apache-beam-testing --staging_location=gs://temp-storage-for-end-to-end-tests/staging-it --temp_location=gs://temp-storage-for-end-to-end-tests/temp-it --input=gs://apache-beam-samples/input_small_files/ascii_sort_1MB_input.0000* --output=gs://temp-storage-for-end-to-end-tests/py-it-cloud/output --expect_checksum=ea0ca2e5ee4ea5f218790f28d0b9fe7d09d8d710 --num_workers=10 --autoscaling_algorithm=NONE --runner=TestDataflowRunner --sdk_location=test-suites/dataflow/py35/build/apache-beam.tar.gz"
Successfully started process 'command 'sh''
>>> RUNNING integration tests with pipeline options: --project=apache-beam-testing --staging_location=gs://temp-storage-for-end-to-end-tests/staging-it --temp_location=gs://temp-storage-for-end-to-end-tests/temp-it --input=gs://apache-beam-samples/input_small_files/ascii_sort_1MB_input.0000* --output=gs://temp-storage-for-end-to-end-tests/py-it-cloud/output --expect_checksum=ea0ca2e5ee4ea5f218790f28d0b9fe7d09d8d710 --num_workers=10 --autoscaling_algorithm=NONE --runner=TestDataflowRunner --sdk_location=test-suites/dataflow/py35/build/apache-beam.tar.gz
>>>   test options: --tests=apache_beam.examples.wordcount_it_test:WordCountIT.test_wordcount_it --attr=IT --nocapture
running nosetests
running egg_info
writing requirements to apache_beam.egg-info/requires.txt
writing apache_beam.egg-info/PKG-INFO
writing entry points to apache_beam.egg-info/entry_points.txt
writing top-level names to apache_beam.egg-info/top_level.txt
writing dependency_links to apache_beam.egg-info/dependency_links.txt
reading manifest file 'apache_beam.egg-info/SOURCES.txt'
reading manifest template 'MANIFEST.in'
writing manifest file 'apache_beam.egg-info/SOURCES.txt'

STDERR: beam_fn_api.proto: warning: Import google/protobuf/descriptor.proto but not used.
beam_fn_api.proto: warning: Import google/protobuf/wrappers.proto but not used.
root: Generating grammar tables from /usr/lib/python3.5/lib2to3/PatternGrammar.txt
root: Generating grammar tables from /usr/lib/python3.5/lib2to3/PatternGrammar.txt
root: Generating grammar tables from /usr/lib/python3.5/lib2to3/PatternGrammar.txt
root: Generating grammar tables from /usr/lib/python3.5/lib2to3/PatternGrammar.txt
root: Generating grammar tables from /usr/lib/python3.5/lib2to3/PatternGrammar.txt
root: Generating grammar tables from /usr/lib/python3.5/lib2to3/PatternGrammar.txt
root: Generating grammar tables from /usr/lib/python3.5/lib2to3/PatternGrammar.txt
root: Generating grammar tables from /usr/lib/python3.5/lib2to3/PatternGrammar.txt
root: Generating grammar tables from /usr/lib/python3.5/lib2to3/PatternGrammar.txt
root: Generating grammar tables from /usr/lib/python3.5/lib2to3/PatternGrammar.txt
root: Generating grammar tables from /usr/lib/python3.5/lib2to3/PatternGrammar.txt
root: Generating grammar tables from /usr/lib/python3.5/lib2to3/PatternGrammar.txt
RefactoringTool: Skipping optional fixer: idioms
root: Generating grammar tables from /usr/lib/python3.5/lib2to3/PatternGrammar.txt
root: Generating grammar tables from /usr/lib/python3.5/lib2to3/PatternGrammar.txt
root: Generating grammar tables from /usr/lib/python3.5/lib2to3/PatternGrammar.txt
root: Generating grammar tables from /usr/lib/python3.5/lib2to3/PatternGrammar.txt
root: Generating grammar tables from /usr/lib/python3.5/lib2to3/PatternGrammar.txt
root: Generating grammar tables from /usr/lib/python3.5/lib2to3/PatternGrammar.txt
root: Generating grammar tables from /usr/lib/python3.5/lib2to3/PatternGrammar.txt
root: Generating grammar tables from /usr/lib/python3.5/lib2to3/PatternGrammar.txt
root: Generating grammar tables from /usr/lib/python3.5/lib2to3/PatternGrammar.txt
root: Generating grammar tables from /usr/lib/python3.5/lib2to3/PatternGrammar.txt
root: Generating grammar tables from /usr/lib/python3.5/lib2to3/PatternGrammar.txt
root: Generating grammar tables from /usr/lib/python3.5/lib2to3/PatternGrammar.txt
root: Generating grammar tables from /usr/lib/python3.5/lib2to3/PatternGrammar.txt
root: Generating grammar tables from /usr/lib/python3.5/lib2to3/PatternGrammar.txt
root: Generating grammar tables from /usr/lib/python3.5/lib2to3/PatternGrammar.txt
root: Generating grammar tables from /usr/lib/python3.5/lib2to3/PatternGrammar.txt
root: Generating grammar tables from /usr/lib/python3.5/lib2to3/PatternGrammar.txt
root: Generating grammar tables from /usr/lib/python3.5/lib2to3/PatternGrammar.txt
root: Generating grammar tables from /usr/lib/python3.5/lib2to3/PatternGrammar.txt
root: Generating grammar tables from /usr/lib/python3.5/lib2to3/PatternGrammar.txt
root: Generating grammar tables from /usr/lib/python3.5/lib2to3/PatternGrammar.txt
root: Generating grammar tables from /usr/lib/python3.5/lib2to3/PatternGrammar.txt
root: Generating grammar tables from /usr/lib/python3.5/lib2to3/PatternGrammar.txt
RefactoringTool: Skipping optional fixer: ws_comma
root: Generating grammar tables from /usr/lib/python3.5/lib2to3/PatternGrammar.txt
root: Generating grammar tables from /usr/lib/python3.5/lib2to3/PatternGrammar.txt
root: Generating grammar tables from /usr/lib/python3.5/lib2to3/PatternGrammar.txt
root: Generating grammar tables from /usr/lib/python3.5/lib2to3/PatternGrammar.txt
root: Generating grammar tables from /usr/lib/python3.5/lib2to3/PatternGrammar.txt
root: Generating grammar tables from /usr/lib/python3.5/lib2to3/PatternGrammar.txt
root: Generating grammar tables from /usr/lib/python3.5/lib2to3/PatternGrammar.txt
root: Generating grammar tables from /usr/lib/python3.5/lib2to3/PatternGrammar.txt
root: Generating grammar tables from /usr/lib/python3.5/lib2to3/PatternGrammar.txt
root: Generating grammar tables from /usr/lib/python3.5/lib2to3/PatternGrammar.txt
root: Generating grammar tables from /usr/lib/python3.5/lib2to3/PatternGrammar.txt
root: Generating grammar tables from /usr/lib/python3.5/lib2to3/PatternGrammar.txt
root: Generating grammar tables from /usr/lib/python3.5/lib2to3/PatternGrammar.txt
root: Generating grammar tables from /usr/lib/python3.5/lib2to3/PatternGrammar.txt
root: Generating grammar tables from /usr/lib/python3.5/lib2to3/PatternGrammar.txt
root: Generating grammar tables from /usr/lib/python3.5/lib2to3/PatternGrammar.txt
root: Generating grammar tables from /usr/lib/python3.5/lib2to3/PatternGrammar.txt
root: Generating grammar tables from /usr/lib/python3.5/lib2to3/PatternGrammar.txt
root: Generating grammar tables from /usr/lib/python3.5/lib2to3/PatternGrammar.txt
root: Generating grammar tables from /usr/lib/python3.5/lib2to3/PatternGrammar.txt
root: Generating grammar tables from /usr/lib/python3.5/lib2to3/PatternGrammar.txt
RefactoringTool: No changes to <https://builds.apache.org/job/beam_PerformanceTests_WordCountIT_Py35/ws/src/sdks/python/test-suites/dataflow/py35/build/srcs/sdks/python/apache_beam/portability/api/beam_artifact_api_pb2.py>
RefactoringTool: Refactored <https://builds.apache.org/job/beam_PerformanceTests_WordCountIT_Py35/ws/src/sdks/python/test-suites/dataflow/py35/build/srcs/sdks/python/apache_beam/portability/api/beam_artifact_api_pb2_grpc.py>
RefactoringTool: Refactored <https://builds.apache.org/job/beam_PerformanceTests_WordCountIT_Py35/ws/src/sdks/python/test-suites/dataflow/py35/build/srcs/sdks/python/apache_beam/portability/api/beam_expansion_api_pb2.py>
RefactoringTool: Refactored <https://builds.apache.org/job/beam_PerformanceTests_WordCountIT_Py35/ws/src/sdks/python/test-suites/dataflow/py35/build/srcs/sdks/python/apache_beam/portability/api/beam_expansion_api_pb2_grpc.py>
RefactoringTool: Refactored <https://builds.apache.org/job/beam_PerformanceTests_WordCountIT_Py35/ws/src/sdks/python/test-suites/dataflow/py35/build/srcs/sdks/python/apache_beam/portability/api/beam_fn_api_pb2.py>
RefactoringTool: Refactored <https://builds.apache.org/job/beam_PerformanceTests_WordCountIT_Py35/ws/src/sdks/python/test-suites/dataflow/py35/build/srcs/sdks/python/apache_beam/portability/api/beam_fn_api_pb2_grpc.py>
RefactoringTool: Refactored <https://builds.apache.org/job/beam_PerformanceTests_WordCountIT_Py35/ws/src/sdks/python/test-suites/dataflow/py35/build/srcs/sdks/python/apache_beam/portability/api/beam_job_api_pb2.py>
RefactoringTool: Refactored <https://builds.apache.org/job/beam_PerformanceTests_WordCountIT_Py35/ws/src/sdks/python/test-suites/dataflow/py35/build/srcs/sdks/python/apache_beam/portability/api/beam_job_api_pb2_grpc.py>
RefactoringTool: No changes to <https://builds.apache.org/job/beam_PerformanceTests_WordCountIT_Py35/ws/src/sdks/python/test-suites/dataflow/py35/build/srcs/sdks/python/apache_beam/portability/api/beam_provision_api_pb2.py>
RefactoringTool: Refactored <https://builds.apache.org/job/beam_PerformanceTests_WordCountIT_Py35/ws/src/sdks/python/test-suites/dataflow/py35/build/srcs/sdks/python/apache_beam/portability/api/beam_provision_api_pb2_grpc.py>
RefactoringTool: Refactored <https://builds.apache.org/job/beam_PerformanceTests_WordCountIT_Py35/ws/src/sdks/python/test-suites/dataflow/py35/build/srcs/sdks/python/apache_beam/portability/api/beam_runner_api_pb2.py>
RefactoringTool: No changes to <https://builds.apache.org/job/beam_PerformanceTests_WordCountIT_Py35/ws/src/sdks/python/test-suites/dataflow/py35/build/srcs/sdks/python/apache_beam/portability/api/endpoints_pb2.py>
RefactoringTool: Refactored <https://builds.apache.org/job/beam_PerformanceTests_WordCountIT_Py35/ws/src/sdks/python/test-suites/dataflow/py35/build/srcs/sdks/python/apache_beam/portability/api/external_transforms_pb2.py>
RefactoringTool: Refactored <https://builds.apache.org/job/beam_PerformanceTests_WordCountIT_Py35/ws/src/sdks/python/test-suites/dataflow/py35/build/srcs/sdks/python/apache_beam/portability/api/metrics_pb2.py>
RefactoringTool: Refactored <https://builds.apache.org/job/beam_PerformanceTests_WordCountIT_Py35/ws/src/sdks/python/test-suites/dataflow/py35/build/srcs/sdks/python/apache_beam/portability/api/standard_window_fns_pb2.py>
RefactoringTool: Files that were modified:
RefactoringTool: <https://builds.apache.org/job/beam_PerformanceTests_WordCountIT_Py35/ws/src/sdks/python/test-suites/dataflow/py35/build/srcs/sdks/python/apache_beam/portability/api/beam_artifact_api_pb2.py>
RefactoringTool: <https://builds.apache.org/job/beam_PerformanceTests_WordCountIT_Py35/ws/src/sdks/python/test-suites/dataflow/py35/build/srcs/sdks/python/apache_beam/portability/api/beam_artifact_api_pb2_grpc.py>
RefactoringTool: <https://builds.apache.org/job/beam_PerformanceTests_WordCountIT_Py35/ws/src/sdks/python/test-suites/dataflow/py35/build/srcs/sdks/python/apache_beam/portability/api/beam_expansion_api_pb2.py>
RefactoringTool: <https://builds.apache.org/job/beam_PerformanceTests_WordCountIT_Py35/ws/src/sdks/python/test-suites/dataflow/py35/build/srcs/sdks/python/apache_beam/portability/api/beam_expansion_api_pb2_grpc.py>
RefactoringTool: <https://builds.apache.org/job/beam_PerformanceTests_WordCountIT_Py35/ws/src/sdks/python/test-suites/dataflow/py35/build/srcs/sdks/python/apache_beam/portability/api/beam_fn_api_pb2.py>
RefactoringTool: <https://builds.apache.org/job/beam_PerformanceTests_WordCountIT_Py35/ws/src/sdks/python/test-suites/dataflow/py35/build/srcs/sdks/python/apache_beam/portability/api/beam_fn_api_pb2_grpc.py>
RefactoringTool: <https://builds.apache.org/job/beam_PerformanceTests_WordCountIT_Py35/ws/src/sdks/python/test-suites/dataflow/py35/build/srcs/sdks/python/apache_beam/portability/api/beam_job_api_pb2.py>
RefactoringTool: <https://builds.apache.org/job/beam_PerformanceTests_WordCountIT_Py35/ws/src/sdks/python/test-suites/dataflow/py35/build/srcs/sdks/python/apache_beam/portability/api/beam_job_api_pb2_grpc.py>
RefactoringTool: <https://builds.apache.org/job/beam_PerformanceTests_WordCountIT_Py35/ws/src/sdks/python/test-suites/dataflow/py35/build/srcs/sdks/python/apache_beam/portability/api/beam_provision_api_pb2.py>
RefactoringTool: <https://builds.apache.org/job/beam_PerformanceTests_WordCountIT_Py35/ws/src/sdks/python/test-suites/dataflow/py35/build/srcs/sdks/python/apache_beam/portability/api/beam_provision_api_pb2_grpc.py>
RefactoringTool: <https://builds.apache.org/job/beam_PerformanceTests_WordCountIT_Py35/ws/src/sdks/python/test-suites/dataflow/py35/build/srcs/sdks/python/apache_beam/portability/api/beam_runner_api_pb2.py>
RefactoringTool: <https://builds.apache.org/job/beam_PerformanceTests_WordCountIT_Py35/ws/src/sdks/python/test-suites/dataflow/py35/build/srcs/sdks/python/apache_beam/portability/api/endpoints_pb2.py>
RefactoringTool: <https://builds.apache.org/job/beam_PerformanceTests_WordCountIT_Py35/ws/src/sdks/python/test-suites/dataflow/py35/build/srcs/sdks/python/apache_beam/portability/api/external_transforms_pb2.py>
RefactoringTool: <https://builds.apache.org/job/beam_PerformanceTests_WordCountIT_Py35/ws/src/sdks/python/test-suites/dataflow/py35/build/srcs/sdks/python/apache_beam/portability/api/metrics_pb2.py>
RefactoringTool: <https://builds.apache.org/job/beam_PerformanceTests_WordCountIT_Py35/ws/src/sdks/python/test-suites/dataflow/py35/build/srcs/sdks/python/apache_beam/portability/api/standard_window_fns_pb2.py>
setup.py:177: UserWarning: Some syntactic constructs of Python 3 are not yet fully supported by Apache Beam.
  'Some syntactic constructs of Python 3 are not yet fully supported by '
<https://builds.apache.org/job/beam_PerformanceTests_WordCountIT_Py35/ws/src/build/gradleenv/-1734967054/lib/python3.5/site-packages/setuptools/dist.py>:472: UserWarning: Normalizing '2.15.0.dev' to '2.15.0.dev0'
  normalized_version,
warning: no files found matching 'README.md'
warning: no files found matching 'NOTICE'
warning: no files found matching 'LICENSE'
warning: cmd: standard file not found: should have one of README, README.rst, README.txt, README.md

setup.py:177: UserWarning: Some syntactic constructs of Python 3 are not yet fully supported by Apache Beam.
  'Some syntactic constructs of Python 3 are not yet fully supported by '
<https://builds.apache.org/job/beam_PerformanceTests_WordCountIT_Py35/ws/src/build/gradleenv/-1734967054/lib/python3.5/site-packages/setuptools/dist.py>:472: UserWarning: Normalizing '2.15.0.dev' to '2.15.0.dev0'
  normalized_version,
warning: no files found matching 'README.md'
warning: no files found matching 'NOTICE'
warning: no files found matching 'LICENSE'
<https://builds.apache.org/job/beam_PerformanceTests_WordCountIT_Py35/ws/src/sdks/python/apache_beam/__init__.py>:84: UserWarning: Some syntactic constructs of Python 3 are not yet fully supported by Apache Beam.
  'Some syntactic constructs of Python 3 are not yet fully supported by '
test_wordcount_it (apache_beam.examples.wordcount_it_test.WordCountIT) ... 
2019-07-07 01:08:24,204 414fd246 MainThread beam_integration_benchmark(1/1) ERROR    Error during benchmark beam_integration_benchmark
Traceback (most recent call last):
  File "<https://builds.apache.org/job/beam_PerformanceTests_WordCountIT_Py35/ws/PerfKitBenchmarker/perfkitbenchmarker/pkb.py",> line 760, in RunBenchmark
    DoRunPhase(spec, collector, detailed_timer)
  File "<https://builds.apache.org/job/beam_PerformanceTests_WordCountIT_Py35/ws/PerfKitBenchmarker/perfkitbenchmarker/pkb.py",> line 609, in DoRunPhase
    samples = spec.BenchmarkRun(spec)
  File "<https://builds.apache.org/job/beam_PerformanceTests_WordCountIT_Py35/ws/PerfKitBenchmarker/perfkitbenchmarker/linux_benchmarks/beam_integration_benchmark.py",> line 160, in Run
    job_type=job_type)
  File "<https://builds.apache.org/job/beam_PerformanceTests_WordCountIT_Py35/ws/PerfKitBenchmarker/perfkitbenchmarker/providers/gcp/gcp_dpb_dataflow.py",> line 90, in SubmitJob
    assert retcode == 0, "Integration Test Failed."
AssertionError: Integration Test Failed.
2019-07-07 01:08:24,205 414fd246 MainThread beam_integration_benchmark(1/1) INFO     Cleaning up benchmark beam_integration_benchmark
2019-07-07 01:08:24,208 414fd246 MainThread beam_integration_benchmark(1/1) ERROR    Exception running benchmark
Traceback (most recent call last):
  File "<https://builds.apache.org/job/beam_PerformanceTests_WordCountIT_Py35/ws/PerfKitBenchmarker/perfkitbenchmarker/pkb.py",> line 903, in RunBenchmarkTask
    RunBenchmark(spec, collector)
  File "<https://builds.apache.org/job/beam_PerformanceTests_WordCountIT_Py35/ws/PerfKitBenchmarker/perfkitbenchmarker/pkb.py",> line 760, in RunBenchmark
    DoRunPhase(spec, collector, detailed_timer)
  File "<https://builds.apache.org/job/beam_PerformanceTests_WordCountIT_Py35/ws/PerfKitBenchmarker/perfkitbenchmarker/pkb.py",> line 609, in DoRunPhase
    samples = spec.BenchmarkRun(spec)
  File "<https://builds.apache.org/job/beam_PerformanceTests_WordCountIT_Py35/ws/PerfKitBenchmarker/perfkitbenchmarker/linux_benchmarks/beam_integration_benchmark.py",> line 160, in Run
    job_type=job_type)
  File "<https://builds.apache.org/job/beam_PerformanceTests_WordCountIT_Py35/ws/PerfKitBenchmarker/perfkitbenchmarker/providers/gcp/gcp_dpb_dataflow.py",> line 90, in SubmitJob
    assert retcode == 0, "Integration Test Failed."
AssertionError: Integration Test Failed.
2019-07-07 01:08:24,208 414fd246 MainThread beam_integration_benchmark(1/1) ERROR    Benchmark 1/1 beam_integration_benchmark (UID: beam_integration_benchmark0) failed. Execution will continue.
2019-07-07 01:08:24,208 414fd246 MainThread beam_integration_benchmark(1/1) INFO     Benchmark run statuses:
---------------------------------------------------------------------------------
Name                        UID                          Status  Failed Substatus
---------------------------------------------------------------------------------
beam_integration_benchmark  beam_integration_benchmark0  FAILED                  
---------------------------------------------------------------------------------
Success rate: 0.00% (0/1)
2019-07-07 01:08:24,209 414fd246 MainThread beam_integration_benchmark(1/1) INFO     Complete logs can be found at: <https://builds.apache.org/job/beam_PerformanceTests_WordCountIT_Py35/ws/runs/414fd246/pkb.log>
2019-07-07 01:08:24,209 414fd246 MainThread beam_integration_benchmark(1/1) INFO     Completion statuses can be found at: <https://builds.apache.org/job/beam_PerformanceTests_WordCountIT_Py35/ws/runs/414fd246/completion_statuses.json>
Build step 'Execute shell' marked build as failure

---------------------------------------------------------------------
To unsubscribe, e-mail: builds-unsubscribe@beam.apache.org
For additional commands, e-mail: builds-help@beam.apache.org


Build failed in Jenkins: beam_PerformanceTests_WordCountIT_Py35 #207

Posted by Apache Jenkins Server <je...@builds.apache.org>.
See <https://builds.apache.org/job/beam_PerformanceTests_WordCountIT_Py35/207/display/redirect>

------------------------------------------
[...truncated 47.19 KB...]
Collecting hdfs<3.0.0,>=2.1.0 (from apache-beam==2.15.0.dev0)
Collecting httplib2<=0.12.0,>=0.8 (from apache-beam==2.15.0.dev0)
Collecting mock<3.0.0,>=1.0.1 (from apache-beam==2.15.0.dev0)
  Using cached https://files.pythonhosted.org/packages/e6/35/f187bdf23be87092bd0f1200d43d23076cee4d0dec109f195173fd3ebc79/mock-2.0.0-py2.py3-none-any.whl
Collecting pymongo<4.0.0,>=3.8.0 (from apache-beam==2.15.0.dev0)
  Using cached https://files.pythonhosted.org/packages/6e/6a/ededed811c0b19edb1fd6e381baefc8fef4e2bddc452b43e0bc56bf56e79/pymongo-3.8.0-cp35-cp35m-manylinux1_x86_64.whl
Collecting oauth2client<4,>=2.0.1 (from apache-beam==2.15.0.dev0)
Requirement already satisfied: protobuf<4,>=3.5.0.post1 in <https://builds.apache.org/job/beam_PerformanceTests_WordCountIT_Py35/ws/src/build/gradleenv/-1734967054/lib/python3.5/site-packages> (from apache-beam==2.15.0.dev0) (3.8.0)
Collecting pydot<1.3,>=1.2.0 (from apache-beam==2.15.0.dev0)
Collecting pytz>=2018.3 (from apache-beam==2.15.0.dev0)
  Using cached https://files.pythonhosted.org/packages/3d/73/fe30c2daaaa0713420d0382b16fbb761409f532c56bdcc514bf7b6262bb6/pytz-2019.1-py2.py3-none-any.whl
Collecting pyyaml<4.0.0,>=3.12 (from apache-beam==2.15.0.dev0)
Collecting avro-python3<2.0.0,>=1.8.1 (from apache-beam==2.15.0.dev0)
Collecting pyarrow<0.14.0,>=0.11.1 (from apache-beam==2.15.0.dev0)
  Using cached https://files.pythonhosted.org/packages/0e/ee/71955f715d65afa1fc319b33dfe1976cd09a1a349af7756b232dbae85409/pyarrow-0.13.0-cp35-cp35m-manylinux1_x86_64.whl
Collecting cachetools<4,>=3.1.0 (from apache-beam==2.15.0.dev0)
  Using cached https://files.pythonhosted.org/packages/2f/a6/30b0a0bef12283e83e58c1d6e7b5aabc7acfc4110df81a4471655d33e704/cachetools-3.1.1-py2.py3-none-any.whl
Collecting google-apitools<0.5.29,>=0.5.28 (from apache-beam==2.15.0.dev0)
Collecting google-cloud-datastore<1.8.0,>=1.7.1 (from apache-beam==2.15.0.dev0)
  Using cached https://files.pythonhosted.org/packages/d0/aa/29cbcf8cf7d08ce2d55b9dce858f7c632b434cb6451bed17cb4275804217/google_cloud_datastore-1.7.4-py2.py3-none-any.whl
Collecting google-cloud-pubsub<0.40.0,>=0.39.0 (from apache-beam==2.15.0.dev0)
  Using cached https://files.pythonhosted.org/packages/c0/9a/4455b1c1450e9b912855b58ca6eee7a27ff1e9b52e4d98c243d93256f469/google_cloud_pubsub-0.39.1-py2.py3-none-any.whl
Collecting google-cloud-bigquery<1.7.0,>=1.6.0 (from apache-beam==2.15.0.dev0)
  Using cached https://files.pythonhosted.org/packages/b7/1b/2b95f2fefddbbece38110712c225bfb5649206f4056445653bd5ca4dc86d/google_cloud_bigquery-1.6.1-py2.py3-none-any.whl
Collecting google-cloud-core<0.30.0,>=0.28.1 (from apache-beam==2.15.0.dev0)
  Using cached https://files.pythonhosted.org/packages/0c/f2/3c225e7a69cb27d283b68bff867722bd066bc1858611180197f711815ea5/google_cloud_core-0.29.1-py2.py3-none-any.whl
Collecting google-cloud-bigtable<0.33.0,>=0.31.1 (from apache-beam==2.15.0.dev0)
  Using cached https://files.pythonhosted.org/packages/08/77/b468e209dbb0a6f614e6781f06a4894299a4c6167c2c525cc086caa7c075/google_cloud_bigtable-0.32.2-py2.py3-none-any.whl
Collecting nose>=1.3.7 (from apache-beam==2.15.0.dev0)
  Using cached https://files.pythonhosted.org/packages/15/d8/dd071918c040f50fa1cf80da16423af51ff8ce4a0f2399b7bf8de45ac3d9/nose-1.3.7-py3-none-any.whl
Collecting numpy<2,>=1.14.3 (from apache-beam==2.15.0.dev0)
  Using cached https://files.pythonhosted.org/packages/bb/ef/d5a21cbc094d3f4d5b5336494dbcc9550b70c766a8345513c7c24ed18418/numpy-1.16.4-cp35-cp35m-manylinux1_x86_64.whl
Collecting pandas<0.24,>=0.23.4 (from apache-beam==2.15.0.dev0)
  Using cached https://files.pythonhosted.org/packages/5d/d4/6e9c56a561f1d27407bf29318ca43f36ccaa289271b805a30034eb3a8ec4/pandas-0.23.4-cp35-cp35m-manylinux1_x86_64.whl
Collecting parameterized<0.7.0,>=0.6.0 (from apache-beam==2.15.0.dev0)
  Using cached https://files.pythonhosted.org/packages/3a/49/75f6dadb09e2f8ace3cdffe0c99a04f1b98dff41fbf9e768665d8b469e29/parameterized-0.6.3-py2.py3-none-any.whl
Collecting pyhamcrest<2.0,>=1.9 (from apache-beam==2.15.0.dev0)
  Using cached https://files.pythonhosted.org/packages/9a/d5/d37fd731b7d0e91afcc84577edeccf4638b4f9b82f5ffe2f8b62e2ddc609/PyHamcrest-1.9.0-py2.py3-none-any.whl
Collecting tenacity<6.0,>=5.0.2 (from apache-beam==2.15.0.dev0)
  Using cached https://files.pythonhosted.org/packages/6a/93/dfcf5b1b46ab29196274b78dcba69fab5e54b6dc303a7eed90a79194d277/tenacity-5.0.4-py2.py3-none-any.whl
Requirement already satisfied: six>=1.5.2 in <https://builds.apache.org/job/beam_PerformanceTests_WordCountIT_Py35/ws/src/build/gradleenv/-1734967054/lib/python3.5/site-packages> (from grpcio<2,>=1.8->apache-beam==2.15.0.dev0) (1.12.0)
Collecting docopt (from hdfs<3.0.0,>=2.1.0->apache-beam==2.15.0.dev0)
Collecting requests>=2.7.0 (from hdfs<3.0.0,>=2.1.0->apache-beam==2.15.0.dev0)
  Using cached https://files.pythonhosted.org/packages/51/bd/23c926cd341ea6b7dd0b2a00aba99ae0f828be89d72b2190f27c11d4b7fb/requests-2.22.0-py2.py3-none-any.whl
Collecting pbr>=0.11 (from mock<3.0.0,>=1.0.1->apache-beam==2.15.0.dev0)
  Using cached https://files.pythonhosted.org/packages/f1/f3/9c1fa6496f0adf575441eda21baa6d936395df6c8473c8465d2c525585f6/pbr-5.4.0-py2.py3-none-any.whl
Collecting pyasn1-modules>=0.0.5 (from oauth2client<4,>=2.0.1->apache-beam==2.15.0.dev0)
  Using cached https://files.pythonhosted.org/packages/91/f0/b03e00ce9fddf4827c42df1c3ce10c74eadebfb706231e8d6d1c356a4062/pyasn1_modules-0.2.5-py2.py3-none-any.whl
Collecting pyasn1>=0.1.7 (from oauth2client<4,>=2.0.1->apache-beam==2.15.0.dev0)
  Using cached https://files.pythonhosted.org/packages/7b/7c/c9386b82a25115cccf1903441bba3cbadcfae7b678a20167347fa8ded34c/pyasn1-0.4.5-py2.py3-none-any.whl
Collecting rsa>=3.1.4 (from oauth2client<4,>=2.0.1->apache-beam==2.15.0.dev0)
  Using cached https://files.pythonhosted.org/packages/02/e5/38518af393f7c214357079ce67a317307936896e961e35450b70fad2a9cf/rsa-4.0-py2.py3-none-any.whl
Requirement already satisfied: setuptools in <https://builds.apache.org/job/beam_PerformanceTests_WordCountIT_Py35/ws/src/build/gradleenv/-1734967054/lib/python3.5/site-packages> (from protobuf<4,>=3.5.0.post1->apache-beam==2.15.0.dev0) (41.0.1)
Collecting pyparsing>=2.1.4 (from pydot<1.3,>=1.2.0->apache-beam==2.15.0.dev0)
  Using cached https://files.pythonhosted.org/packages/dd/d9/3ec19e966301a6e25769976999bd7bbe552016f0d32b577dc9d63d2e0c49/pyparsing-2.4.0-py2.py3-none-any.whl
Collecting fasteners>=0.14 (from google-apitools<0.5.29,>=0.5.28->apache-beam==2.15.0.dev0)
  Using cached https://files.pythonhosted.org/packages/18/bd/55eb2d6397b9c0e263af9d091ebdb756b15756029b3cededf6461481bc63/fasteners-0.15-py2.py3-none-any.whl
Collecting google-api-core[grpc]<2.0.0dev,>=1.6.0 (from google-cloud-datastore<1.8.0,>=1.7.1->apache-beam==2.15.0.dev0)
  Using cached https://files.pythonhosted.org/packages/a2/78/bbd685dda48a291b4cc81568ed3e1a89af7a61958dc88a3d52a819b1919d/google_api_core-1.13.0-py2.py3-none-any.whl
Collecting grpc-google-iam-v1<0.12dev,>=0.11.4 (from google-cloud-pubsub<0.40.0,>=0.39.0->apache-beam==2.15.0.dev0)
Collecting google-resumable-media>=0.2.1 (from google-cloud-bigquery<1.7.0,>=1.6.0->apache-beam==2.15.0.dev0)
  Using cached https://files.pythonhosted.org/packages/e2/5d/4bc5c28c252a62efe69ed1a1561da92bd5af8eca0cdcdf8e60354fae9b29/google_resumable_media-0.3.2-py2.py3-none-any.whl
Collecting python-dateutil>=2.5.0 (from pandas<0.24,>=0.23.4->apache-beam==2.15.0.dev0)
  Using cached https://files.pythonhosted.org/packages/41/17/c62faccbfbd163c7f57f3844689e3a78bae1f403648a6afb1d0866d87fbb/python_dateutil-2.8.0-py2.py3-none-any.whl
Collecting chardet<3.1.0,>=3.0.2 (from requests>=2.7.0->hdfs<3.0.0,>=2.1.0->apache-beam==2.15.0.dev0)
  Using cached https://files.pythonhosted.org/packages/bc/a9/01ffebfb562e4274b6487b4bb1ddec7ca55ec7510b22e4c51f14098443b8/chardet-3.0.4-py2.py3-none-any.whl
Collecting certifi>=2017.4.17 (from requests>=2.7.0->hdfs<3.0.0,>=2.1.0->apache-beam==2.15.0.dev0)
  Using cached https://files.pythonhosted.org/packages/69/1b/b853c7a9d4f6a6d00749e94eb6f3a041e342a885b87340b79c1ef73e3a78/certifi-2019.6.16-py2.py3-none-any.whl
Collecting idna<2.9,>=2.5 (from requests>=2.7.0->hdfs<3.0.0,>=2.1.0->apache-beam==2.15.0.dev0)
  Using cached https://files.pythonhosted.org/packages/14/2c/cd551d81dbe15200be1cf41cd03869a46fe7226e7450af7a6545bfc474c9/idna-2.8-py2.py3-none-any.whl
Collecting urllib3!=1.25.0,!=1.25.1,<1.26,>=1.21.1 (from requests>=2.7.0->hdfs<3.0.0,>=2.1.0->apache-beam==2.15.0.dev0)
  Using cached https://files.pythonhosted.org/packages/e6/60/247f23a7121ae632d62811ba7f273d0e58972d75e58a94d329d51550a47d/urllib3-1.25.3-py2.py3-none-any.whl
Collecting monotonic>=0.1 (from fasteners>=0.14->google-apitools<0.5.29,>=0.5.28->apache-beam==2.15.0.dev0)
  Using cached https://files.pythonhosted.org/packages/ac/aa/063eca6a416f397bd99552c534c6d11d57f58f2e94c14780f3bbf818c4cf/monotonic-1.5-py2.py3-none-any.whl
Collecting google-auth<2.0dev,>=0.4.0 (from google-api-core[grpc]<2.0.0dev,>=1.6.0->google-cloud-datastore<1.8.0,>=1.7.1->apache-beam==2.15.0.dev0)
  Using cached https://files.pythonhosted.org/packages/c5/9b/ed0516cc1f7609fb0217e3057ff4f0f9f3e3ce79a369c6af4a6c5ca25664/google_auth-1.6.3-py2.py3-none-any.whl
Collecting googleapis-common-protos!=1.5.4,<2.0dev,>=1.5.3 (from google-api-core[grpc]<2.0.0dev,>=1.6.0->google-cloud-datastore<1.8.0,>=1.7.1->apache-beam==2.15.0.dev0)
Installing collected packages: crcmod, dill, fastavro, docopt, chardet, certifi, idna, urllib3, requests, hdfs, httplib2, pbr, mock, pymongo, pyasn1, pyasn1-modules, rsa, oauth2client, pyparsing, pydot, pytz, pyyaml, avro-python3, numpy, pyarrow, cachetools, monotonic, fasteners, google-apitools, google-auth, googleapis-common-protos, google-api-core, google-cloud-core, google-cloud-datastore, grpc-google-iam-v1, google-cloud-pubsub, google-resumable-media, google-cloud-bigquery, google-cloud-bigtable, nose, python-dateutil, pandas, parameterized, pyhamcrest, tenacity, apache-beam
  Running setup.py develop for apache-beam
Successfully installed apache-beam avro-python3-1.9.0 cachetools-3.1.1 certifi-2019.6.16 chardet-3.0.4 crcmod-1.7 dill-0.2.9 docopt-0.6.2 fastavro-0.21.24 fasteners-0.15 google-api-core-1.13.0 google-apitools-0.5.28 google-auth-1.6.3 google-cloud-bigquery-1.6.1 google-cloud-bigtable-0.32.2 google-cloud-core-0.29.1 google-cloud-datastore-1.7.4 google-cloud-pubsub-0.39.1 google-resumable-media-0.3.2 googleapis-common-protos-1.6.0 grpc-google-iam-v1-0.11.4 hdfs-2.5.8 httplib2-0.12.0 idna-2.8 mock-2.0.0 monotonic-1.5 nose-1.3.7 numpy-1.16.4 oauth2client-3.0.0 pandas-0.23.4 parameterized-0.6.3 pbr-5.4.0 pyarrow-0.13.0 pyasn1-0.4.5 pyasn1-modules-0.2.5 pydot-1.2.4 pyhamcrest-1.9.0 pymongo-3.8.0 pyparsing-2.4.0 python-dateutil-2.8.0 pytz-2019.1 pyyaml-3.13 requests-2.22.0 rsa-4.0 tenacity-5.0.4 urllib3-1.25.3
:sdks:python:test-suites:dataflow:py35:installGcpTest (Thread[Execution worker for ':',5,main]) completed. Took 22.157 secs.
:sdks:python:test-suites:dataflow:py35:integrationTest (Thread[Execution worker for ':',5,main]) started.

> Task :sdks:python:test-suites:dataflow:py35:integrationTest
Caching disabled for task ':sdks:python:test-suites:dataflow:py35:integrationTest': Caching has not been enabled for the task
Task ':sdks:python:test-suites:dataflow:py35:integrationTest' is not up-to-date because:
  Task has not declared any outputs despite executing actions.
Custom actions are attached to task ':sdks:python:test-suites:dataflow:py35:integrationTest'.
Starting process 'command 'sh''. Working directory: <https://builds.apache.org/job/beam_PerformanceTests_WordCountIT_Py35/ws/src/sdks/python/test-suites/dataflow/py35> Command: sh -c . <https://builds.apache.org/job/beam_PerformanceTests_WordCountIT_Py35/ws/src/build/gradleenv/-1734967054/bin/activate> && <https://builds.apache.org/job/beam_PerformanceTests_WordCountIT_Py35/ws/src/sdks/python/scripts/run_integration_test.sh> --test_opts "--tests=apache_beam.examples.wordcount_it_test:WordCountIT.test_wordcount_it --attr=IT --nocapture" --pipeline_opts "--project=apache-beam-testing --staging_location=gs://temp-storage-for-end-to-end-tests/staging-it --temp_location=gs://temp-storage-for-end-to-end-tests/temp-it --input=gs://apache-beam-samples/input_small_files/ascii_sort_1MB_input.0000* --output=gs://temp-storage-for-end-to-end-tests/py-it-cloud/output --expect_checksum=ea0ca2e5ee4ea5f218790f28d0b9fe7d09d8d710 --num_workers=10 --autoscaling_algorithm=NONE --runner=TestDataflowRunner --sdk_location=test-suites/dataflow/py35/build/apache-beam.tar.gz"
Successfully started process 'command 'sh''
>>> RUNNING integration tests with pipeline options: --project=apache-beam-testing --staging_location=gs://temp-storage-for-end-to-end-tests/staging-it --temp_location=gs://temp-storage-for-end-to-end-tests/temp-it --input=gs://apache-beam-samples/input_small_files/ascii_sort_1MB_input.0000* --output=gs://temp-storage-for-end-to-end-tests/py-it-cloud/output --expect_checksum=ea0ca2e5ee4ea5f218790f28d0b9fe7d09d8d710 --num_workers=10 --autoscaling_algorithm=NONE --runner=TestDataflowRunner --sdk_location=test-suites/dataflow/py35/build/apache-beam.tar.gz
>>>   test options: --tests=apache_beam.examples.wordcount_it_test:WordCountIT.test_wordcount_it --attr=IT --nocapture
running nosetests
running egg_info
writing requirements to apache_beam.egg-info/requires.txt
writing apache_beam.egg-info/PKG-INFO
writing top-level names to apache_beam.egg-info/top_level.txt
writing dependency_links to apache_beam.egg-info/dependency_links.txt
writing entry points to apache_beam.egg-info/entry_points.txt
reading manifest file 'apache_beam.egg-info/SOURCES.txt'
reading manifest template 'MANIFEST.in'
writing manifest file 'apache_beam.egg-info/SOURCES.txt'

STDERR: beam_fn_api.proto: warning: Import google/protobuf/descriptor.proto but not used.
beam_fn_api.proto: warning: Import google/protobuf/wrappers.proto but not used.
root: Generating grammar tables from /usr/lib/python3.5/lib2to3/PatternGrammar.txt
root: Generating grammar tables from /usr/lib/python3.5/lib2to3/PatternGrammar.txt
root: Generating grammar tables from /usr/lib/python3.5/lib2to3/PatternGrammar.txt
root: Generating grammar tables from /usr/lib/python3.5/lib2to3/PatternGrammar.txt
root: Generating grammar tables from /usr/lib/python3.5/lib2to3/PatternGrammar.txt
root: Generating grammar tables from /usr/lib/python3.5/lib2to3/PatternGrammar.txt
root: Generating grammar tables from /usr/lib/python3.5/lib2to3/PatternGrammar.txt
root: Generating grammar tables from /usr/lib/python3.5/lib2to3/PatternGrammar.txt
root: Generating grammar tables from /usr/lib/python3.5/lib2to3/PatternGrammar.txt
root: Generating grammar tables from /usr/lib/python3.5/lib2to3/PatternGrammar.txt
root: Generating grammar tables from /usr/lib/python3.5/lib2to3/PatternGrammar.txt
root: Generating grammar tables from /usr/lib/python3.5/lib2to3/PatternGrammar.txt
RefactoringTool: Skipping optional fixer: idioms
root: Generating grammar tables from /usr/lib/python3.5/lib2to3/PatternGrammar.txt
root: Generating grammar tables from /usr/lib/python3.5/lib2to3/PatternGrammar.txt
root: Generating grammar tables from /usr/lib/python3.5/lib2to3/PatternGrammar.txt
root: Generating grammar tables from /usr/lib/python3.5/lib2to3/PatternGrammar.txt
root: Generating grammar tables from /usr/lib/python3.5/lib2to3/PatternGrammar.txt
root: Generating grammar tables from /usr/lib/python3.5/lib2to3/PatternGrammar.txt
root: Generating grammar tables from /usr/lib/python3.5/lib2to3/PatternGrammar.txt
root: Generating grammar tables from /usr/lib/python3.5/lib2to3/PatternGrammar.txt
root: Generating grammar tables from /usr/lib/python3.5/lib2to3/PatternGrammar.txt
root: Generating grammar tables from /usr/lib/python3.5/lib2to3/PatternGrammar.txt
root: Generating grammar tables from /usr/lib/python3.5/lib2to3/PatternGrammar.txt
root: Generating grammar tables from /usr/lib/python3.5/lib2to3/PatternGrammar.txt
root: Generating grammar tables from /usr/lib/python3.5/lib2to3/PatternGrammar.txt
root: Generating grammar tables from /usr/lib/python3.5/lib2to3/PatternGrammar.txt
root: Generating grammar tables from /usr/lib/python3.5/lib2to3/PatternGrammar.txt
root: Generating grammar tables from /usr/lib/python3.5/lib2to3/PatternGrammar.txt
root: Generating grammar tables from /usr/lib/python3.5/lib2to3/PatternGrammar.txt
root: Generating grammar tables from /usr/lib/python3.5/lib2to3/PatternGrammar.txt
root: Generating grammar tables from /usr/lib/python3.5/lib2to3/PatternGrammar.txt
root: Generating grammar tables from /usr/lib/python3.5/lib2to3/PatternGrammar.txt
root: Generating grammar tables from /usr/lib/python3.5/lib2to3/PatternGrammar.txt
root: Generating grammar tables from /usr/lib/python3.5/lib2to3/PatternGrammar.txt
root: Generating grammar tables from /usr/lib/python3.5/lib2to3/PatternGrammar.txt
RefactoringTool: Skipping optional fixer: ws_comma
root: Generating grammar tables from /usr/lib/python3.5/lib2to3/PatternGrammar.txt
root: Generating grammar tables from /usr/lib/python3.5/lib2to3/PatternGrammar.txt
root: Generating grammar tables from /usr/lib/python3.5/lib2to3/PatternGrammar.txt
root: Generating grammar tables from /usr/lib/python3.5/lib2to3/PatternGrammar.txt
root: Generating grammar tables from /usr/lib/python3.5/lib2to3/PatternGrammar.txt
root: Generating grammar tables from /usr/lib/python3.5/lib2to3/PatternGrammar.txt
root: Generating grammar tables from /usr/lib/python3.5/lib2to3/PatternGrammar.txt
root: Generating grammar tables from /usr/lib/python3.5/lib2to3/PatternGrammar.txt
root: Generating grammar tables from /usr/lib/python3.5/lib2to3/PatternGrammar.txt
root: Generating grammar tables from /usr/lib/python3.5/lib2to3/PatternGrammar.txt
root: Generating grammar tables from /usr/lib/python3.5/lib2to3/PatternGrammar.txt
root: Generating grammar tables from /usr/lib/python3.5/lib2to3/PatternGrammar.txt
root: Generating grammar tables from /usr/lib/python3.5/lib2to3/PatternGrammar.txt
root: Generating grammar tables from /usr/lib/python3.5/lib2to3/PatternGrammar.txt
root: Generating grammar tables from /usr/lib/python3.5/lib2to3/PatternGrammar.txt
root: Generating grammar tables from /usr/lib/python3.5/lib2to3/PatternGrammar.txt
root: Generating grammar tables from /usr/lib/python3.5/lib2to3/PatternGrammar.txt
root: Generating grammar tables from /usr/lib/python3.5/lib2to3/PatternGrammar.txt
root: Generating grammar tables from /usr/lib/python3.5/lib2to3/PatternGrammar.txt
root: Generating grammar tables from /usr/lib/python3.5/lib2to3/PatternGrammar.txt
root: Generating grammar tables from /usr/lib/python3.5/lib2to3/PatternGrammar.txt
RefactoringTool: No changes to <https://builds.apache.org/job/beam_PerformanceTests_WordCountIT_Py35/ws/src/sdks/python/test-suites/dataflow/py35/build/srcs/sdks/python/apache_beam/portability/api/beam_artifact_api_pb2.py>
RefactoringTool: Refactored <https://builds.apache.org/job/beam_PerformanceTests_WordCountIT_Py35/ws/src/sdks/python/test-suites/dataflow/py35/build/srcs/sdks/python/apache_beam/portability/api/beam_artifact_api_pb2_grpc.py>
RefactoringTool: Refactored <https://builds.apache.org/job/beam_PerformanceTests_WordCountIT_Py35/ws/src/sdks/python/test-suites/dataflow/py35/build/srcs/sdks/python/apache_beam/portability/api/beam_expansion_api_pb2.py>
RefactoringTool: Refactored <https://builds.apache.org/job/beam_PerformanceTests_WordCountIT_Py35/ws/src/sdks/python/test-suites/dataflow/py35/build/srcs/sdks/python/apache_beam/portability/api/beam_expansion_api_pb2_grpc.py>
RefactoringTool: Refactored <https://builds.apache.org/job/beam_PerformanceTests_WordCountIT_Py35/ws/src/sdks/python/test-suites/dataflow/py35/build/srcs/sdks/python/apache_beam/portability/api/beam_fn_api_pb2.py>
RefactoringTool: Refactored <https://builds.apache.org/job/beam_PerformanceTests_WordCountIT_Py35/ws/src/sdks/python/test-suites/dataflow/py35/build/srcs/sdks/python/apache_beam/portability/api/beam_fn_api_pb2_grpc.py>
RefactoringTool: Refactored <https://builds.apache.org/job/beam_PerformanceTests_WordCountIT_Py35/ws/src/sdks/python/test-suites/dataflow/py35/build/srcs/sdks/python/apache_beam/portability/api/beam_job_api_pb2.py>
RefactoringTool: Refactored <https://builds.apache.org/job/beam_PerformanceTests_WordCountIT_Py35/ws/src/sdks/python/test-suites/dataflow/py35/build/srcs/sdks/python/apache_beam/portability/api/beam_job_api_pb2_grpc.py>
RefactoringTool: No changes to <https://builds.apache.org/job/beam_PerformanceTests_WordCountIT_Py35/ws/src/sdks/python/test-suites/dataflow/py35/build/srcs/sdks/python/apache_beam/portability/api/beam_provision_api_pb2.py>
RefactoringTool: Refactored <https://builds.apache.org/job/beam_PerformanceTests_WordCountIT_Py35/ws/src/sdks/python/test-suites/dataflow/py35/build/srcs/sdks/python/apache_beam/portability/api/beam_provision_api_pb2_grpc.py>
RefactoringTool: Refactored <https://builds.apache.org/job/beam_PerformanceTests_WordCountIT_Py35/ws/src/sdks/python/test-suites/dataflow/py35/build/srcs/sdks/python/apache_beam/portability/api/beam_runner_api_pb2.py>
RefactoringTool: No changes to <https://builds.apache.org/job/beam_PerformanceTests_WordCountIT_Py35/ws/src/sdks/python/test-suites/dataflow/py35/build/srcs/sdks/python/apache_beam/portability/api/endpoints_pb2.py>
RefactoringTool: Refactored <https://builds.apache.org/job/beam_PerformanceTests_WordCountIT_Py35/ws/src/sdks/python/test-suites/dataflow/py35/build/srcs/sdks/python/apache_beam/portability/api/external_transforms_pb2.py>
RefactoringTool: Refactored <https://builds.apache.org/job/beam_PerformanceTests_WordCountIT_Py35/ws/src/sdks/python/test-suites/dataflow/py35/build/srcs/sdks/python/apache_beam/portability/api/metrics_pb2.py>
RefactoringTool: Refactored <https://builds.apache.org/job/beam_PerformanceTests_WordCountIT_Py35/ws/src/sdks/python/test-suites/dataflow/py35/build/srcs/sdks/python/apache_beam/portability/api/standard_window_fns_pb2.py>
RefactoringTool: Files that were modified:
RefactoringTool: <https://builds.apache.org/job/beam_PerformanceTests_WordCountIT_Py35/ws/src/sdks/python/test-suites/dataflow/py35/build/srcs/sdks/python/apache_beam/portability/api/beam_artifact_api_pb2.py>
RefactoringTool: <https://builds.apache.org/job/beam_PerformanceTests_WordCountIT_Py35/ws/src/sdks/python/test-suites/dataflow/py35/build/srcs/sdks/python/apache_beam/portability/api/beam_artifact_api_pb2_grpc.py>
RefactoringTool: <https://builds.apache.org/job/beam_PerformanceTests_WordCountIT_Py35/ws/src/sdks/python/test-suites/dataflow/py35/build/srcs/sdks/python/apache_beam/portability/api/beam_expansion_api_pb2.py>
RefactoringTool: <https://builds.apache.org/job/beam_PerformanceTests_WordCountIT_Py35/ws/src/sdks/python/test-suites/dataflow/py35/build/srcs/sdks/python/apache_beam/portability/api/beam_expansion_api_pb2_grpc.py>
RefactoringTool: <https://builds.apache.org/job/beam_PerformanceTests_WordCountIT_Py35/ws/src/sdks/python/test-suites/dataflow/py35/build/srcs/sdks/python/apache_beam/portability/api/beam_fn_api_pb2.py>
RefactoringTool: <https://builds.apache.org/job/beam_PerformanceTests_WordCountIT_Py35/ws/src/sdks/python/test-suites/dataflow/py35/build/srcs/sdks/python/apache_beam/portability/api/beam_fn_api_pb2_grpc.py>
RefactoringTool: <https://builds.apache.org/job/beam_PerformanceTests_WordCountIT_Py35/ws/src/sdks/python/test-suites/dataflow/py35/build/srcs/sdks/python/apache_beam/portability/api/beam_job_api_pb2.py>
RefactoringTool: <https://builds.apache.org/job/beam_PerformanceTests_WordCountIT_Py35/ws/src/sdks/python/test-suites/dataflow/py35/build/srcs/sdks/python/apache_beam/portability/api/beam_job_api_pb2_grpc.py>
RefactoringTool: <https://builds.apache.org/job/beam_PerformanceTests_WordCountIT_Py35/ws/src/sdks/python/test-suites/dataflow/py35/build/srcs/sdks/python/apache_beam/portability/api/beam_provision_api_pb2.py>
RefactoringTool: <https://builds.apache.org/job/beam_PerformanceTests_WordCountIT_Py35/ws/src/sdks/python/test-suites/dataflow/py35/build/srcs/sdks/python/apache_beam/portability/api/beam_provision_api_pb2_grpc.py>
RefactoringTool: <https://builds.apache.org/job/beam_PerformanceTests_WordCountIT_Py35/ws/src/sdks/python/test-suites/dataflow/py35/build/srcs/sdks/python/apache_beam/portability/api/beam_runner_api_pb2.py>
RefactoringTool: <https://builds.apache.org/job/beam_PerformanceTests_WordCountIT_Py35/ws/src/sdks/python/test-suites/dataflow/py35/build/srcs/sdks/python/apache_beam/portability/api/endpoints_pb2.py>
RefactoringTool: <https://builds.apache.org/job/beam_PerformanceTests_WordCountIT_Py35/ws/src/sdks/python/test-suites/dataflow/py35/build/srcs/sdks/python/apache_beam/portability/api/external_transforms_pb2.py>
RefactoringTool: <https://builds.apache.org/job/beam_PerformanceTests_WordCountIT_Py35/ws/src/sdks/python/test-suites/dataflow/py35/build/srcs/sdks/python/apache_beam/portability/api/metrics_pb2.py>
RefactoringTool: <https://builds.apache.org/job/beam_PerformanceTests_WordCountIT_Py35/ws/src/sdks/python/test-suites/dataflow/py35/build/srcs/sdks/python/apache_beam/portability/api/standard_window_fns_pb2.py>
setup.py:177: UserWarning: Some syntactic constructs of Python 3 are not yet fully supported by Apache Beam.
  'Some syntactic constructs of Python 3 are not yet fully supported by '
<https://builds.apache.org/job/beam_PerformanceTests_WordCountIT_Py35/ws/src/build/gradleenv/-1734967054/lib/python3.5/site-packages/setuptools/dist.py>:472: UserWarning: Normalizing '2.15.0.dev' to '2.15.0.dev0'
  normalized_version,
warning: no files found matching 'README.md'
warning: no files found matching 'NOTICE'
warning: no files found matching 'LICENSE'
warning: cmd: standard file not found: should have one of README, README.rst, README.txt, README.md

setup.py:177: UserWarning: Some syntactic constructs of Python 3 are not yet fully supported by Apache Beam.
  'Some syntactic constructs of Python 3 are not yet fully supported by '
<https://builds.apache.org/job/beam_PerformanceTests_WordCountIT_Py35/ws/src/build/gradleenv/-1734967054/lib/python3.5/site-packages/setuptools/dist.py>:472: UserWarning: Normalizing '2.15.0.dev' to '2.15.0.dev0'
  normalized_version,
warning: no files found matching 'README.md'
warning: no files found matching 'NOTICE'
warning: no files found matching 'LICENSE'
<https://builds.apache.org/job/beam_PerformanceTests_WordCountIT_Py35/ws/src/sdks/python/apache_beam/__init__.py>:84: UserWarning: Some syntactic constructs of Python 3 are not yet fully supported by Apache Beam.
  'Some syntactic constructs of Python 3 are not yet fully supported by '
test_wordcount_it (apache_beam.examples.wordcount_it_test.WordCountIT) ... 
2019-07-06 19:08:23,646 e8be90b5 MainThread beam_integration_benchmark(1/1) ERROR    Error during benchmark beam_integration_benchmark
Traceback (most recent call last):
  File "<https://builds.apache.org/job/beam_PerformanceTests_WordCountIT_Py35/ws/PerfKitBenchmarker/perfkitbenchmarker/pkb.py",> line 760, in RunBenchmark
    DoRunPhase(spec, collector, detailed_timer)
  File "<https://builds.apache.org/job/beam_PerformanceTests_WordCountIT_Py35/ws/PerfKitBenchmarker/perfkitbenchmarker/pkb.py",> line 609, in DoRunPhase
    samples = spec.BenchmarkRun(spec)
  File "<https://builds.apache.org/job/beam_PerformanceTests_WordCountIT_Py35/ws/PerfKitBenchmarker/perfkitbenchmarker/linux_benchmarks/beam_integration_benchmark.py",> line 160, in Run
    job_type=job_type)
  File "<https://builds.apache.org/job/beam_PerformanceTests_WordCountIT_Py35/ws/PerfKitBenchmarker/perfkitbenchmarker/providers/gcp/gcp_dpb_dataflow.py",> line 90, in SubmitJob
    assert retcode == 0, "Integration Test Failed."
AssertionError: Integration Test Failed.
2019-07-06 19:08:23,647 e8be90b5 MainThread beam_integration_benchmark(1/1) INFO     Cleaning up benchmark beam_integration_benchmark
2019-07-06 19:08:23,650 e8be90b5 MainThread beam_integration_benchmark(1/1) ERROR    Exception running benchmark
Traceback (most recent call last):
  File "<https://builds.apache.org/job/beam_PerformanceTests_WordCountIT_Py35/ws/PerfKitBenchmarker/perfkitbenchmarker/pkb.py",> line 903, in RunBenchmarkTask
    RunBenchmark(spec, collector)
  File "<https://builds.apache.org/job/beam_PerformanceTests_WordCountIT_Py35/ws/PerfKitBenchmarker/perfkitbenchmarker/pkb.py",> line 760, in RunBenchmark
    DoRunPhase(spec, collector, detailed_timer)
  File "<https://builds.apache.org/job/beam_PerformanceTests_WordCountIT_Py35/ws/PerfKitBenchmarker/perfkitbenchmarker/pkb.py",> line 609, in DoRunPhase
    samples = spec.BenchmarkRun(spec)
  File "<https://builds.apache.org/job/beam_PerformanceTests_WordCountIT_Py35/ws/PerfKitBenchmarker/perfkitbenchmarker/linux_benchmarks/beam_integration_benchmark.py",> line 160, in Run
    job_type=job_type)
  File "<https://builds.apache.org/job/beam_PerformanceTests_WordCountIT_Py35/ws/PerfKitBenchmarker/perfkitbenchmarker/providers/gcp/gcp_dpb_dataflow.py",> line 90, in SubmitJob
    assert retcode == 0, "Integration Test Failed."
AssertionError: Integration Test Failed.
2019-07-06 19:08:23,650 e8be90b5 MainThread beam_integration_benchmark(1/1) ERROR    Benchmark 1/1 beam_integration_benchmark (UID: beam_integration_benchmark0) failed. Execution will continue.
2019-07-06 19:08:23,650 e8be90b5 MainThread beam_integration_benchmark(1/1) INFO     Benchmark run statuses:
---------------------------------------------------------------------------------
Name                        UID                          Status  Failed Substatus
---------------------------------------------------------------------------------
beam_integration_benchmark  beam_integration_benchmark0  FAILED                  
---------------------------------------------------------------------------------
Success rate: 0.00% (0/1)
2019-07-06 19:08:23,650 e8be90b5 MainThread beam_integration_benchmark(1/1) INFO     Complete logs can be found at: <https://builds.apache.org/job/beam_PerformanceTests_WordCountIT_Py35/ws/runs/e8be90b5/pkb.log>
2019-07-06 19:08:23,650 e8be90b5 MainThread beam_integration_benchmark(1/1) INFO     Completion statuses can be found at: <https://builds.apache.org/job/beam_PerformanceTests_WordCountIT_Py35/ws/runs/e8be90b5/completion_statuses.json>
Build step 'Execute shell' marked build as failure

---------------------------------------------------------------------
To unsubscribe, e-mail: builds-unsubscribe@beam.apache.org
For additional commands, e-mail: builds-help@beam.apache.org


Build failed in Jenkins: beam_PerformanceTests_WordCountIT_Py35 #206

Posted by Apache Jenkins Server <je...@builds.apache.org>.
See <https://builds.apache.org/job/beam_PerformanceTests_WordCountIT_Py35/206/display/redirect>

------------------------------------------
[...truncated 46.80 KB...]
Collecting hdfs<3.0.0,>=2.1.0 (from apache-beam==2.15.0.dev0)
Collecting httplib2<=0.12.0,>=0.8 (from apache-beam==2.15.0.dev0)
Collecting mock<3.0.0,>=1.0.1 (from apache-beam==2.15.0.dev0)
  Using cached https://files.pythonhosted.org/packages/e6/35/f187bdf23be87092bd0f1200d43d23076cee4d0dec109f195173fd3ebc79/mock-2.0.0-py2.py3-none-any.whl
Collecting pymongo<4.0.0,>=3.8.0 (from apache-beam==2.15.0.dev0)
  Using cached https://files.pythonhosted.org/packages/6e/6a/ededed811c0b19edb1fd6e381baefc8fef4e2bddc452b43e0bc56bf56e79/pymongo-3.8.0-cp35-cp35m-manylinux1_x86_64.whl
Collecting oauth2client<4,>=2.0.1 (from apache-beam==2.15.0.dev0)
Requirement already satisfied: protobuf<4,>=3.5.0.post1 in <https://builds.apache.org/job/beam_PerformanceTests_WordCountIT_Py35/ws/src/build/gradleenv/-1734967054/lib/python3.5/site-packages> (from apache-beam==2.15.0.dev0) (3.8.0)
Collecting pydot<1.3,>=1.2.0 (from apache-beam==2.15.0.dev0)
Collecting pytz>=2018.3 (from apache-beam==2.15.0.dev0)
  Using cached https://files.pythonhosted.org/packages/3d/73/fe30c2daaaa0713420d0382b16fbb761409f532c56bdcc514bf7b6262bb6/pytz-2019.1-py2.py3-none-any.whl
Collecting pyyaml<4.0.0,>=3.12 (from apache-beam==2.15.0.dev0)
Collecting avro-python3<2.0.0,>=1.8.1 (from apache-beam==2.15.0.dev0)
Collecting pyarrow<0.14.0,>=0.11.1 (from apache-beam==2.15.0.dev0)
  Using cached https://files.pythonhosted.org/packages/0e/ee/71955f715d65afa1fc319b33dfe1976cd09a1a349af7756b232dbae85409/pyarrow-0.13.0-cp35-cp35m-manylinux1_x86_64.whl
Collecting cachetools<4,>=3.1.0 (from apache-beam==2.15.0.dev0)
  Using cached https://files.pythonhosted.org/packages/2f/a6/30b0a0bef12283e83e58c1d6e7b5aabc7acfc4110df81a4471655d33e704/cachetools-3.1.1-py2.py3-none-any.whl
Collecting google-apitools<0.5.29,>=0.5.28 (from apache-beam==2.15.0.dev0)
Collecting google-cloud-datastore<1.8.0,>=1.7.1 (from apache-beam==2.15.0.dev0)
  Using cached https://files.pythonhosted.org/packages/d0/aa/29cbcf8cf7d08ce2d55b9dce858f7c632b434cb6451bed17cb4275804217/google_cloud_datastore-1.7.4-py2.py3-none-any.whl
Collecting google-cloud-pubsub<0.40.0,>=0.39.0 (from apache-beam==2.15.0.dev0)
  Using cached https://files.pythonhosted.org/packages/c0/9a/4455b1c1450e9b912855b58ca6eee7a27ff1e9b52e4d98c243d93256f469/google_cloud_pubsub-0.39.1-py2.py3-none-any.whl
Collecting google-cloud-bigquery<1.7.0,>=1.6.0 (from apache-beam==2.15.0.dev0)
  Using cached https://files.pythonhosted.org/packages/b7/1b/2b95f2fefddbbece38110712c225bfb5649206f4056445653bd5ca4dc86d/google_cloud_bigquery-1.6.1-py2.py3-none-any.whl
Collecting google-cloud-core<0.30.0,>=0.28.1 (from apache-beam==2.15.0.dev0)
  Using cached https://files.pythonhosted.org/packages/0c/f2/3c225e7a69cb27d283b68bff867722bd066bc1858611180197f711815ea5/google_cloud_core-0.29.1-py2.py3-none-any.whl
Collecting google-cloud-bigtable<0.33.0,>=0.31.1 (from apache-beam==2.15.0.dev0)
  Using cached https://files.pythonhosted.org/packages/08/77/b468e209dbb0a6f614e6781f06a4894299a4c6167c2c525cc086caa7c075/google_cloud_bigtable-0.32.2-py2.py3-none-any.whl
Collecting nose>=1.3.7 (from apache-beam==2.15.0.dev0)
  Using cached https://files.pythonhosted.org/packages/15/d8/dd071918c040f50fa1cf80da16423af51ff8ce4a0f2399b7bf8de45ac3d9/nose-1.3.7-py3-none-any.whl
Collecting numpy<2,>=1.14.3 (from apache-beam==2.15.0.dev0)
  Using cached https://files.pythonhosted.org/packages/bb/ef/d5a21cbc094d3f4d5b5336494dbcc9550b70c766a8345513c7c24ed18418/numpy-1.16.4-cp35-cp35m-manylinux1_x86_64.whl
Collecting pandas<0.24,>=0.23.4 (from apache-beam==2.15.0.dev0)
  Using cached https://files.pythonhosted.org/packages/5d/d4/6e9c56a561f1d27407bf29318ca43f36ccaa289271b805a30034eb3a8ec4/pandas-0.23.4-cp35-cp35m-manylinux1_x86_64.whl
Collecting parameterized<0.7.0,>=0.6.0 (from apache-beam==2.15.0.dev0)
  Using cached https://files.pythonhosted.org/packages/3a/49/75f6dadb09e2f8ace3cdffe0c99a04f1b98dff41fbf9e768665d8b469e29/parameterized-0.6.3-py2.py3-none-any.whl
Collecting pyhamcrest<2.0,>=1.9 (from apache-beam==2.15.0.dev0)
  Using cached https://files.pythonhosted.org/packages/9a/d5/d37fd731b7d0e91afcc84577edeccf4638b4f9b82f5ffe2f8b62e2ddc609/PyHamcrest-1.9.0-py2.py3-none-any.whl
Collecting tenacity<6.0,>=5.0.2 (from apache-beam==2.15.0.dev0)
  Using cached https://files.pythonhosted.org/packages/6a/93/dfcf5b1b46ab29196274b78dcba69fab5e54b6dc303a7eed90a79194d277/tenacity-5.0.4-py2.py3-none-any.whl
Requirement already satisfied: six>=1.5.2 in <https://builds.apache.org/job/beam_PerformanceTests_WordCountIT_Py35/ws/src/build/gradleenv/-1734967054/lib/python3.5/site-packages> (from grpcio<2,>=1.8->apache-beam==2.15.0.dev0) (1.12.0)
Collecting docopt (from hdfs<3.0.0,>=2.1.0->apache-beam==2.15.0.dev0)
Collecting requests>=2.7.0 (from hdfs<3.0.0,>=2.1.0->apache-beam==2.15.0.dev0)
  Using cached https://files.pythonhosted.org/packages/51/bd/23c926cd341ea6b7dd0b2a00aba99ae0f828be89d72b2190f27c11d4b7fb/requests-2.22.0-py2.py3-none-any.whl
Collecting pbr>=0.11 (from mock<3.0.0,>=1.0.1->apache-beam==2.15.0.dev0)
  Using cached https://files.pythonhosted.org/packages/f1/f3/9c1fa6496f0adf575441eda21baa6d936395df6c8473c8465d2c525585f6/pbr-5.4.0-py2.py3-none-any.whl
Collecting pyasn1>=0.1.7 (from oauth2client<4,>=2.0.1->apache-beam==2.15.0.dev0)
  Using cached https://files.pythonhosted.org/packages/7b/7c/c9386b82a25115cccf1903441bba3cbadcfae7b678a20167347fa8ded34c/pyasn1-0.4.5-py2.py3-none-any.whl
Collecting rsa>=3.1.4 (from oauth2client<4,>=2.0.1->apache-beam==2.15.0.dev0)
  Using cached https://files.pythonhosted.org/packages/02/e5/38518af393f7c214357079ce67a317307936896e961e35450b70fad2a9cf/rsa-4.0-py2.py3-none-any.whl
Collecting pyasn1-modules>=0.0.5 (from oauth2client<4,>=2.0.1->apache-beam==2.15.0.dev0)
  Using cached https://files.pythonhosted.org/packages/91/f0/b03e00ce9fddf4827c42df1c3ce10c74eadebfb706231e8d6d1c356a4062/pyasn1_modules-0.2.5-py2.py3-none-any.whl
Requirement already satisfied: setuptools in <https://builds.apache.org/job/beam_PerformanceTests_WordCountIT_Py35/ws/src/build/gradleenv/-1734967054/lib/python3.5/site-packages> (from protobuf<4,>=3.5.0.post1->apache-beam==2.15.0.dev0) (41.0.1)
Collecting pyparsing>=2.1.4 (from pydot<1.3,>=1.2.0->apache-beam==2.15.0.dev0)
  Using cached https://files.pythonhosted.org/packages/dd/d9/3ec19e966301a6e25769976999bd7bbe552016f0d32b577dc9d63d2e0c49/pyparsing-2.4.0-py2.py3-none-any.whl
Collecting fasteners>=0.14 (from google-apitools<0.5.29,>=0.5.28->apache-beam==2.15.0.dev0)
  Using cached https://files.pythonhosted.org/packages/18/bd/55eb2d6397b9c0e263af9d091ebdb756b15756029b3cededf6461481bc63/fasteners-0.15-py2.py3-none-any.whl
Collecting google-api-core[grpc]<2.0.0dev,>=1.6.0 (from google-cloud-datastore<1.8.0,>=1.7.1->apache-beam==2.15.0.dev0)
  Using cached https://files.pythonhosted.org/packages/a2/78/bbd685dda48a291b4cc81568ed3e1a89af7a61958dc88a3d52a819b1919d/google_api_core-1.13.0-py2.py3-none-any.whl
Collecting grpc-google-iam-v1<0.12dev,>=0.11.4 (from google-cloud-pubsub<0.40.0,>=0.39.0->apache-beam==2.15.0.dev0)
Collecting google-resumable-media>=0.2.1 (from google-cloud-bigquery<1.7.0,>=1.6.0->apache-beam==2.15.0.dev0)
  Using cached https://files.pythonhosted.org/packages/e2/5d/4bc5c28c252a62efe69ed1a1561da92bd5af8eca0cdcdf8e60354fae9b29/google_resumable_media-0.3.2-py2.py3-none-any.whl
Collecting python-dateutil>=2.5.0 (from pandas<0.24,>=0.23.4->apache-beam==2.15.0.dev0)
  Using cached https://files.pythonhosted.org/packages/41/17/c62faccbfbd163c7f57f3844689e3a78bae1f403648a6afb1d0866d87fbb/python_dateutil-2.8.0-py2.py3-none-any.whl
Collecting urllib3!=1.25.0,!=1.25.1,<1.26,>=1.21.1 (from requests>=2.7.0->hdfs<3.0.0,>=2.1.0->apache-beam==2.15.0.dev0)
  Using cached https://files.pythonhosted.org/packages/e6/60/247f23a7121ae632d62811ba7f273d0e58972d75e58a94d329d51550a47d/urllib3-1.25.3-py2.py3-none-any.whl
Collecting idna<2.9,>=2.5 (from requests>=2.7.0->hdfs<3.0.0,>=2.1.0->apache-beam==2.15.0.dev0)
  Using cached https://files.pythonhosted.org/packages/14/2c/cd551d81dbe15200be1cf41cd03869a46fe7226e7450af7a6545bfc474c9/idna-2.8-py2.py3-none-any.whl
Collecting certifi>=2017.4.17 (from requests>=2.7.0->hdfs<3.0.0,>=2.1.0->apache-beam==2.15.0.dev0)
  Using cached https://files.pythonhosted.org/packages/69/1b/b853c7a9d4f6a6d00749e94eb6f3a041e342a885b87340b79c1ef73e3a78/certifi-2019.6.16-py2.py3-none-any.whl
Collecting chardet<3.1.0,>=3.0.2 (from requests>=2.7.0->hdfs<3.0.0,>=2.1.0->apache-beam==2.15.0.dev0)
  Using cached https://files.pythonhosted.org/packages/bc/a9/01ffebfb562e4274b6487b4bb1ddec7ca55ec7510b22e4c51f14098443b8/chardet-3.0.4-py2.py3-none-any.whl
Collecting monotonic>=0.1 (from fasteners>=0.14->google-apitools<0.5.29,>=0.5.28->apache-beam==2.15.0.dev0)
  Using cached https://files.pythonhosted.org/packages/ac/aa/063eca6a416f397bd99552c534c6d11d57f58f2e94c14780f3bbf818c4cf/monotonic-1.5-py2.py3-none-any.whl
Collecting googleapis-common-protos!=1.5.4,<2.0dev,>=1.5.3 (from google-api-core[grpc]<2.0.0dev,>=1.6.0->google-cloud-datastore<1.8.0,>=1.7.1->apache-beam==2.15.0.dev0)
Collecting google-auth<2.0dev,>=0.4.0 (from google-api-core[grpc]<2.0.0dev,>=1.6.0->google-cloud-datastore<1.8.0,>=1.7.1->apache-beam==2.15.0.dev0)
  Using cached https://files.pythonhosted.org/packages/c5/9b/ed0516cc1f7609fb0217e3057ff4f0f9f3e3ce79a369c6af4a6c5ca25664/google_auth-1.6.3-py2.py3-none-any.whl
Installing collected packages: crcmod, dill, fastavro, docopt, urllib3, idna, certifi, chardet, requests, hdfs, httplib2, pbr, mock, pymongo, pyasn1, rsa, pyasn1-modules, oauth2client, pyparsing, pydot, pytz, pyyaml, avro-python3, numpy, pyarrow, cachetools, monotonic, fasteners, google-apitools, googleapis-common-protos, google-auth, google-api-core, google-cloud-core, google-cloud-datastore, grpc-google-iam-v1, google-cloud-pubsub, google-resumable-media, google-cloud-bigquery, google-cloud-bigtable, nose, python-dateutil, pandas, parameterized, pyhamcrest, tenacity, apache-beam
  Running setup.py develop for apache-beam
Successfully installed apache-beam avro-python3-1.9.0 cachetools-3.1.1 certifi-2019.6.16 chardet-3.0.4 crcmod-1.7 dill-0.2.9 docopt-0.6.2 fastavro-0.21.24 fasteners-0.15 google-api-core-1.13.0 google-apitools-0.5.28 google-auth-1.6.3 google-cloud-bigquery-1.6.1 google-cloud-bigtable-0.32.2 google-cloud-core-0.29.1 google-cloud-datastore-1.7.4 google-cloud-pubsub-0.39.1 google-resumable-media-0.3.2 googleapis-common-protos-1.6.0 grpc-google-iam-v1-0.11.4 hdfs-2.5.8 httplib2-0.12.0 idna-2.8 mock-2.0.0 monotonic-1.5 nose-1.3.7 numpy-1.16.4 oauth2client-3.0.0 pandas-0.23.4 parameterized-0.6.3 pbr-5.4.0 pyarrow-0.13.0 pyasn1-0.4.5 pyasn1-modules-0.2.5 pydot-1.2.4 pyhamcrest-1.9.0 pymongo-3.8.0 pyparsing-2.4.0 python-dateutil-2.8.0 pytz-2019.1 pyyaml-3.13 requests-2.22.0 rsa-4.0 tenacity-5.0.4 urllib3-1.25.3
:sdks:python:test-suites:dataflow:py35:installGcpTest (Thread[Execution worker for ':',5,main]) completed. Took 21.502 secs.
:sdks:python:test-suites:dataflow:py35:integrationTest (Thread[Execution worker for ':',5,main]) started.

> Task :sdks:python:test-suites:dataflow:py35:integrationTest
Caching disabled for task ':sdks:python:test-suites:dataflow:py35:integrationTest': Caching has not been enabled for the task
Task ':sdks:python:test-suites:dataflow:py35:integrationTest' is not up-to-date because:
  Task has not declared any outputs despite executing actions.
Custom actions are attached to task ':sdks:python:test-suites:dataflow:py35:integrationTest'.
Starting process 'command 'sh''. Working directory: <https://builds.apache.org/job/beam_PerformanceTests_WordCountIT_Py35/ws/src/sdks/python/test-suites/dataflow/py35> Command: sh -c . <https://builds.apache.org/job/beam_PerformanceTests_WordCountIT_Py35/ws/src/build/gradleenv/-1734967054/bin/activate> && <https://builds.apache.org/job/beam_PerformanceTests_WordCountIT_Py35/ws/src/sdks/python/scripts/run_integration_test.sh> --test_opts "--tests=apache_beam.examples.wordcount_it_test:WordCountIT.test_wordcount_it --attr=IT --nocapture" --pipeline_opts "--project=apache-beam-testing --staging_location=gs://temp-storage-for-end-to-end-tests/staging-it --temp_location=gs://temp-storage-for-end-to-end-tests/temp-it --input=gs://apache-beam-samples/input_small_files/ascii_sort_1MB_input.0000* --output=gs://temp-storage-for-end-to-end-tests/py-it-cloud/output --expect_checksum=ea0ca2e5ee4ea5f218790f28d0b9fe7d09d8d710 --num_workers=10 --autoscaling_algorithm=NONE --runner=TestDataflowRunner --sdk_location=test-suites/dataflow/py35/build/apache-beam.tar.gz"
Successfully started process 'command 'sh''
>>> RUNNING integration tests with pipeline options: --project=apache-beam-testing --staging_location=gs://temp-storage-for-end-to-end-tests/staging-it --temp_location=gs://temp-storage-for-end-to-end-tests/temp-it --input=gs://apache-beam-samples/input_small_files/ascii_sort_1MB_input.0000* --output=gs://temp-storage-for-end-to-end-tests/py-it-cloud/output --expect_checksum=ea0ca2e5ee4ea5f218790f28d0b9fe7d09d8d710 --num_workers=10 --autoscaling_algorithm=NONE --runner=TestDataflowRunner --sdk_location=test-suites/dataflow/py35/build/apache-beam.tar.gz
>>>   test options: --tests=apache_beam.examples.wordcount_it_test:WordCountIT.test_wordcount_it --attr=IT --nocapture
running nosetests
running egg_info
writing top-level names to apache_beam.egg-info/top_level.txt
writing requirements to apache_beam.egg-info/requires.txt
writing dependency_links to apache_beam.egg-info/dependency_links.txt
writing entry points to apache_beam.egg-info/entry_points.txt
writing apache_beam.egg-info/PKG-INFO
reading manifest file 'apache_beam.egg-info/SOURCES.txt'
reading manifest template 'MANIFEST.in'
writing manifest file 'apache_beam.egg-info/SOURCES.txt'

STDERR: beam_fn_api.proto: warning: Import google/protobuf/descriptor.proto but not used.
beam_fn_api.proto: warning: Import google/protobuf/wrappers.proto but not used.
root: Generating grammar tables from /usr/lib/python3.5/lib2to3/PatternGrammar.txt
root: Generating grammar tables from /usr/lib/python3.5/lib2to3/PatternGrammar.txt
root: Generating grammar tables from /usr/lib/python3.5/lib2to3/PatternGrammar.txt
root: Generating grammar tables from /usr/lib/python3.5/lib2to3/PatternGrammar.txt
root: Generating grammar tables from /usr/lib/python3.5/lib2to3/PatternGrammar.txt
root: Generating grammar tables from /usr/lib/python3.5/lib2to3/PatternGrammar.txt
root: Generating grammar tables from /usr/lib/python3.5/lib2to3/PatternGrammar.txt
root: Generating grammar tables from /usr/lib/python3.5/lib2to3/PatternGrammar.txt
root: Generating grammar tables from /usr/lib/python3.5/lib2to3/PatternGrammar.txt
root: Generating grammar tables from /usr/lib/python3.5/lib2to3/PatternGrammar.txt
root: Generating grammar tables from /usr/lib/python3.5/lib2to3/PatternGrammar.txt
root: Generating grammar tables from /usr/lib/python3.5/lib2to3/PatternGrammar.txt
RefactoringTool: Skipping optional fixer: idioms
root: Generating grammar tables from /usr/lib/python3.5/lib2to3/PatternGrammar.txt
root: Generating grammar tables from /usr/lib/python3.5/lib2to3/PatternGrammar.txt
root: Generating grammar tables from /usr/lib/python3.5/lib2to3/PatternGrammar.txt
root: Generating grammar tables from /usr/lib/python3.5/lib2to3/PatternGrammar.txt
root: Generating grammar tables from /usr/lib/python3.5/lib2to3/PatternGrammar.txt
root: Generating grammar tables from /usr/lib/python3.5/lib2to3/PatternGrammar.txt
root: Generating grammar tables from /usr/lib/python3.5/lib2to3/PatternGrammar.txt
root: Generating grammar tables from /usr/lib/python3.5/lib2to3/PatternGrammar.txt
root: Generating grammar tables from /usr/lib/python3.5/lib2to3/PatternGrammar.txt
root: Generating grammar tables from /usr/lib/python3.5/lib2to3/PatternGrammar.txt
root: Generating grammar tables from /usr/lib/python3.5/lib2to3/PatternGrammar.txt
root: Generating grammar tables from /usr/lib/python3.5/lib2to3/PatternGrammar.txt
root: Generating grammar tables from /usr/lib/python3.5/lib2to3/PatternGrammar.txt
root: Generating grammar tables from /usr/lib/python3.5/lib2to3/PatternGrammar.txt
root: Generating grammar tables from /usr/lib/python3.5/lib2to3/PatternGrammar.txt
root: Generating grammar tables from /usr/lib/python3.5/lib2to3/PatternGrammar.txt
root: Generating grammar tables from /usr/lib/python3.5/lib2to3/PatternGrammar.txt
root: Generating grammar tables from /usr/lib/python3.5/lib2to3/PatternGrammar.txt
root: Generating grammar tables from /usr/lib/python3.5/lib2to3/PatternGrammar.txt
root: Generating grammar tables from /usr/lib/python3.5/lib2to3/PatternGrammar.txt
root: Generating grammar tables from /usr/lib/python3.5/lib2to3/PatternGrammar.txt
root: Generating grammar tables from /usr/lib/python3.5/lib2to3/PatternGrammar.txt
root: Generating grammar tables from /usr/lib/python3.5/lib2to3/PatternGrammar.txt
RefactoringTool: Skipping optional fixer: ws_comma
root: Generating grammar tables from /usr/lib/python3.5/lib2to3/PatternGrammar.txt
root: Generating grammar tables from /usr/lib/python3.5/lib2to3/PatternGrammar.txt
root: Generating grammar tables from /usr/lib/python3.5/lib2to3/PatternGrammar.txt
root: Generating grammar tables from /usr/lib/python3.5/lib2to3/PatternGrammar.txt
root: Generating grammar tables from /usr/lib/python3.5/lib2to3/PatternGrammar.txt
root: Generating grammar tables from /usr/lib/python3.5/lib2to3/PatternGrammar.txt
root: Generating grammar tables from /usr/lib/python3.5/lib2to3/PatternGrammar.txt
root: Generating grammar tables from /usr/lib/python3.5/lib2to3/PatternGrammar.txt
root: Generating grammar tables from /usr/lib/python3.5/lib2to3/PatternGrammar.txt
root: Generating grammar tables from /usr/lib/python3.5/lib2to3/PatternGrammar.txt
root: Generating grammar tables from /usr/lib/python3.5/lib2to3/PatternGrammar.txt
root: Generating grammar tables from /usr/lib/python3.5/lib2to3/PatternGrammar.txt
root: Generating grammar tables from /usr/lib/python3.5/lib2to3/PatternGrammar.txt
root: Generating grammar tables from /usr/lib/python3.5/lib2to3/PatternGrammar.txt
root: Generating grammar tables from /usr/lib/python3.5/lib2to3/PatternGrammar.txt
root: Generating grammar tables from /usr/lib/python3.5/lib2to3/PatternGrammar.txt
root: Generating grammar tables from /usr/lib/python3.5/lib2to3/PatternGrammar.txt
root: Generating grammar tables from /usr/lib/python3.5/lib2to3/PatternGrammar.txt
root: Generating grammar tables from /usr/lib/python3.5/lib2to3/PatternGrammar.txt
root: Generating grammar tables from /usr/lib/python3.5/lib2to3/PatternGrammar.txt
root: Generating grammar tables from /usr/lib/python3.5/lib2to3/PatternGrammar.txt
RefactoringTool: No changes to <https://builds.apache.org/job/beam_PerformanceTests_WordCountIT_Py35/ws/src/sdks/python/test-suites/dataflow/py35/build/srcs/sdks/python/apache_beam/portability/api/beam_artifact_api_pb2.py>
RefactoringTool: Refactored <https://builds.apache.org/job/beam_PerformanceTests_WordCountIT_Py35/ws/src/sdks/python/test-suites/dataflow/py35/build/srcs/sdks/python/apache_beam/portability/api/beam_artifact_api_pb2_grpc.py>
RefactoringTool: Refactored <https://builds.apache.org/job/beam_PerformanceTests_WordCountIT_Py35/ws/src/sdks/python/test-suites/dataflow/py35/build/srcs/sdks/python/apache_beam/portability/api/beam_expansion_api_pb2.py>
RefactoringTool: Refactored <https://builds.apache.org/job/beam_PerformanceTests_WordCountIT_Py35/ws/src/sdks/python/test-suites/dataflow/py35/build/srcs/sdks/python/apache_beam/portability/api/beam_expansion_api_pb2_grpc.py>
RefactoringTool: Refactored <https://builds.apache.org/job/beam_PerformanceTests_WordCountIT_Py35/ws/src/sdks/python/test-suites/dataflow/py35/build/srcs/sdks/python/apache_beam/portability/api/beam_fn_api_pb2.py>
RefactoringTool: Refactored <https://builds.apache.org/job/beam_PerformanceTests_WordCountIT_Py35/ws/src/sdks/python/test-suites/dataflow/py35/build/srcs/sdks/python/apache_beam/portability/api/beam_fn_api_pb2_grpc.py>
RefactoringTool: Refactored <https://builds.apache.org/job/beam_PerformanceTests_WordCountIT_Py35/ws/src/sdks/python/test-suites/dataflow/py35/build/srcs/sdks/python/apache_beam/portability/api/beam_job_api_pb2.py>
RefactoringTool: Refactored <https://builds.apache.org/job/beam_PerformanceTests_WordCountIT_Py35/ws/src/sdks/python/test-suites/dataflow/py35/build/srcs/sdks/python/apache_beam/portability/api/beam_job_api_pb2_grpc.py>
RefactoringTool: No changes to <https://builds.apache.org/job/beam_PerformanceTests_WordCountIT_Py35/ws/src/sdks/python/test-suites/dataflow/py35/build/srcs/sdks/python/apache_beam/portability/api/beam_provision_api_pb2.py>
RefactoringTool: Refactored <https://builds.apache.org/job/beam_PerformanceTests_WordCountIT_Py35/ws/src/sdks/python/test-suites/dataflow/py35/build/srcs/sdks/python/apache_beam/portability/api/beam_provision_api_pb2_grpc.py>
RefactoringTool: Refactored <https://builds.apache.org/job/beam_PerformanceTests_WordCountIT_Py35/ws/src/sdks/python/test-suites/dataflow/py35/build/srcs/sdks/python/apache_beam/portability/api/beam_runner_api_pb2.py>
RefactoringTool: No changes to <https://builds.apache.org/job/beam_PerformanceTests_WordCountIT_Py35/ws/src/sdks/python/test-suites/dataflow/py35/build/srcs/sdks/python/apache_beam/portability/api/endpoints_pb2.py>
RefactoringTool: Refactored <https://builds.apache.org/job/beam_PerformanceTests_WordCountIT_Py35/ws/src/sdks/python/test-suites/dataflow/py35/build/srcs/sdks/python/apache_beam/portability/api/external_transforms_pb2.py>
RefactoringTool: Refactored <https://builds.apache.org/job/beam_PerformanceTests_WordCountIT_Py35/ws/src/sdks/python/test-suites/dataflow/py35/build/srcs/sdks/python/apache_beam/portability/api/metrics_pb2.py>
RefactoringTool: Refactored <https://builds.apache.org/job/beam_PerformanceTests_WordCountIT_Py35/ws/src/sdks/python/test-suites/dataflow/py35/build/srcs/sdks/python/apache_beam/portability/api/standard_window_fns_pb2.py>
RefactoringTool: Files that were modified:
RefactoringTool: <https://builds.apache.org/job/beam_PerformanceTests_WordCountIT_Py35/ws/src/sdks/python/test-suites/dataflow/py35/build/srcs/sdks/python/apache_beam/portability/api/beam_artifact_api_pb2.py>
RefactoringTool: <https://builds.apache.org/job/beam_PerformanceTests_WordCountIT_Py35/ws/src/sdks/python/test-suites/dataflow/py35/build/srcs/sdks/python/apache_beam/portability/api/beam_artifact_api_pb2_grpc.py>
RefactoringTool: <https://builds.apache.org/job/beam_PerformanceTests_WordCountIT_Py35/ws/src/sdks/python/test-suites/dataflow/py35/build/srcs/sdks/python/apache_beam/portability/api/beam_expansion_api_pb2.py>
RefactoringTool: <https://builds.apache.org/job/beam_PerformanceTests_WordCountIT_Py35/ws/src/sdks/python/test-suites/dataflow/py35/build/srcs/sdks/python/apache_beam/portability/api/beam_expansion_api_pb2_grpc.py>
RefactoringTool: <https://builds.apache.org/job/beam_PerformanceTests_WordCountIT_Py35/ws/src/sdks/python/test-suites/dataflow/py35/build/srcs/sdks/python/apache_beam/portability/api/beam_fn_api_pb2.py>
RefactoringTool: <https://builds.apache.org/job/beam_PerformanceTests_WordCountIT_Py35/ws/src/sdks/python/test-suites/dataflow/py35/build/srcs/sdks/python/apache_beam/portability/api/beam_fn_api_pb2_grpc.py>
RefactoringTool: <https://builds.apache.org/job/beam_PerformanceTests_WordCountIT_Py35/ws/src/sdks/python/test-suites/dataflow/py35/build/srcs/sdks/python/apache_beam/portability/api/beam_job_api_pb2.py>
RefactoringTool: <https://builds.apache.org/job/beam_PerformanceTests_WordCountIT_Py35/ws/src/sdks/python/test-suites/dataflow/py35/build/srcs/sdks/python/apache_beam/portability/api/beam_job_api_pb2_grpc.py>
RefactoringTool: <https://builds.apache.org/job/beam_PerformanceTests_WordCountIT_Py35/ws/src/sdks/python/test-suites/dataflow/py35/build/srcs/sdks/python/apache_beam/portability/api/beam_provision_api_pb2.py>
RefactoringTool: <https://builds.apache.org/job/beam_PerformanceTests_WordCountIT_Py35/ws/src/sdks/python/test-suites/dataflow/py35/build/srcs/sdks/python/apache_beam/portability/api/beam_provision_api_pb2_grpc.py>
RefactoringTool: <https://builds.apache.org/job/beam_PerformanceTests_WordCountIT_Py35/ws/src/sdks/python/test-suites/dataflow/py35/build/srcs/sdks/python/apache_beam/portability/api/beam_runner_api_pb2.py>
RefactoringTool: <https://builds.apache.org/job/beam_PerformanceTests_WordCountIT_Py35/ws/src/sdks/python/test-suites/dataflow/py35/build/srcs/sdks/python/apache_beam/portability/api/endpoints_pb2.py>
RefactoringTool: <https://builds.apache.org/job/beam_PerformanceTests_WordCountIT_Py35/ws/src/sdks/python/test-suites/dataflow/py35/build/srcs/sdks/python/apache_beam/portability/api/external_transforms_pb2.py>
RefactoringTool: <https://builds.apache.org/job/beam_PerformanceTests_WordCountIT_Py35/ws/src/sdks/python/test-suites/dataflow/py35/build/srcs/sdks/python/apache_beam/portability/api/metrics_pb2.py>
RefactoringTool: <https://builds.apache.org/job/beam_PerformanceTests_WordCountIT_Py35/ws/src/sdks/python/test-suites/dataflow/py35/build/srcs/sdks/python/apache_beam/portability/api/standard_window_fns_pb2.py>
setup.py:177: UserWarning: Some syntactic constructs of Python 3 are not yet fully supported by Apache Beam.
  'Some syntactic constructs of Python 3 are not yet fully supported by '
<https://builds.apache.org/job/beam_PerformanceTests_WordCountIT_Py35/ws/src/build/gradleenv/-1734967054/lib/python3.5/site-packages/setuptools/dist.py>:472: UserWarning: Normalizing '2.15.0.dev' to '2.15.0.dev0'
  normalized_version,
warning: no files found matching 'README.md'
warning: no files found matching 'NOTICE'
warning: no files found matching 'LICENSE'
warning: cmd: standard file not found: should have one of README, README.rst, README.txt, README.md

setup.py:177: UserWarning: Some syntactic constructs of Python 3 are not yet fully supported by Apache Beam.
  'Some syntactic constructs of Python 3 are not yet fully supported by '
<https://builds.apache.org/job/beam_PerformanceTests_WordCountIT_Py35/ws/src/build/gradleenv/-1734967054/lib/python3.5/site-packages/setuptools/dist.py>:472: UserWarning: Normalizing '2.15.0.dev' to '2.15.0.dev0'
  normalized_version,
warning: no files found matching 'README.md'
warning: no files found matching 'NOTICE'
warning: no files found matching 'LICENSE'
<https://builds.apache.org/job/beam_PerformanceTests_WordCountIT_Py35/ws/src/sdks/python/apache_beam/__init__.py>:84: UserWarning: Some syntactic constructs of Python 3 are not yet fully supported by Apache Beam.
  'Some syntactic constructs of Python 3 are not yet fully supported by '
test_wordcount_it (apache_beam.examples.wordcount_it_test.WordCountIT) ... 
2019-07-06 13:08:23,248 8ed226b5 MainThread beam_integration_benchmark(1/1) ERROR    Error during benchmark beam_integration_benchmark
Traceback (most recent call last):
  File "<https://builds.apache.org/job/beam_PerformanceTests_WordCountIT_Py35/ws/PerfKitBenchmarker/perfkitbenchmarker/pkb.py",> line 760, in RunBenchmark
    DoRunPhase(spec, collector, detailed_timer)
  File "<https://builds.apache.org/job/beam_PerformanceTests_WordCountIT_Py35/ws/PerfKitBenchmarker/perfkitbenchmarker/pkb.py",> line 609, in DoRunPhase
    samples = spec.BenchmarkRun(spec)
  File "<https://builds.apache.org/job/beam_PerformanceTests_WordCountIT_Py35/ws/PerfKitBenchmarker/perfkitbenchmarker/linux_benchmarks/beam_integration_benchmark.py",> line 160, in Run
    job_type=job_type)
  File "<https://builds.apache.org/job/beam_PerformanceTests_WordCountIT_Py35/ws/PerfKitBenchmarker/perfkitbenchmarker/providers/gcp/gcp_dpb_dataflow.py",> line 90, in SubmitJob
    assert retcode == 0, "Integration Test Failed."
AssertionError: Integration Test Failed.
2019-07-06 13:08:23,250 8ed226b5 MainThread beam_integration_benchmark(1/1) INFO     Cleaning up benchmark beam_integration_benchmark
2019-07-06 13:08:23,253 8ed226b5 MainThread beam_integration_benchmark(1/1) ERROR    Exception running benchmark
Traceback (most recent call last):
  File "<https://builds.apache.org/job/beam_PerformanceTests_WordCountIT_Py35/ws/PerfKitBenchmarker/perfkitbenchmarker/pkb.py",> line 903, in RunBenchmarkTask
    RunBenchmark(spec, collector)
  File "<https://builds.apache.org/job/beam_PerformanceTests_WordCountIT_Py35/ws/PerfKitBenchmarker/perfkitbenchmarker/pkb.py",> line 760, in RunBenchmark
    DoRunPhase(spec, collector, detailed_timer)
  File "<https://builds.apache.org/job/beam_PerformanceTests_WordCountIT_Py35/ws/PerfKitBenchmarker/perfkitbenchmarker/pkb.py",> line 609, in DoRunPhase
    samples = spec.BenchmarkRun(spec)
  File "<https://builds.apache.org/job/beam_PerformanceTests_WordCountIT_Py35/ws/PerfKitBenchmarker/perfkitbenchmarker/linux_benchmarks/beam_integration_benchmark.py",> line 160, in Run
    job_type=job_type)
  File "<https://builds.apache.org/job/beam_PerformanceTests_WordCountIT_Py35/ws/PerfKitBenchmarker/perfkitbenchmarker/providers/gcp/gcp_dpb_dataflow.py",> line 90, in SubmitJob
    assert retcode == 0, "Integration Test Failed."
AssertionError: Integration Test Failed.
2019-07-06 13:08:23,253 8ed226b5 MainThread beam_integration_benchmark(1/1) ERROR    Benchmark 1/1 beam_integration_benchmark (UID: beam_integration_benchmark0) failed. Execution will continue.
2019-07-06 13:08:23,254 8ed226b5 MainThread beam_integration_benchmark(1/1) INFO     Benchmark run statuses:
---------------------------------------------------------------------------------
Name                        UID                          Status  Failed Substatus
---------------------------------------------------------------------------------
beam_integration_benchmark  beam_integration_benchmark0  FAILED                  
---------------------------------------------------------------------------------
Success rate: 0.00% (0/1)
2019-07-06 13:08:23,254 8ed226b5 MainThread beam_integration_benchmark(1/1) INFO     Complete logs can be found at: <https://builds.apache.org/job/beam_PerformanceTests_WordCountIT_Py35/ws/runs/8ed226b5/pkb.log>
2019-07-06 13:08:23,255 8ed226b5 MainThread beam_integration_benchmark(1/1) INFO     Completion statuses can be found at: <https://builds.apache.org/job/beam_PerformanceTests_WordCountIT_Py35/ws/runs/8ed226b5/completion_statuses.json>
Build step 'Execute shell' marked build as failure

---------------------------------------------------------------------
To unsubscribe, e-mail: builds-unsubscribe@beam.apache.org
For additional commands, e-mail: builds-help@beam.apache.org


Build failed in Jenkins: beam_PerformanceTests_WordCountIT_Py35 #205

Posted by Apache Jenkins Server <je...@builds.apache.org>.
See <https://builds.apache.org/job/beam_PerformanceTests_WordCountIT_Py35/205/display/redirect>

------------------------------------------
[...truncated 144.34 KB...]
                    {
                      "@type": "FastPrimitivesCoder$eNprYE5OLEhMzkiNT0pNzNVLzk9JLSqGUlxuicUlAUWZuZklmWWpxc4gQa5CBs3GQsbaQqYIfgYGhvi0xJycpMTk7HiwlkJ8pgVkJmfnpEJNYQGawlpbyJZUnKQHACYlLgM=",
                      "component_encodings": [
                        {
                          "@type": "FastPrimitivesCoder$eNprYE5OLEhMzkiNT0pNzNVLzk9JLSqGUlxuicUlAUWZuZklmWWpxc4gQa5CBs3GQsbaQqYIfgYGhvi0xJycpMTk7HiwlkJ8pgVkJmfnpEJNYQGawlpbyJZUnKQHACYlLgM=",
                          "component_encodings": []
                        },
                        {
                          "@type": "FastPrimitivesCoder$eNprYE5OLEhMzkiNT0pNzNVLzk9JLSqGUlxuicUlAUWZuZklmWWpxc4gQa5CBs3GQsbaQqYIfgYGhvi0xJycpMTk7HiwlkJ8pgVkJmfnpEJNYQGawlpbyJZUnKQHACYlLgM=",
                          "component_encodings": []
                        }
                      ],
                      "is_pair_like": true
                    },
                    {
                      "@type": "kind:global_window"
                    }
                  ],
                  "is_wrapper": true
                }
              ],
              "is_stream_like": {
                "value": true
              }
            },
            "output_name": "out",
            "user_name": "write/Write/WriteImpl/FinalizeWrite/_UnpickledSideInput(PreFinalize.out.0).output"
          }
        ],
        "parallel_input": {
          "@type": "OutputReference",
          "output_name": "out",
          "step_name": "s17"
        },
        "user_name": "write/Write/WriteImpl/FinalizeWrite/_UnpickledSideInput(PreFinalize.out.0)",
        "windowing_strategy": "%0AB%22%40%0A%1Dref_Coder_GlobalWindowCoder_1%12%1F%0A%1D%0A%1Bbeam%3Acoder%3Aglobal_window%3Av1jT%0A%25%0A%23%0A%21beam%3Awindowfn%3Aglobal_windows%3Av0.1%10%01%1A%1Dref_Coder_GlobalWindowCoder_1%22%02%3A%00%28%010%018%01H%01"
      }
    },
    {
      "kind": "ParallelDo",
      "name": "s21",
      "properties": {
        "display_data": [
          {
            "key": "fn",
            "label": "Transform Function",
            "namespace": "apache_beam.transforms.core.CallableWrapperDoFn",
            "type": "STRING",
            "value": "_finalize_write"
          },
          {
            "key": "fn",
            "label": "Transform Function",
            "namespace": "apache_beam.transforms.core.ParDo",
            "shortValue": "CallableWrapperDoFn",
            "type": "STRING",
            "value": "apache_beam.transforms.core.CallableWrapperDoFn"
          }
        ],
        "non_parallel_inputs": {
          "side0-write/Write/WriteImpl/FinalizeWrite": {
            "@type": "OutputReference",
            "output_name": "out",
            "step_name": "SideInput-s18"
          },
          "side1-write/Write/WriteImpl/FinalizeWrite": {
            "@type": "OutputReference",
            "output_name": "out",
            "step_name": "SideInput-s19"
          },
          "side2-write/Write/WriteImpl/FinalizeWrite": {
            "@type": "OutputReference",
            "output_name": "out",
            "step_name": "SideInput-s20"
          }
        },
        "output_info": [
          {
            "encoding": {
              "@type": "kind:windowed_value",
              "component_encodings": [
                {
                  "@type": "FastPrimitivesCoder$eNprYE5OLEhMzkiNT0pNzNVLzk9JLSqGUlxuicUlAUWZuZklmWWpxc4gQa5CBs3GQsbaQqYIfgYGhvi0xJycpMTk7HiwlkJ8pgVkJmfnpEJNYQGawlpbyJZUnKQHACYlLgM=",
                  "component_encodings": [
                    {
                      "@type": "FastPrimitivesCoder$eNprYE5OLEhMzkiNT0pNzNVLzk9JLSqGUlxuicUlAUWZuZklmWWpxc4gQa5CBs3GQsbaQqYIfgYGhvi0xJycpMTk7HiwlkJ8pgVkJmfnpEJNYQGawlpbyJZUnKQHACYlLgM=",
                      "component_encodings": []
                    },
                    {
                      "@type": "FastPrimitivesCoder$eNprYE5OLEhMzkiNT0pNzNVLzk9JLSqGUlxuicUlAUWZuZklmWWpxc4gQa5CBs3GQsbaQqYIfgYGhvi0xJycpMTk7HiwlkJ8pgVkJmfnpEJNYQGawlpbyJZUnKQHACYlLgM=",
                      "component_encodings": []
                    }
                  ],
                  "is_pair_like": true
                },
                {
                  "@type": "kind:global_window"
                }
              ],
              "is_wrapper": true
            },
            "output_name": "out",
            "user_name": "write/Write/WriteImpl/FinalizeWrite.out"
          }
        ],
        "parallel_input": {
          "@type": "OutputReference",
          "output_name": "out",
          "step_name": "s7"
        },
        "serialized_fn": "eNrNV/l/3MQVl3adAwVoSEpKCIVtiluZsqs4qYG4KQU2ceJus3Flg0XbIGal2R3FkkZPM/LGNEshYR230EJP6Am09L7v+/gL+jf1zezaZsGm+Q0+H1uzc7w3b77v+74jPVW2A5KRgFG/RUlSkzlJRZvniagFPKdWncQxacV0MSdZRvOTfCa1wJh4GswelGxvj2EYvlzJqM+iVAoojzrDCT1eCyl6I5Lnwpo9t4DDZ9SwBWPoaUezBztt73p0xQuZFVI7FLCrqd1H6ebQ7maxCte1vLLatp2CNbJdxPGvRQS1/HaUkjh6gvrdPJLUgj3eLjTJch5QIeB6tqdonYcb7DeaS3pRRtzyF7Cdj9IlC27EAN/Vg722Z6GDtEh8wUgeCripYXg7cCjgIc1h34gnPSaGjbXA52UepZ266lqwHz2+uwc3t7y9aN6OYuqnJKG+KNrt6CIcGPHEM4wnFbVlEhfUx/iXI+VkXhIZBY+owbn1MXgPOr6lBwcHoQ4sFGxwaxBGcVzz1dPyY05CPW7BIQ2kkDnc1of3unC7PpG2hDs8/GlApWh5BxXaKv0pGuYkivEwfkq72GJO3re2eZCMSIZRUnWQw0wF9P4e3GmzW9nt7A7vHC7riGnHkTTJqgLZQDq0imSroueq5IOGCimcbKUayWoQ8yJ0BqRwJqfuOXrs+NS9U0eOH5t0ciqKGAk3jvEdUIdQWRkA2Yl5y1cUJhI+oCerd1V5uzpub6Zv4shUCB/UpPAZJSqFdtO7DrtJlAxhm9A4Kko4WUyiFO7ybhrdabjJh7w71Sbj9nCqSJT7Lbe8W2MV8ARBEgJTO9iq6o3hMCkkh1rRGmVlKmmOZK4VMoqtB/NOkdBUzsUkoIzHOvEO4nyEqedkw9TtUdqDY+fhw7Y3oSJGfhyp6kpwFjefs0kWOzPDQtEjMDWydaaZYPkPp1kULMU0nEdHs6ocLbinB/faOuqQSAL3bWW4sfwkLrHgOAY23YOP2Br25Yh2VQmfGCFnkFMiEdgiDRTxLfiozQ55u3G9qh4lHHB/Hz7mwgN2w2wY+F9u7K/fsGYYlwxjzTSulIx5eLDZh4cmtBUeKlfyBfU+nPRyHHEYT6hzgaZLUSrW26qIyTJ1ujxfEngO6qhj+HM01xlOA7qgWOkv8jys8yKVswv+3MqxKUfkgSPCJcVXyXjqvA4EZwBCLVuBUzqUEzFJWiG5H2bOPmTWDTjt3azKJueJn6NLRbuNaM9oNdQQDRUAZlfh4xMSGi58YgSxDpU+kRJpcFZv0yqiWOKRoKlhxmk1C+dWYc6FT46YRknGc+knPCxiVAPX26dI+KY8wnwfFlx4WLv30TaQvg+PrMKiCx6baW6VwIBiBx5lmD7MVAkzVW7satTrlyVWlGlcKKl8hTpfV0yjh92SISaNSzhVNsKSIceMK4bOptyh5nBRWDaWSkbeUN1wzDg4L3ca4Q5jY17uWp/Z7JR1p102DmBzGX0YSI9P2c1GSYMT0jZBFYFPKy55T+LIXJ3HMdXcq/B2RWBlVMbDSjeSrJLgfViRjOBMSis0pqoQKyRQVwoNK0RUCBqknZhKtFbJq1VmolzIiuzy9fWiQtNAUYjmygY9Hh4Xh+/Wzxp8RsL5QVXFkZDwmFYkxQrJeSzA93aqvoijgMLjWrwxv0C8G/HXqSSTKxslB4NLMqYpBFrH9GVxKs95DiG7TQL1Sto3tDUU6zTr6N2VJAK7ChE7pQXU35qmF86+Ztb3GqVbzJ3mfnOfudssm+USLE0gUWMXEuaxC0283VMJ3IWsD+BCzh7tgdBK2o3SkHf9BK8WdaOgGMjt3kWUhOkXAWFpfSex/yZrCwrRh2UXuqtwsQcrEp5w4bMam0GS1PWkxBQueYdUpeAe08qxrz1Prx9renkSetsE+CQrihZTz6vwuQ1xnbwmcX2KoWg+bbP7mFLCyz24YrMTwwoZaJnZmK+PXVIcfQYlrD/BULVW3y7VujqqWmtn/2uy0yqzn3fhC5jZNZXZZyU858IX2f9H9Evs9dg9v4Hd0WvC7gWF3ZfXsftKD776Ruy2uAe+hiB+XYP4jbcLxBdHQXwJpZ+dZmcYqvk3EcpvufBthPKlJntnSuV3lFSyd4w8flfC92z2GPPZ44ywFguYlrKXWZt1GMrVK+zFt5KrV7eWq+8rUv/AhdcwE68qUv9Qwo9c+HEffuLCT5Vc/WwbNfg5U4rzCxd+uQq/6sGvJfzGhd9eQzH8bqQYfk/f8hNsUe+LW1rwByT/H3vwJ1tf1ep0QpIk8/GFsoUv4zn8uWEOvski4a/fbn9Z0+FjJoqkiIlKnrrzKfwVF+/eOBie52/bxTFYYZ3WyjuIBz/e/o7R/ENfUfh90+lgyaTwz+1cDJdYJwdRLQy78C908u+iJeE/tf8BaJDNhw==",
        "user_name": "write/Write/WriteImpl/FinalizeWrite/FinalizeWrite"
      }
    }
  ],
  "type": "JOB_TYPE_BATCH"
}
root: INFO: Create job: <Job
 createTime: '2019-07-06T06:49:15.142189Z'
 currentStateTime: '1970-01-01T00:00:00Z'
 id: '2019-07-05_23_49_14-822484817727167647'
 location: 'us-central1'
 name: 'beamapp-jenkins-0706064911-906180'
 projectId: 'apache-beam-testing'
 stageStates: []
 startTime: '2019-07-06T06:49:15.142189Z'
 steps: []
 tempFiles: []
 type: TypeValueValuesEnum(JOB_TYPE_BATCH, 1)>
root: INFO: Created job with id: [2019-07-05_23_49_14-822484817727167647]
root: INFO: To access the Dataflow monitoring console, please navigate to https://console.cloud.google.com/dataflow/jobsDetail/locations/us-central1/jobs/2019-07-05_23_49_14-822484817727167647?project=apache-beam-testing
root: INFO: Job 2019-07-05_23_49_14-822484817727167647 is in state JOB_STATE_RUNNING
root: INFO: 2019-07-06T06:49:17.326Z: JOB_MESSAGE_DETAILED: Checking permissions granted to controller Service Account.
root: INFO: 2019-07-06T06:49:17.782Z: JOB_MESSAGE_BASIC: Worker configuration: n1-standard-1 in us-central1-a.
root: INFO: 2019-07-06T06:49:18.300Z: JOB_MESSAGE_DETAILED: Expanding CoGroupByKey operations into optimizable parts.
root: INFO: 2019-07-06T06:49:18.327Z: JOB_MESSAGE_DEBUG: Combiner lifting skipped for step write/Write/WriteImpl/GroupByKey: GroupByKey not followed by a combiner.
root: INFO: 2019-07-06T06:49:18.374Z: JOB_MESSAGE_DEBUG: Combiner lifting skipped for step group: GroupByKey not followed by a combiner.
root: INFO: 2019-07-06T06:49:18.418Z: JOB_MESSAGE_DETAILED: Expanding GroupByKey operations into optimizable parts.
root: INFO: 2019-07-06T06:49:18.461Z: JOB_MESSAGE_DETAILED: Lifting ValueCombiningMappingFns into MergeBucketsMappingFns
root: INFO: 2019-07-06T06:49:18.573Z: JOB_MESSAGE_DEBUG: Annotating graph with Autotuner information.
root: INFO: 2019-07-06T06:49:18.634Z: JOB_MESSAGE_DETAILED: Fusing adjacent ParDo, Read, Write, and Flatten operations
root: INFO: 2019-07-06T06:49:18.673Z: JOB_MESSAGE_DETAILED: Fusing consumer group/Write into group/Reify
root: INFO: 2019-07-06T06:49:18.709Z: JOB_MESSAGE_DETAILED: Fusing consumer group/GroupByWindow into group/Read
root: INFO: 2019-07-06T06:49:18.753Z: JOB_MESSAGE_DETAILED: Fusing consumer write/Write/WriteImpl/GroupByKey/GroupByWindow into write/Write/WriteImpl/GroupByKey/Read
root: INFO: 2019-07-06T06:49:18.789Z: JOB_MESSAGE_DETAILED: Fusing consumer write/Write/WriteImpl/GroupByKey/Write into write/Write/WriteImpl/GroupByKey/Reify
root: INFO: 2019-07-06T06:49:18.830Z: JOB_MESSAGE_DETAILED: Fusing consumer write/Write/WriteImpl/Extract into write/Write/WriteImpl/GroupByKey/GroupByWindow
root: INFO: 2019-07-06T06:49:18.874Z: JOB_MESSAGE_DETAILED: Fusing consumer write/Write/WriteImpl/WindowInto(WindowIntoFn) into write/Write/WriteImpl/Pair
root: INFO: 2019-07-06T06:49:18.909Z: JOB_MESSAGE_DETAILED: Fusing consumer write/Write/WriteImpl/GroupByKey/Reify into write/Write/WriteImpl/WindowInto(WindowIntoFn)
root: INFO: 2019-07-06T06:49:18.953Z: JOB_MESSAGE_DETAILED: Fusing consumer split into read/Read
root: INFO: 2019-07-06T06:49:18.991Z: JOB_MESSAGE_DETAILED: Fusing consumer group/Reify into pair_with_one
root: INFO: 2019-07-06T06:49:19.033Z: JOB_MESSAGE_DETAILED: Fusing consumer write/Write/WriteImpl/Pair into write/Write/WriteImpl/WriteBundles/WriteBundles
root: INFO: 2019-07-06T06:49:19.071Z: JOB_MESSAGE_DETAILED: Fusing consumer write/Write/WriteImpl/WriteBundles/WriteBundles into format
root: INFO: 2019-07-06T06:49:19.115Z: JOB_MESSAGE_DETAILED: Fusing consumer pair_with_one into split
root: INFO: 2019-07-06T06:49:19.153Z: JOB_MESSAGE_DETAILED: Fusing consumer count into group/GroupByWindow
root: INFO: 2019-07-06T06:49:19.192Z: JOB_MESSAGE_DETAILED: Fusing consumer format into count
root: INFO: 2019-07-06T06:49:19.228Z: JOB_MESSAGE_DETAILED: Fusing consumer write/Write/WriteImpl/InitializeWrite into write/Write/WriteImpl/DoOnce/Read
root: INFO: 2019-07-06T06:49:19.265Z: JOB_MESSAGE_DEBUG: Workflow config is missing a default resource spec.
root: INFO: 2019-07-06T06:49:19.308Z: JOB_MESSAGE_DEBUG: Adding StepResource setup and teardown to workflow graph.
root: INFO: 2019-07-06T06:49:19.344Z: JOB_MESSAGE_DEBUG: Adding workflow start and stop steps.
root: INFO: 2019-07-06T06:49:19.378Z: JOB_MESSAGE_DEBUG: Assigning stage ids.
root: INFO: 2019-07-06T06:49:19.558Z: JOB_MESSAGE_DEBUG: Executing wait step start26
root: INFO: 2019-07-06T06:49:19.635Z: JOB_MESSAGE_BASIC: Executing operation write/Write/WriteImpl/DoOnce/Read+write/Write/WriteImpl/InitializeWrite
root: INFO: 2019-07-06T06:49:19.672Z: JOB_MESSAGE_BASIC: Executing operation write/Write/WriteImpl/GroupByKey/Create
root: INFO: 2019-07-06T06:49:19.684Z: JOB_MESSAGE_DEBUG: Starting worker pool setup.
root: INFO: 2019-07-06T06:49:19.706Z: JOB_MESSAGE_BASIC: Executing operation group/Create
root: INFO: 2019-07-06T06:49:19.727Z: JOB_MESSAGE_BASIC: Starting 10 workers in us-central1-a...
root: INFO: 2019-07-06T06:49:19.794Z: JOB_MESSAGE_BASIC: Finished operation group/Create
root: INFO: 2019-07-06T06:49:19.794Z: JOB_MESSAGE_BASIC: Finished operation write/Write/WriteImpl/GroupByKey/Create
root: INFO: 2019-07-06T06:49:19.875Z: JOB_MESSAGE_DEBUG: Value "write/Write/WriteImpl/GroupByKey/Session" materialized.
root: INFO: 2019-07-06T06:49:19.900Z: JOB_MESSAGE_BASIC: Worker configuration: n1-standard-1 in us-central1-a.
root: INFO: 2019-07-06T06:49:19.922Z: JOB_MESSAGE_DEBUG: Value "group/Session" materialized.
root: INFO: 2019-07-06T06:49:20.011Z: JOB_MESSAGE_BASIC: Executing operation read/Read+split+pair_with_one+group/Reify+group/Write
root: INFO: 2019-07-06T06:49:54.833Z: JOB_MESSAGE_DETAILED: Autoscaling: Raised the number of workers to 1 based on the rate of progress in the currently running step(s).
root: INFO: 2019-07-06T06:49:54.868Z: JOB_MESSAGE_DETAILED: Resized worker pool to 1, though goal was 10.  This could be a quota issue.
root: INFO: 2019-07-06T06:50:15.859Z: JOB_MESSAGE_DETAILED: Autoscaling: Raised the number of workers to 3 based on the rate of progress in the currently running step(s).
root: INFO: 2019-07-06T06:50:15.904Z: JOB_MESSAGE_DETAILED: Resized worker pool to 3, though goal was 10.  This could be a quota issue.
root: INFO: 2019-07-06T06:50:21.182Z: JOB_MESSAGE_DETAILED: Autoscaling: Raised the number of workers to 9 based on the rate of progress in the currently running step(s).
root: INFO: 2019-07-06T06:50:21.210Z: JOB_MESSAGE_DETAILED: Resized worker pool to 9, though goal was 10.  This could be a quota issue.
root: INFO: 2019-07-06T06:50:26.478Z: JOB_MESSAGE_DETAILED: Autoscaling: Raised the number of workers to 10 based on the rate of progress in the currently running step(s).
root: INFO: 2019-07-06T06:51:05.782Z: JOB_MESSAGE_DETAILED: Workers have started successfully.
root: INFO: 2019-07-06T06:51:05.822Z: JOB_MESSAGE_DETAILED: Workers have started successfully.
root: INFO: 2019-07-06T06:52:19.951Z: JOB_MESSAGE_BASIC: Worker configuration: n1-standard-1 in us-central1-a.
root: INFO: 2019-07-06T06:55:19.536Z: JOB_MESSAGE_DETAILED: Checking permissions granted to controller Service Account.
root: INFO: 2019-07-06T06:55:19.953Z: JOB_MESSAGE_BASIC: Worker configuration: n1-standard-1 in us-central1-a.
apache_beam.io.filesystem: DEBUG: Listing files in 'gs://temp-storage-for-end-to-end-tests/py-it-cloud/output/1562395750931/results'
apache_beam.io.filesystem: DEBUG: translate_pattern: 'gs://temp-storage-for-end-to-end-tests/py-it-cloud/output/1562395750931/results*' -> 'gs\\:\\/\\/temp\\-storage\\-for\\-end\\-to\\-end\\-tests\\/py\\-it\\-cloud\\/output\\/1562395750931\\/results[^/\\\\]*'
root: DEBUG: Connecting using Google Application Default Credentials.
root: INFO: Starting the size estimation of the input
oauth2client.transport: INFO: Attempting refresh to obtain initial access_token
root: INFO: Finished listing 0 files in 0.051047325134277344 seconds.
root: DEBUG: Connecting using Google Application Default Credentials.
--------------------- >> end captured logging << ---------------------

----------------------------------------------------------------------
XML: <https://builds.apache.org/job/beam_PerformanceTests_WordCountIT_Py35/ws/src/sdks/python/nosetests.xml>
----------------------------------------------------------------------
Ran 1 test in 681.952s

FAILED (failures=1)

FAILURE: Build failed with an exception.

* What went wrong:
Execution failed for task ':sdks:python:test-suites:dataflow:py35:integrationTest'.
> Process 'command 'sh'' finished with non-zero exit value 1

* Try:
Run with --stacktrace option to get the stack trace. Run with --debug option to get more log output. Run with --scan to get full insights.

* Get more help at https://help.gradle.org

BUILD FAILED in 12m 9s

2019-07-06 07:00:34,302 99d9210c MainThread beam_integration_benchmark(1/1) ERROR    Error during benchmark beam_integration_benchmark
Traceback (most recent call last):
  File "<https://builds.apache.org/job/beam_PerformanceTests_WordCountIT_Py35/ws/PerfKitBenchmarker/perfkitbenchmarker/pkb.py",> line 760, in RunBenchmark
    DoRunPhase(spec, collector, detailed_timer)
  File "<https://builds.apache.org/job/beam_PerformanceTests_WordCountIT_Py35/ws/PerfKitBenchmarker/perfkitbenchmarker/pkb.py",> line 609, in DoRunPhase
    samples = spec.BenchmarkRun(spec)
  File "<https://builds.apache.org/job/beam_PerformanceTests_WordCountIT_Py35/ws/PerfKitBenchmarker/perfkitbenchmarker/linux_benchmarks/beam_integration_benchmark.py",> line 160, in Run
    job_type=job_type)
  File "<https://builds.apache.org/job/beam_PerformanceTests_WordCountIT_Py35/ws/PerfKitBenchmarker/perfkitbenchmarker/providers/gcp/gcp_dpb_dataflow.py",> line 90, in SubmitJob
    assert retcode == 0, "Integration Test Failed."
AssertionError: Integration Test Failed.
2019-07-06 07:00:34,303 99d9210c MainThread beam_integration_benchmark(1/1) INFO     Cleaning up benchmark beam_integration_benchmark
2019-07-06 07:00:34,305 99d9210c MainThread beam_integration_benchmark(1/1) ERROR    Exception running benchmark
Traceback (most recent call last):
  File "<https://builds.apache.org/job/beam_PerformanceTests_WordCountIT_Py35/ws/PerfKitBenchmarker/perfkitbenchmarker/pkb.py",> line 903, in RunBenchmarkTask
    RunBenchmark(spec, collector)
  File "<https://builds.apache.org/job/beam_PerformanceTests_WordCountIT_Py35/ws/PerfKitBenchmarker/perfkitbenchmarker/pkb.py",> line 760, in RunBenchmark
    DoRunPhase(spec, collector, detailed_timer)
  File "<https://builds.apache.org/job/beam_PerformanceTests_WordCountIT_Py35/ws/PerfKitBenchmarker/perfkitbenchmarker/pkb.py",> line 609, in DoRunPhase
    samples = spec.BenchmarkRun(spec)
  File "<https://builds.apache.org/job/beam_PerformanceTests_WordCountIT_Py35/ws/PerfKitBenchmarker/perfkitbenchmarker/linux_benchmarks/beam_integration_benchmark.py",> line 160, in Run
    job_type=job_type)
  File "<https://builds.apache.org/job/beam_PerformanceTests_WordCountIT_Py35/ws/PerfKitBenchmarker/perfkitbenchmarker/providers/gcp/gcp_dpb_dataflow.py",> line 90, in SubmitJob
    assert retcode == 0, "Integration Test Failed."
AssertionError: Integration Test Failed.
2019-07-06 07:00:34,305 99d9210c MainThread beam_integration_benchmark(1/1) ERROR    Benchmark 1/1 beam_integration_benchmark (UID: beam_integration_benchmark0) failed. Execution will continue.
2019-07-06 07:00:34,306 99d9210c MainThread beam_integration_benchmark(1/1) INFO     Benchmark run statuses:
---------------------------------------------------------------------------------
Name                        UID                          Status  Failed Substatus
---------------------------------------------------------------------------------
beam_integration_benchmark  beam_integration_benchmark0  FAILED                  
---------------------------------------------------------------------------------
Success rate: 0.00% (0/1)
2019-07-06 07:00:34,306 99d9210c MainThread beam_integration_benchmark(1/1) INFO     Complete logs can be found at: <https://builds.apache.org/job/beam_PerformanceTests_WordCountIT_Py35/ws/runs/99d9210c/pkb.log>
2019-07-06 07:00:34,306 99d9210c MainThread beam_integration_benchmark(1/1) INFO     Completion statuses can be found at: <https://builds.apache.org/job/beam_PerformanceTests_WordCountIT_Py35/ws/runs/99d9210c/completion_statuses.json>
Build step 'Execute shell' marked build as failure

---------------------------------------------------------------------
To unsubscribe, e-mail: builds-unsubscribe@beam.apache.org
For additional commands, e-mail: builds-help@beam.apache.org