You are viewing a plain text version of this content. The canonical link for it is here.
Posted to builds@solr.apache.org by Policeman Jenkins Server <je...@thetaphi.de> on 2025/09/22 02:04:31 UTC
[JENKINS] Solr-main-Windows (64bit/hotspot/jdk-24) - Build # 7072 - Unstable!
Build: https://jenkins.thetaphi.de/job/Solr-main-Windows/7072/
Java: 64bit/hotspot/jdk-24 -XX:+UseCompressedOops -XX:+UseParallelGC
3 tests failed.
FAILED: org.apache.solr.cloud.LeaderVoteWaitTimeoutTest.basicTest
Error Message:
java.lang.Exception: Error shutting down MiniSolrCloudCluster
Stack Trace:
java.lang.Exception: Error shutting down MiniSolrCloudCluster
at __randomizedtesting.SeedInfo.seed([7B507CA96BB8EFB6:89A46BCB2F1DE285]:0)
at org.apache.solr.cloud.MiniSolrCloudCluster.checkForExceptions(MiniSolrCloudCluster.java:772)
at org.apache.solr.cloud.MiniSolrCloudCluster.shutdown(MiniSolrCloudCluster.java:681)
at org.apache.solr.cloud.SolrCloudTestCase.shutdownCluster(SolrCloudTestCase.java:142)
at org.apache.solr.cloud.LeaderVoteWaitTimeoutTest.tearDown(LeaderVoteWaitTimeoutTest.java:117)
at java.base/jdk.internal.reflect.DirectMethodHandleAccessor.invoke(DirectMethodHandleAccessor.java:104)
at java.base/java.lang.reflect.Method.invoke(Method.java:565)
at com.carrotsearch.randomizedtesting.RandomizedRunner.invoke(RandomizedRunner.java:1763)
at com.carrotsearch.randomizedtesting.RandomizedRunner$10.evaluate(RandomizedRunner.java:1004)
at com.carrotsearch.randomizedtesting.rules.SystemPropertiesRestoreRule$1.evaluate(SystemPropertiesRestoreRule.java:80)
at org.junit.rules.RunRules.evaluate(RunRules.java:20)
at org.apache.lucene.tests.util.TestRuleSetupTeardownChained$1.evaluate(TestRuleSetupTeardownChained.java:48)
at org.apache.lucene.tests.util.AbstractBeforeAfterRule$1.evaluate(AbstractBeforeAfterRule.java:43)
at org.apache.lucene.tests.util.TestRuleThreadAndTestName$1.evaluate(TestRuleThreadAndTestName.java:45)
at org.apache.lucene.tests.util.TestRuleIgnoreAfterMaxFailures$1.evaluate(TestRuleIgnoreAfterMaxFailures.java:60)
at org.apache.lucene.tests.util.TestRuleMarkFailure$1.evaluate(TestRuleMarkFailure.java:44)
at org.junit.rules.RunRules.evaluate(RunRules.java:20)
at com.carrotsearch.randomizedtesting.rules.StatementAdapter.evaluate(StatementAdapter.java:36)
at com.carrotsearch.randomizedtesting.ThreadLeakControl$StatementRunner.run(ThreadLeakControl.java:390)
at com.carrotsearch.randomizedtesting.ThreadLeakControl.forkTimeoutingTask(ThreadLeakControl.java:843)
at com.carrotsearch.randomizedtesting.ThreadLeakControl$3.evaluate(ThreadLeakControl.java:490)
at com.carrotsearch.randomizedtesting.RandomizedRunner.runSingleTest(RandomizedRunner.java:955)
at com.carrotsearch.randomizedtesting.RandomizedRunner$5.evaluate(RandomizedRunner.java:840)
at com.carrotsearch.randomizedtesting.RandomizedRunner$6.evaluate(RandomizedRunner.java:891)
at com.carrotsearch.randomizedtesting.RandomizedRunner$7.evaluate(RandomizedRunner.java:902)
at com.carrotsearch.randomizedtesting.rules.StatementAdapter.evaluate(StatementAdapter.java:36)
at com.carrotsearch.randomizedtesting.rules.StatementAdapter.evaluate(StatementAdapter.java:36)
at org.apache.lucene.tests.util.AbstractBeforeAfterRule$1.evaluate(AbstractBeforeAfterRule.java:43)
at com.carrotsearch.randomizedtesting.rules.SystemPropertiesRestoreRule$1.evaluate(SystemPropertiesRestoreRule.java:80)
at org.junit.rules.RunRules.evaluate(RunRules.java:20)
at org.apache.lucene.tests.util.AbstractBeforeAfterRule$1.evaluate(AbstractBeforeAfterRule.java:43)
at com.carrotsearch.randomizedtesting.rules.StatementAdapter.evaluate(StatementAdapter.java:36)
at org.apache.lucene.tests.util.TestRuleStoreClassName$1.evaluate(TestRuleStoreClassName.java:38)
at com.carrotsearch.randomizedtesting.rules.NoShadowingOrOverridesOnMethodsRule$1.evaluate(NoShadowingOrOverridesOnMethodsRule.java:40)
at com.carrotsearch.randomizedtesting.rules.NoShadowingOrOverridesOnMethodsRule$1.evaluate(NoShadowingOrOverridesOnMethodsRule.java:40)
at com.carrotsearch.randomizedtesting.rules.StatementAdapter.evaluate(StatementAdapter.java:36)
at com.carrotsearch.randomizedtesting.rules.StatementAdapter.evaluate(StatementAdapter.java:36)
at org.apache.lucene.tests.util.TestRuleAssertionsRequired$1.evaluate(TestRuleAssertionsRequired.java:53)
at org.apache.lucene.tests.util.AbstractBeforeAfterRule$1.evaluate(AbstractBeforeAfterRule.java:43)
at org.apache.lucene.tests.util.TestRuleMarkFailure$1.evaluate(TestRuleMarkFailure.java:44)
at org.apache.lucene.tests.util.TestRuleIgnoreAfterMaxFailures$1.evaluate(TestRuleIgnoreAfterMaxFailures.java:60)
at org.apache.lucene.tests.util.TestRuleIgnoreTestSuites$1.evaluate(TestRuleIgnoreTestSuites.java:47)
at org.junit.rules.RunRules.evaluate(RunRules.java:20)
at com.carrotsearch.randomizedtesting.rules.StatementAdapter.evaluate(StatementAdapter.java:36)
at com.carrotsearch.randomizedtesting.ThreadLeakControl$StatementRunner.run(ThreadLeakControl.java:390)
at com.carrotsearch.randomizedtesting.ThreadLeakControl.lambda$forkTimeoutingTask$0(ThreadLeakControl.java:850)
at java.base/java.lang.Thread.run(Thread.java:1447)
Suppressed: java.util.concurrent.TimeoutException
at java.base/java.util.concurrent.CompletableFuture.timedGet(CompletableFuture.java:2006)
at java.base/java.util.concurrent.CompletableFuture.get(CompletableFuture.java:2141)
at org.eclipse.jetty.server.Server.doStop(Server.java:663)
at org.eclipse.jetty.util.component.AbstractLifeCycle.stop(AbstractLifeCycle.java:132)
at org.apache.solr.embedded.JettySolrRunner.stop(JettySolrRunner.java:633)
at org.apache.solr.cloud.MiniSolrCloudCluster.stopJettySolrRunner(MiniSolrCloudCluster.java:564)
at org.apache.solr.cloud.MiniSolrCloudCluster.lambda$shutdown$1(MiniSolrCloudCluster.java:673)
at java.base/java.util.concurrent.FutureTask.run(FutureTask.java:328)
at org.apache.solr.common.util.ExecutorUtil$MDCAwareThreadPoolExecutor.lambda$execute$0(ExecutorUtil.java:381)
at java.base/java.util.concurrent.ThreadPoolExecutor.runWorker(ThreadPoolExecutor.java:1095)
at java.base/java.util.concurrent.ThreadPoolExecutor$Worker.run(ThreadPoolExecutor.java:619)
... 1 more
FAILED: org.apache.solr.handler.TestUserManagedReplicationWithAuth.doTestManualFetchIndexWithAuthEnabled
Error Message:
java.lang.AssertionError: 1
Stack Trace:
java.lang.AssertionError: 1
at __randomizedtesting.SeedInfo.seed([7B507CA96BB8EFB6]:0)
at org.apache.solr.core.CachingDirectoryFactory.close(CachingDirectoryFactory.java:199)
at org.apache.solr.core.SolrCore.doClose(SolrCore.java:1873)
at org.apache.solr.core.SolrCore.close(SolrCore.java:1735)
at org.apache.solr.core.SolrCores.lambda$close$0(SolrCores.java:128)
at org.apache.solr.common.util.ExecutorUtil$MDCAwareThreadPoolExecutor.lambda$execute$0(ExecutorUtil.java:381)
at java.base/java.util.concurrent.ThreadPoolExecutor.runWorker(ThreadPoolExecutor.java:1095)
at java.base/java.util.concurrent.ThreadPoolExecutor$Worker.run(ThreadPoolExecutor.java:619)
at java.base/java.lang.Thread.run(Thread.java:1447)
FAILED: org.apache.solr.handler.TestUserManagedReplicationWithAuth.classMethod
Error Message:
java.lang.AssertionError: ObjectTracker found 5 object(s) that were not released!!! [SolrCore, Http2SolrClient, MockDirectoryWrapper, MockDirectoryWrapper, MockDirectoryWrapper]
org.apache.solr.core.SolrCore:org.apache.solr.common.util.ObjectReleaseTracker$ObjectTrackerException: org.apache.solr.core.SolrCore
at org.apache.solr.common.util.ObjectReleaseTracker.track(ObjectReleaseTracker.java:54)
at org.apache.solr.core.SolrCore.<init>(SolrCore.java:1227)
at org.apache.solr.core.SolrCore.<init>(SolrCore.java:1050)
at org.apache.solr.core.CoreContainer.createFromDescriptor(CoreContainer.java:1700)
at org.apache.solr.core.CoreContainer.lambda$loadInternal$9(CoreContainer.java:1048)
at com.codahale.metrics.InstrumentedExecutorService$InstrumentedRunnable.run(InstrumentedExecutorService.java:212)
at org.apache.solr.common.util.ExecutorUtil$MDCAwareThreadPoolExecutor.lambda$execute$0(ExecutorUtil.java:381)
at java.base/java.util.concurrent.ThreadPoolExecutor.runWorker(ThreadPoolExecutor.java:1095)
at java.base/java.util.concurrent.ThreadPoolExecutor$Worker.run(ThreadPoolExecutor.java:619)
at java.base/java.lang.Thread.run(Thread.java:1447)
Caused by: java.lang.Exception: Submitter stack trace
at org.apache.solr.common.util.ExecutorUtil$MDCAwareThreadPoolExecutor.execute(ExecutorUtil.java:348)
at com.codahale.metrics.InstrumentedExecutorService.execute(InstrumentedExecutorService.java:95)
at org.apache.solr.core.CoreContainer.loadInternal(CoreContainer.java:1037)
at org.apache.solr.core.CoreContainer.load(CoreContainer.java:736)
at org.apache.solr.servlet.CoreContainerProvider.createCoreContainer(CoreContainerProvider.java:396)
at org.apache.solr.servlet.CoreContainerProvider.init(CoreContainerProvider.java:219)
at org.apache.solr.servlet.CoreContainerProvider.contextInitialized(CoreContainerProvider.java:106)
at org.apache.solr.embedded.JettySolrRunner$1.contextInitialized(JettySolrRunner.java:391)
at org.eclipse.jetty.ee10.servlet.ServletContextHandler.callContextInitialized(ServletContextHandler.java:1591)
at org.eclipse.jetty.ee10.servlet.ServletContextHandler.contextInitialized(ServletContextHandler.java:500)
at org.eclipse.jetty.ee10.servlet.ServletHandler.initialize(ServletHandler.java:676)
at org.eclipse.jetty.ee10.servlet.ServletContextHandler.startContext(ServletContextHandler.java:1325)
at org.eclipse.jetty.ee10.servlet.ServletContextHandler.lambda$doStart$0(ServletContextHandler.java:1051)
at org.eclipse.jetty.server.handler.ContextHandler$ScopedContext.call(ContextHandler.java:1456)
at org.eclipse.jetty.ee10.servlet.ServletContextHandler.doStart(ServletContextHandler.java:1048)
at org.eclipse.jetty.util.component.AbstractLifeCycle.start(AbstractLifeCycle.java:93)
at org.eclipse.jetty.util.component.ContainerLifeCycle.start(ContainerLifeCycle.java:169)
at org.eclipse.jetty.util.component.ContainerLifeCycle.doStart(ContainerLifeCycle.java:120)
at org.eclipse.jetty.server.Handler$Abstract.doStart(Handler.java:491)
at org.eclipse.jetty.util.component.AbstractLifeCycle.start(AbstractLifeCycle.java:93)
at org.eclipse.jetty.util.component.ContainerLifeCycle.start(ContainerLifeCycle.java:169)
at org.eclipse.jetty.util.component.ContainerLifeCycle.doStart(ContainerLifeCycle.java:120)
at org.eclipse.jetty.server.Handler$Abstract.doStart(Handler.java:491)
at org.eclipse.jetty.server.handler.gzip.GzipHandler.doStart(GzipHandler.java:132)
at org.eclipse.jetty.util.component.AbstractLifeCycle.start(AbstractLifeCycle.java:93)
at org.eclipse.jetty.util.component.ContainerLifeCycle.start(ContainerLifeCycle.java:169)
at org.eclipse.jetty.util.component.ContainerLifeCycle.doStart(ContainerLifeCycle.java:120)
at org.eclipse.jetty.server.Handler$Abstract.doStart(Handler.java:491)
at org.eclipse.jetty.util.component.AbstractLifeCycle.start(AbstractLifeCycle.java:93)
at org.eclipse.jetty.util.component.ContainerLifeCycle.start(ContainerLifeCycle.java:169)
at org.eclipse.jetty.server.Server.start(Server.java:643)
at org.eclipse.jetty.util.component.ContainerLifeCycle.doStart(ContainerLifeCycle.java:120)
at org.eclipse.jetty.server.Handler$Abstract.doStart(Handler.java:491)
at org.eclipse.jetty.server.Server.doStart(Server.java:584)
at org.eclipse.jetty.util.component.AbstractLifeCycle.start(AbstractLifeCycle.java:93)
at org.apache.solr.embedded.JettySolrRunner.retryOnPortBindFailure(JettySolrRunner.java:582)
at org.apache.solr.embedded.JettySolrRunner.start(JettySolrRunner.java:528)
at org.apache.solr.embedded.JettySolrRunner.start(JettySolrRunner.java:499)
at org.apache.solr.handler.ReplicationTestHelper.createAndStartJetty(ReplicationTestHelper.java:73)
at org.apache.solr.handler.TestUserManagedReplicationWithAuth.setUp(TestUserManagedReplicationWithAuth.java:105)
at java.base/jdk.internal.reflect.DirectMethodHandleAccessor.invoke(DirectMethodHandleAccessor.java:104)
at java.base/java.lang.reflect.Method.invoke(Method.java:565)
at com.carrotsearch.randomizedtesting.RandomizedRunner.invoke(RandomizedRunner.java:1763)
at com.carrotsearch.randomizedtesting.RandomizedRunner$9.evaluate(RandomizedRunner.java:980)
at com.carrotsearch.randomizedtesting.RandomizedRunner$10.evaluate(RandomizedRunner.java:996)
at com.carrotsearch.randomizedtesting.rules.SystemPropertiesRestoreRule$1.evaluate(SystemPropertiesRestoreRule.java:80)
at org.junit.rules.RunRules.evaluate(RunRules.java:20)
at org.apache.lucene.tests.util.TestRuleSetupTeardownChained$1.evaluate(TestRuleSetupTeardownChained.java:48)
at org.apache.lucene.tests.util.AbstractBeforeAfterRule$1.evaluate(AbstractBeforeAfterRule.java:43)
at org.apache.lucene.tests.util.TestRuleThreadAndTestName$1.evaluate(TestRuleThreadAndTestName.java:45)
at org.apache.lucene.tests.util.TestRuleIgnoreAfterMaxFailures$1.evaluate(TestRuleIgnoreAfterMaxFailures.java:60)
at org.apache.lucene.tests.util.TestRuleMarkFailure$1.evaluate(TestRuleMarkFailure.java:44)
at org.junit.rules.RunRules.evaluate(RunRules.java:20)
at com.carrotsearch.randomizedtesting.rules.StatementAdapter.evaluate(StatementAdapter.java:36)
at com.carrotsearch.randomizedtesting.ThreadLeakControl$StatementRunner.run(ThreadLeakControl.java:390)
at com.carrotsearch.randomizedtesting.ThreadLeakControl.forkTimeoutingTask(ThreadLeakControl.java:843)
at com.carrotsearch.randomizedtesting.ThreadLeakControl$3.evaluate(ThreadLeakControl.java:490)
at com.carrotsearch.randomizedtesting.RandomizedRunner.runSingleTest(RandomizedRunner.java:955)
at com.carrotsearch.randomizedtesting.RandomizedRunner$5.evaluate(RandomizedRunner.java:840)
at com.carrotsearch.randomizedtesting.RandomizedRunner$6.evaluate(RandomizedRunner.java:891)
at com.carrotsearch.randomizedtesting.RandomizedRunner$7.evaluate(RandomizedRunner.java:902)
at com.carrotsearch.randomizedtesting.rules.StatementAdapter.evaluate(StatementAdapter.java:36)
at com.carrotsearch.randomizedtesting.rules.StatementAdapter.evaluate(StatementAdapter.java:36)
at org.apache.lucene.tests.util.AbstractBeforeAfterRule$1.evaluate(AbstractBeforeAfterRule.java:43)
at com.carrotsearch.randomizedtesting.rules.SystemPropertiesRestoreRule$1.evaluate(SystemPropertiesRestoreRule.java:80)
at org.junit.rules.RunRules.evaluate(RunRules.java:20)
at org.apache.lucene.tests.util.AbstractBeforeAfterRule$1.evaluate(AbstractBeforeAfterRule.java:43)
at com.carrotsearch.randomizedtesting.rules.StatementAdapter.evaluate(StatementAdapter.java:36)
at org.apache.lucene.tests.util.TestRuleStoreClassName$1.evaluate(TestRuleStoreClassName.java:38)
at com.carrotsearch.randomizedtesting.rules.NoShadowingOrOverridesOnMethodsRule$1.evaluate(NoShadowingOrOverridesOnMethodsRule.java:40)
at com.carrotsearch.randomizedtesting.rules.NoShadowingOrOverridesOnMethodsRule$1.evaluate(NoShadowingOrOverridesOnMethodsRule.java:40)
at com.carrotsearch.randomizedtesting.rules.StatementAdapter.evaluate(StatementAdapter.java:36)
at com.carrotsearch.randomizedtesting.rules.StatementAdapter.evaluate(StatementAdapter.java:36)
at org.apache.lucene.tests.util.TestRuleAssertionsRequired$1.evaluate(TestRuleAssertionsRequired.java:53)
at org.apache.lucene.tests.util.AbstractBeforeAfterRule$1.evaluate(AbstractBeforeAfterRule.java:43)
at org.apache.lucene.tests.util.TestRuleMarkFailure$1.evaluate(TestRuleMarkFailure.java:44)
at org.apache.lucene.tests.util.TestRuleIgnoreAfterMaxFailures$1.evaluate(TestRuleIgnoreAfterMaxFailures.java:60)
at org.apache.lucene.tests.util.TestRuleIgnoreTestSuites$1.evaluate(TestRuleIgnoreTestSuites.java:47)
at org.junit.rules.RunRules.evaluate(RunRules.java:20)
at com.carrotsearch.randomizedtesting.rules.StatementAdapter.evaluate(StatementAdapter.java:36)
at com.carrotsearch.randomizedtesting.ThreadLeakControl$StatementRunner.run(ThreadLeakControl.java:390)
at com.carrotsearch.randomizedtesting.ThreadLeakControl.lambda$forkTimeoutingTask$0(ThreadLeakControl.java:850)
... 1 more
org.apache.solr.client.solrj.impl.Http2SolrClient:org.apache.solr.common.util.ObjectReleaseTracker$ObjectTrackerException: org.apache.solr.client.solrj.impl.Http2SolrClient
at org.apache.solr.common.util.ObjectReleaseTracker.track(ObjectReleaseTracker.java:54)
at org.apache.solr.client.solrj.impl.Http2SolrClient.<init>(Http2SolrClient.java:174)
at org.apache.solr.client.solrj.impl.Http2SolrClient$Builder.build(Http2SolrClient.java:1078)
at org.apache.solr.handler.IndexFetcher.createSolrClient(IndexFetcher.java:261)
at org.apache.solr.handler.IndexFetcher.<init>(IndexFetcher.java:294)
at org.apache.solr.handler.ReplicationHandler.inform(ReplicationHandler.java:1239)
at org.apache.solr.core.SolrResourceLoader.inform(SolrResourceLoader.java:757)
at org.apache.solr.core.SolrCore.<init>(SolrCore.java:1176)
at org.apache.solr.core.SolrCore.<init>(SolrCore.java:1050)
at org.apache.solr.core.CoreContainer.createFromDescriptor(CoreContainer.java:1700)
at org.apache.solr.core.CoreContainer.lambda$loadInternal$9(CoreContainer.java:1048)
at com.codahale.metrics.InstrumentedExecutorService$InstrumentedRunnable.run(InstrumentedExecutorService.java:212)
at org.apache.solr.common.util.ExecutorUtil$MDCAwareThreadPoolExecutor.lambda$execute$0(ExecutorUtil.java:381)
at java.base/java.util.concurrent.ThreadPoolExecutor.runWorker(ThreadPoolExecutor.java:1095)
at java.base/java.util.concurrent.ThreadPoolExecutor$Worker.run(ThreadPoolExecutor.java:619)
at java.base/java.lang.Thread.run(Thread.java:1447)
Caused by: java.lang.Exception: Submitter stack trace
at org.apache.solr.common.util.ExecutorUtil$MDCAwareThreadPoolExecutor.execute(ExecutorUtil.java:348)
at com.codahale.metrics.InstrumentedExecutorService.execute(InstrumentedExecutorService.java:95)
at org.apache.solr.core.CoreContainer.loadInternal(CoreContainer.java:1037)
at org.apache.solr.core.CoreContainer.load(CoreContainer.java:736)
at org.apache.solr.servlet.CoreContainerProvider.createCoreContainer(CoreContainerProvider.java:396)
at org.apache.solr.servlet.CoreContainerProvider.init(CoreContainerProvider.java:219)
at org.apache.solr.servlet.CoreContainerProvider.contextInitialized(CoreContainerProvider.java:106)
at org.apache.solr.embedded.JettySolrRunner$1.contextInitialized(JettySolrRunner.java:391)
at org.eclipse.jetty.ee10.servlet.ServletContextHandler.callContextInitialized(ServletContextHandler.java:1591)
at org.eclipse.jetty.ee10.servlet.ServletContextHandler.contextInitialized(ServletContextHandler.java:500)
at org.eclipse.jetty.ee10.servlet.ServletHandler.initialize(ServletHandler.java:676)
at org.eclipse.jetty.ee10.servlet.ServletContextHandler.startContext(ServletContextHandler.java:1325)
at org.eclipse.jetty.ee10.servlet.ServletContextHandler.lambda$doStart$0(ServletContextHandler.java:1051)
at org.eclipse.jetty.server.handler.ContextHandler$ScopedContext.call(ContextHandler.java:1456)
at org.eclipse.jetty.ee10.servlet.ServletContextHandler.doStart(ServletContextHandler.java:1048)
at org.eclipse.jetty.util.component.AbstractLifeCycle.start(AbstractLifeCycle.java:93)
at org.eclipse.jetty.util.component.ContainerLifeCycle.start(ContainerLifeCycle.java:169)
at org.eclipse.jetty.util.component.ContainerLifeCycle.doStart(ContainerLifeCycle.java:120)
at org.eclipse.jetty.server.Handler$Abstract.doStart(Handler.java:491)
at org.eclipse.jetty.util.component.AbstractLifeCycle.start(AbstractLifeCycle.java:93)
at org.eclipse.jetty.util.component.ContainerLifeCycle.start(ContainerLifeCycle.java:169)
at org.eclipse.jetty.util.component.ContainerLifeCycle.doStart(ContainerLifeCycle.java:120)
at org.eclipse.jetty.server.Handler$Abstract.doStart(Handler.java:491)
at org.eclipse.jetty.server.handler.gzip.GzipHandler.doStart(GzipHandler.java:132)
at org.eclipse.jetty.util.component.AbstractLifeCycle.start(AbstractLifeCycle.java:93)
at org.eclipse.jetty.util.component.ContainerLifeCycle.start(ContainerLifeCycle.java:169)
at org.eclipse.jetty.util.component.ContainerLifeCycle.doStart(ContainerLifeCycle.java:120)
at org.eclipse.jetty.server.Handler$Abstract.doStart(Handler.java:491)
at org.eclipse.jetty.util.component.AbstractLifeCycle.start(AbstractLifeCycle.java:93)
at org.eclipse.jetty.util.component.ContainerLifeCycle.start(ContainerLifeCycle.java:169)
at org.eclipse.jetty.server.Server.start(Server.java:643)
at org.eclipse.jetty.util.component.ContainerLifeCycle.doStart(ContainerLifeCycle.java:120)
at org.eclipse.jetty.server.Handler$Abstract.doStart(Handler.java:491)
at org.eclipse.jetty.server.Server.doStart(Server.java:584)
at org.eclipse.jetty.util.component.AbstractLifeCycle.start(AbstractLifeCycle.java:93)
at org.apache.solr.embedded.JettySolrRunner.retryOnPortBindFailure(JettySolrRunner.java:582)
at org.apache.solr.embedded.JettySolrRunner.start(JettySolrRunner.java:528)
at org.apache.solr.embedded.JettySolrRunner.start(JettySolrRunner.java:499)
at org.apache.solr.handler.ReplicationTestHelper.createAndStartJetty(ReplicationTestHelper.java:73)
at org.apache.solr.handler.TestUserManagedReplicationWithAuth.setUp(TestUserManagedReplicationWithAuth.java:105)
at java.base/jdk.internal.reflect.DirectMethodHandleAccessor.invoke(DirectMethodHandleAccessor.java:104)
at java.base/java.lang.reflect.Method.invoke(Method.java:565)
at com.carrotsearch.randomizedtesting.RandomizedRunner.invoke(RandomizedRunner.java:1763)
at com.carrotsearch.randomizedtesting.RandomizedRunner$9.evaluate(RandomizedRunner.java:980)
at com.carrotsearch.randomizedtesting.RandomizedRunner$10.evaluate(RandomizedRunner.java:996)
at com.carrotsearch.randomizedtesting.rules.SystemPropertiesRestoreRule$1.evaluate(SystemPropertiesRestoreRule.java:80)
at org.junit.rules.RunRules.evaluate(RunRules.java:20)
at org.apache.lucene.tests.util.TestRuleSetupTeardownChained$1.evaluate(TestRuleSetupTeardownChained.java:48)
at org.apache.lucene.tests.util.AbstractBeforeAfterRule$1.evaluate(AbstractBeforeAfterRule.java:43)
at org.apache.lucene.tests.util.TestRuleThreadAndTestName$1.evaluate(TestRuleThreadAndTestName.java:45)
at org.apache.lucene.tests.util.TestRuleIgnoreAfterMaxFailures$1.evaluate(TestRuleIgnoreAfterMaxFailures.java:60)
at org.apache.lucene.tests.util.TestRuleMarkFailure$1.evaluate(TestRuleMarkFailure.java:44)
at org.junit.rules.RunRules.evaluate(RunRules.java:20)
at com.carrotsearch.randomizedtesting.rules.StatementAdapter.evaluate(StatementAdapter.java:36)
at com.carrotsearch.randomizedtesting.ThreadLeakControl$StatementRunner.run(ThreadLeakControl.java:390)
at com.carrotsearch.randomizedtesting.ThreadLeakControl.forkTimeoutingTask(ThreadLeakControl.java:843)
at com.carrotsearch.randomizedtesting.ThreadLeakControl$3.evaluate(ThreadLeakControl.java:490)
at com.carrotsearch.randomizedtesting.RandomizedRunner.runSingleTest(RandomizedRunner.java:955)
at com.carrotsearch.randomizedtesting.RandomizedRunner$5.evaluate(RandomizedRunner.java:840)
at com.carrotsearch.randomizedtesting.RandomizedRunner$6.evaluate(RandomizedRunner.java:891)
at com.carrotsearch.randomizedtesting.RandomizedRunner$7.evaluate(RandomizedRunner.java:902)
at com.carrotsearch.randomizedtesting.rules.StatementAdapter.evaluate(StatementAdapter.java:36)
at com.carrotsearch.randomizedtesting.rules.StatementAdapter.evaluate(StatementAdapter.java:36)
at org.apache.lucene.tests.util.AbstractBeforeAfterRule$1.evaluate(AbstractBeforeAfterRule.java:43)
at com.carrotsearch.randomizedtesting.rules.SystemPropertiesRestoreRule$1.evaluate(SystemPropertiesRestoreRule.java:80)
at org.junit.rules.RunRules.evaluate(RunRules.java:20)
at org.apache.lucene.tests.util.AbstractBeforeAfterRule$1.evaluate(AbstractBeforeAfterRule.java:43)
at com.carrotsearch.randomizedtesting.rules.StatementAdapter.evaluate(StatementAdapter.java:36)
at org.apache.lucene.tests.util.TestRuleStoreClassName$1.evaluate(TestRuleStoreClassName.java:38)
at com.carrotsearch.randomizedtesting.rules.NoShadowingOrOverridesOnMethodsRule$1.evaluate(NoShadowingOrOverridesOnMethodsRule.java:40)
at com.carrotsearch.randomizedtesting.rules.NoShadowingOrOverridesOnMethodsRule$1.evaluate(NoShadowingOrOverridesOnMethodsRule.java:40)
at com.carrotsearch.randomizedtesting.rules.StatementAdapter.evaluate(StatementAdapter.java:36)
at com.carrotsearch.randomizedtesting.rules.StatementAdapter.evaluate(StatementAdapter.java:36)
at org.apache.lucene.tests.util.TestRuleAssertionsRequired$1.evaluate(TestRuleAssertionsRequired.java:53)
at org.apache.lucene.tests.util.AbstractBeforeAfterRule$1.evaluate(AbstractBeforeAfterRule.java:43)
at org.apache.lucene.tests.util.TestRuleMarkFailure$1.evaluate(TestRuleMarkFailure.java:44)
at org.apache.lucene.tests.util.TestRuleIgnoreAfterMaxFailures$1.evaluate(TestRuleIgnoreAfterMaxFailures.java:60)
at org.apache.lucene.tests.util.TestRuleIgnoreTestSuites$1.evaluate(TestRuleIgnoreTestSuites.java:47)
at org.junit.rules.RunRules.evaluate(RunRules.java:20)
at com.carrotsearch.randomizedtesting.rules.StatementAdapter.evaluate(StatementAdapter.java:36)
at com.carrotsearch.randomizedtesting.ThreadLeakControl$StatementRunner.run(ThreadLeakControl.java:390)
at com.carrotsearch.randomizedtesting.ThreadLeakControl.lambda$forkTimeoutingTask$0(ThreadLeakControl.java:850)
... 1 more
org.apache.lucene.tests.store.MockDirectoryWrapper:org.apache.solr.common.util.ObjectReleaseTracker$ObjectTrackerException: org.apache.lucene.tests.store.MockDirectoryWrapper
at org.apache.solr.common.util.ObjectReleaseTracker.track(ObjectReleaseTracker.java:54)
at org.apache.solr.core.CachingDirectoryFactory.get(CachingDirectoryFactory.java:405)
at org.apache.solr.update.SolrIndexWriter.create(SolrIndexWriter.java:108)
at org.apache.solr.core.SolrCore.initIndex(SolrCore.java:900)
at org.apache.solr.core.SolrCore.<init>(SolrCore.java:1127)
at org.apache.solr.core.SolrCore.<init>(SolrCore.java:1050)
at org.apache.solr.core.CoreContainer.createFromDescriptor(CoreContainer.java:1700)
at org.apache.solr.core.CoreContainer.lambda$loadInternal$9(CoreContainer.java:1048)
at com.codahale.metrics.InstrumentedExecutorService$InstrumentedRunnable.run(InstrumentedExecutorService.java:212)
at org.apache.solr.common.util.ExecutorUtil$MDCAwareThreadPoolExecutor.lambda$execute$0(ExecutorUtil.java:381)
at java.base/java.util.concurrent.ThreadPoolExecutor.runWorker(ThreadPoolExecutor.java:1095)
at java.base/java.util.concurrent.ThreadPoolExecutor$Worker.run(ThreadPoolExecutor.java:619)
at java.base/java.lang.Thread.run(Thread.java:1447)
Caused by: java.lang.Exception: Submitter stack trace
at org.apache.solr.common.util.ExecutorUtil$MDCAwareThreadPoolExecutor.execute(ExecutorUtil.java:348)
at com.codahale.metrics.InstrumentedExecutorService.execute(InstrumentedExecutorService.java:95)
at org.apache.solr.core.CoreContainer.loadInternal(CoreContainer.java:1037)
at org.apache.solr.core.CoreContainer.load(CoreContainer.java:736)
at org.apache.solr.servlet.CoreContainerProvider.createCoreContainer(CoreContainerProvider.java:396)
at org.apache.solr.servlet.CoreContainerProvider.init(CoreContainerProvider.java:219)
at org.apache.solr.servlet.CoreContainerProvider.contextInitialized(CoreContainerProvider.java:106)
at org.apache.solr.embedded.JettySolrRunner$1.contextInitialized(JettySolrRunner.java:391)
at org.eclipse.jetty.ee10.servlet.ServletContextHandler.callContextInitialized(ServletContextHandler.java:1591)
at org.eclipse.jetty.ee10.servlet.ServletContextHandler.contextInitialized(ServletContextHandler.java:500)
at org.eclipse.jetty.ee10.servlet.ServletHandler.initialize(ServletHandler.java:676)
at org.eclipse.jetty.ee10.servlet.ServletContextHandler.startContext(ServletContextHandler.java:1325)
at org.eclipse.jetty.ee10.servlet.ServletContextHandler.lambda$doStart$0(ServletContextHandler.java:1051)
at org.eclipse.jetty.server.handler.ContextHandler$ScopedContext.call(ContextHandler.java:1456)
at org.eclipse.jetty.ee10.servlet.ServletContextHandler.doStart(ServletContextHandler.java:1048)
at org.eclipse.jetty.util.component.AbstractLifeCycle.start(AbstractLifeCycle.java:93)
at org.eclipse.jetty.util.component.ContainerLifeCycle.start(ContainerLifeCycle.java:169)
at org.eclipse.jetty.util.component.ContainerLifeCycle.doStart(ContainerLifeCycle.java:120)
at org.eclipse.jetty.server.Handler$Abstract.doStart(Handler.java:491)
at org.eclipse.jetty.util.component.AbstractLifeCycle.start(AbstractLifeCycle.java:93)
at org.eclipse.jetty.util.component.ContainerLifeCycle.start(ContainerLifeCycle.java:169)
at org.eclipse.jetty.util.component.ContainerLifeCycle.doStart(ContainerLifeCycle.java:120)
at org.eclipse.jetty.server.Handler$Abstract.doStart(Handler.java:491)
at org.eclipse.jetty.server.handler.gzip.GzipHandler.doStart(GzipHandler.java:132)
at org.eclipse.jetty.util.component.AbstractLifeCycle.start(AbstractLifeCycle.java:93)
at org.eclipse.jetty.util.component.ContainerLifeCycle.start(ContainerLifeCycle.java:169)
at org.eclipse.jetty.util.component.ContainerLifeCycle.doStart(ContainerLifeCycle.java:120)
at org.eclipse.jetty.server.Handler$Abstract.doStart(Handler.java:491)
at org.eclipse.jetty.util.component.AbstractLifeCycle.start(AbstractLifeCycle.java:93)
at org.eclipse.jetty.util.component.ContainerLifeCycle.start(ContainerLifeCycle.java:169)
at org.eclipse.jetty.server.Server.start(Server.java:643)
at org.eclipse.jetty.util.component.ContainerLifeCycle.doStart(ContainerLifeCycle.java:120)
at org.eclipse.jetty.server.Handler$Abstract.doStart(Handler.java:491)
at org.eclipse.jetty.server.Server.doStart(Server.java:584)
at org.eclipse.jetty.util.component.AbstractLifeCycle.start(AbstractLifeCycle.java:93)
at org.apache.solr.embedded.JettySolrRunner.retryOnPortBindFailure(JettySolrRunner.java:582)
at org.apache.solr.embedded.JettySolrRunner.start(JettySolrRunner.java:528)
at org.apache.solr.embedded.JettySolrRunner.start(JettySolrRunner.java:499)
at org.apache.solr.handler.ReplicationTestHelper.createAndStartJetty(ReplicationTestHelper.java:73)
at org.apache.solr.handler.TestUserManagedReplicationWithAuth.setUp(TestUserManagedReplicationWithAuth.java:105)
at java.base/jdk.internal.reflect.DirectMethodHandleAccessor.invoke(DirectMethodHandleAccessor.java:104)
at java.base/java.lang.reflect.Method.invoke(Method.java:565)
at com.carrotsearch.randomizedtesting.RandomizedRunner.invoke(RandomizedRunner.java:1763)
at com.carrotsearch.randomizedtesting.RandomizedRunner$9.evaluate(RandomizedRunner.java:980)
at com.carrotsearch.randomizedtesting.RandomizedRunner$10.evaluate(RandomizedRunner.java:996)
at com.carrotsearch.randomizedtesting.rules.SystemPropertiesRestoreRule$1.evaluate(SystemPropertiesRestoreRule.java:80)
at org.junit.rules.RunRules.evaluate(RunRules.java:20)
at org.apache.lucene.tests.util.TestRuleSetupTeardownChained$1.evaluate(TestRuleSetupTeardownChained.java:48)
at org.apache.lucene.tests.util.AbstractBeforeAfterRule$1.evaluate(AbstractBeforeAfterRule.java:43)
at org.apache.lucene.tests.util.TestRuleThreadAndTestName$1.evaluate(TestRuleThreadAndTestName.java:45)
at org.apache.lucene.tests.util.TestRuleIgnoreAfterMaxFailures$1.evaluate(TestRuleIgnoreAfterMaxFailures.java:60)
at org.apache.lucene.tests.util.TestRuleMarkFailure$1.evaluate(TestRuleMarkFailure.java:44)
at org.junit.rules.RunRules.evaluate(RunRules.java:20)
at com.carrotsearch.randomizedtesting.rules.StatementAdapter.evaluate(StatementAdapter.java:36)
at com.carrotsearch.randomizedtesting.ThreadLeakControl$StatementRunner.run(ThreadLeakControl.java:390)
at com.carrotsearch.randomizedtesting.ThreadLeakControl.forkTimeoutingTask(ThreadLeakControl.java:843)
at com.carrotsearch.randomizedtesting.ThreadLeakControl$3.evaluate(ThreadLeakControl.java:490)
at com.carrotsearch.randomizedtesting.RandomizedRunner.runSingleTest(RandomizedRunner.java:955)
at com.carrotsearch.randomizedtesting.RandomizedRunner$5.evaluate(RandomizedRunner.java:840)
at com.carrotsearch.randomizedtesting.RandomizedRunner$6.evaluate(RandomizedRunner.java:891)
at com.carrotsearch.randomizedtesting.RandomizedRunner$7.evaluate(RandomizedRunner.java:902)
at com.carrotsearch.randomizedtesting.rules.StatementAdapter.evaluate(StatementAdapter.java:36)
at com.carrotsearch.randomizedtesting.rules.StatementAdapter.evaluate(StatementAdapter.java:36)
at org.apache.lucene.tests.util.AbstractBeforeAfterRule$1.evaluate(AbstractBeforeAfterRule.java:43)
at com.carrotsearch.randomizedtesting.rules.SystemPropertiesRestoreRule$1.evaluate(SystemPropertiesRestoreRule.java:80)
at org.junit.rules.RunRules.evaluate(RunRules.java:20)
at org.apache.lucene.tests.util.AbstractBeforeAfterRule$1.evaluate(AbstractBeforeAfterRule.java:43)
at com.carrotsearch.randomizedtesting.rules.StatementAdapter.evaluate(StatementAdapter.java:36)
at org.apache.lucene.tests.util.TestRuleStoreClassName$1.evaluate(TestRuleStoreClassName.java:38)
at com.carrotsearch.randomizedtesting.rules.NoShadowingOrOverridesOnMethodsRule$1.evaluate(NoShadowingOrOverridesOnMethodsRule.java:40)
at com.carrotsearch.randomizedtesting.rules.NoShadowingOrOverridesOnMethodsRule$1.evaluate(NoShadowingOrOverridesOnMethodsRule.java:40)
at com.carrotsearch.randomizedtesting.rules.StatementAdapter.evaluate(StatementAdapter.java:36)
at com.carrotsearch.randomizedtesting.rules.StatementAdapter.evaluate(StatementAdapter.java:36)
at org.apache.lucene.tests.util.TestRuleAssertionsRequired$1.evaluate(TestRuleAssertionsRequired.java:53)
at org.apache.lucene.tests.util.AbstractBeforeAfterRule$1.evaluate(AbstractBeforeAfterRule.java:43)
at org.apache.lucene.tests.util.TestRuleMarkFailure$1.evaluate(TestRuleMarkFailure.java:44)
at org.apache.lucene.tests.util.TestRuleIgnoreAfterMaxFailures$1.evaluate(TestRuleIgnoreAfterMaxFailures.java:60)
at org.apache.lucene.tests.util.TestRuleIgnoreTestSuites$1.evaluate(TestRuleIgnoreTestSuites.java:47)
at org.junit.rules.RunRules.evaluate(RunRules.java:20)
at com.carrotsearch.randomizedtesting.rules.StatementAdapter.evaluate(StatementAdapter.java:36)
at com.carrotsearch.randomizedtesting.ThreadLeakControl$StatementRunner.run(ThreadLeakControl.java:390)
at com.carrotsearch.randomizedtesting.ThreadLeakControl.lambda$forkTimeoutingTask$0(ThreadLeakControl.java:850)
... 1 more
org.apache.lucene.tests.store.MockDirectoryWrapper:org.apache.solr.common.util.ObjectReleaseTracker$ObjectTrackerException: org.apache.lucene.tests.store.MockDirectoryWrapper
at org.apache.solr.common.util.ObjectReleaseTracker.track(ObjectReleaseTracker.java:54)
at org.apache.solr.core.CachingDirectoryFactory.get(CachingDirectoryFactory.java:405)
at org.apache.solr.core.SolrCore.initSnapshotMetaDataManager(SolrCore.java:606)
at org.apache.solr.core.SolrCore.<init>(SolrCore.java:1123)
at org.apache.solr.core.SolrCore.<init>(SolrCore.java:1050)
at org.apache.solr.core.CoreContainer.createFromDescriptor(CoreContainer.java:1700)
at org.apache.solr.core.CoreContainer.lambda$loadInternal$9(CoreContainer.java:1048)
at com.codahale.metrics.InstrumentedExecutorService$InstrumentedRunnable.run(InstrumentedExecutorService.java:212)
at org.apache.solr.common.util.ExecutorUtil$MDCAwareThreadPoolExecutor.lambda$execute$0(ExecutorUtil.java:381)
at java.base/java.util.concurrent.ThreadPoolExecutor.runWorker(ThreadPoolExecutor.java:1095)
at java.base/java.util.concurrent.ThreadPoolExecutor$Worker.run(ThreadPoolExecutor.java:619)
at java.base/java.lang.Thread.run(Thread.java:1447)
Caused by: java.lang.Exception: Submitter stack trace
at org.apache.solr.common.util.ExecutorUtil$MDCAwareThreadPoolExecutor.execute(ExecutorUtil.java:348)
at com.codahale.metrics.InstrumentedExecutorService.execute(InstrumentedExecutorService.java:95)
at org.apache.solr.core.CoreContainer.loadInternal(CoreContainer.java:1037)
at org.apache.solr.core.CoreContainer.load(CoreContainer.java:736)
at org.apache.solr.servlet.CoreContainerProvider.createCoreContainer(CoreContainerProvider.java:396)
at org.apache.solr.servlet.CoreContainerProvider.init(CoreContainerProvider.java:219)
at org.apache.solr.servlet.CoreContainerProvider.contextInitialized(CoreContainerProvider.java:106)
at org.apache.solr.embedded.JettySolrRunner$1.contextInitialized(JettySolrRunner.java:391)
at org.eclipse.jetty.ee10.servlet.ServletContextHandler.callContextInitialized(ServletContextHandler.java:1591)
at org.eclipse.jetty.ee10.servlet.ServletContextHandler.contextInitialized(ServletContextHandler.java:500)
at org.eclipse.jetty.ee10.servlet.ServletHandler.initialize(ServletHandler.java:676)
at org.eclipse.jetty.ee10.servlet.ServletContextHandler.startContext(ServletContextHandler.java:1325)
at org.eclipse.jetty.ee10.servlet.ServletContextHandler.lambda$doStart$0(ServletContextHandler.java:1051)
at org.eclipse.jetty.server.handler.ContextHandler$ScopedContext.call(ContextHandler.java:1456)
at org.eclipse.jetty.ee10.servlet.ServletContextHandler.doStart(ServletContextHandler.java:1048)
at org.eclipse.jetty.util.component.AbstractLifeCycle.start(AbstractLifeCycle.java:93)
at org.eclipse.jetty.util.component.ContainerLifeCycle.start(ContainerLifeCycle.java:169)
at org.eclipse.jetty.util.component.ContainerLifeCycle.doStart(ContainerLifeCycle.java:120)
at org.eclipse.jetty.server.Handler$Abstract.doStart(Handler.java:491)
at org.eclipse.jetty.util.component.AbstractLifeCycle.start(AbstractLifeCycle.java:93)
at org.eclipse.jetty.util.component.ContainerLifeCycle.start(ContainerLifeCycle.java:169)
at org.eclipse.jetty.util.component.ContainerLifeCycle.doStart(ContainerLifeCycle.java:120)
at org.eclipse.jetty.server.Handler$Abstract.doStart(Handler.java:491)
at org.eclipse.jetty.server.handler.gzip.GzipHandler.doStart(GzipHandler.java:132)
at org.eclipse.jetty.util.component.AbstractLifeCycle.start(AbstractLifeCycle.java:93)
at org.eclipse.jetty.util.component.ContainerLifeCycle.start(ContainerLifeCycle.java:169)
at org.eclipse.jetty.util.component.ContainerLifeCycle.doStart(ContainerLifeCycle.java:120)
at org.eclipse.jetty.server.Handler$Abstract.doStart(Handler.java:491)
at org.eclipse.jetty.util.component.AbstractLifeCycle.start(AbstractLifeCycle.java:93)
at org.eclipse.jetty.util.component.ContainerLifeCycle.start(ContainerLifeCycle.java:169)
at org.eclipse.jetty.server.Server.start(Server.java:643)
at org.eclipse.jetty.util.component.ContainerLifeCycle.doStart(ContainerLifeCycle.java:120)
at org.eclipse.jetty.server.Handler$Abstract.doStart(Handler.java:491)
at org.eclipse.jetty.server.Server.doStart(Server.java:584)
at org.eclipse.jetty.util.component.AbstractLifeCycle.start(AbstractLifeCycle.java:93)
at org.apache.solr.embedded.JettySolrRunner.retryOnPortBindFailure(JettySolrRunner.java:582)
at org.apache.solr.embedded.JettySolrRunner.start(JettySolrRunner.java:528)
at org.apache.solr.embedded.JettySolrRunner.start(JettySolrRunner.java:499)
at org.apache.solr.handler.ReplicationTestHelper.createAndStartJetty(ReplicationTestHelper.java:73)
at org.apache.solr.handler.TestUserManagedReplicationWithAuth.setUp(TestUserManagedReplicationWithAuth.java:105)
at java.base/jdk.internal.reflect.DirectMethodHandleAccessor.invoke(DirectMethodHandleAccessor.java:104)
at java.base/java.lang.reflect.Method.invoke(Method.java:565)
at com.carrotsearch.randomizedtesting.RandomizedRunner.invoke(RandomizedRunner.java:1763)
at com.carrotsearch.randomizedtesting.RandomizedRunner$9.evaluate(RandomizedRunner.java:980)
at com.carrotsearch.randomizedtesting.RandomizedRunner$10.evaluate(RandomizedRunner.java:996)
at com.carrotsearch.randomizedtesting.rules.SystemPropertiesRestoreRule$1.evaluate(SystemPropertiesRestoreRule.java:80)
at org.junit.rules.RunRules.evaluate(RunRules.java:20)
at org.apache.lucene.tests.util.TestRuleSetupTeardownChained$1.evaluate(TestRuleSetupTeardownChained.java:48)
at org.apache.lucene.tests.util.AbstractBeforeAfterRule$1.evaluate(AbstractBeforeAfterRule.java:43)
at org.apache.lucene.tests.util.TestRuleThreadAndTestName$1.evaluate(TestRuleThreadAndTestName.java:45)
at org.apache.lucene.tests.util.TestRuleIgnoreAfterMaxFailures$1.evaluate(TestRuleIgnoreAfterMaxFailures.java:60)
at org.apache.lucene.tests.util.TestRuleMarkFailure$1.evaluate(TestRuleMarkFailure.java:44)
at org.junit.rules.RunRules.evaluate(RunRules.java:20)
at com.carrotsearch.randomizedtesting.rules.StatementAdapter.evaluate(StatementAdapter.java:36)
at com.carrotsearch.randomizedtesting.ThreadLeakControl$StatementRunner.run(ThreadLeakControl.java:390)
at com.carrotsearch.randomizedtesting.ThreadLeakControl.forkTimeoutingTask(ThreadLeakControl.java:843)
at com.carrotsearch.randomizedtesting.ThreadLeakControl$3.evaluate(ThreadLeakControl.java:490)
at com.carrotsearch.randomizedtesting.RandomizedRunner.runSingleTest(RandomizedRunner.java:955)
at com.carrotsearch.randomizedtesting.RandomizedRunner$5.evaluate(RandomizedRunner.java:840)
at com.carrotsearch.randomizedtesting.RandomizedRunner$6.evaluate(RandomizedRunner.java:891)
at com.carrotsearch.randomizedtesting.RandomizedRunner$7.evaluate(RandomizedRunner.java:902)
at com.carrotsearch.randomizedtesting.rules.StatementAdapter.evaluate(StatementAdapter.java:36)
at com.carrotsearch.randomizedtesting.rules.StatementAdapter.evaluate(StatementAdapter.java:36)
at org.apache.lucene.tests.util.AbstractBeforeAfterRule$1.evaluate(AbstractBeforeAfterRule.java:43)
at com.carrotsearch.randomizedtesting.rules.SystemPropertiesRestoreRule$1.evaluate(SystemPropertiesRestoreRule.java:80)
at org.junit.rules.RunRules.evaluate(RunRules.java:20)
at org.apache.lucene.tests.util.AbstractBeforeAfterRule$1.evaluate(AbstractBeforeAfterRule.java:43)
at com.carrotsearch.randomizedtesting.rules.StatementAdapter.evaluate(StatementAdapter.java:36)
at org.apache.lucene.tests.util.TestRuleStoreClassName$1.evaluate(TestRuleStoreClassName.java:38)
at com.carrotsearch.randomizedtesting.rules.NoShadowingOrOverridesOnMethodsRule$1.evaluate(NoShadowingOrOverridesOnMethodsRule.java:40)
at com.carrotsearch.randomizedtesting.rules.NoShadowingOrOverridesOnMethodsRule$1.evaluate(NoShadowingOrOverridesOnMethodsRule.java:40)
at com.carrotsearch.randomizedtesting.rules.StatementAdapter.evaluate(StatementAdapter.java:36)
at com.carrotsearch.randomizedtesting.rules.StatementAdapter.evaluate(StatementAdapter.java:36)
at org.apache.lucene.tests.util.TestRuleAssertionsRequired$1.evaluate(TestRuleAssertionsRequired.java:53)
at org.apache.lucene.tests.util.AbstractBeforeAfterRule$1.evaluate(AbstractBeforeAfterRule.java:43)
at org.apache.lucene.tests.util.TestRuleMarkFailure$1.evaluate(TestRuleMarkFailure.java:44)
at org.apache.lucene.tests.util.TestRuleIgnoreAfterMaxFailures$1.evaluate(TestRuleIgnoreAfterMaxFailures.java:60)
at org.apache.lucene.tests.util.TestRuleIgnoreTestSuites$1.evaluate(TestRuleIgnoreTestSuites.java:47)
at org.junit.rules.RunRules.evaluate(RunRules.java:20)
at com.carrotsearch.randomizedtesting.rules.StatementAdapter.evaluate(StatementAdapter.java:36)
at com.carrotsearch.randomizedtesting.ThreadLeakControl$StatementRunner.run(ThreadLeakControl.java:390)
at com.carrotsearch.randomizedtesting.ThreadLeakControl.lambda$forkTimeoutingTask$0(ThreadLeakControl.java:850)
... 1 more
org.apache.lucene.tests.store.MockDirectoryWrapper:org.apache.solr.common.util.ObjectReleaseTracker$ObjectTrackerException: org.apache.lucene.tests.store.MockDirectoryWrapper
at org.apache.solr.common.util.ObjectReleaseTracker.track(ObjectReleaseTracker.java:54)
at org.apache.solr.core.CachingDirectoryFactory.get(CachingDirectoryFactory.java:405)
at org.apache.solr.core.SolrCore.getNewIndexDir(SolrCore.java:411)
at org.apache.solr.core.SolrCore.initIndex(SolrCore.java:861)
at org.apache.solr.core.SolrCore.<init>(SolrCore.java:1127)
at org.apache.solr.core.SolrCore.<init>(SolrCore.java:1050)
at org.apache.solr.core.CoreContainer.createFromDescriptor(CoreContainer.java:1700)
at org.apache.solr.core.CoreContainer.lambda$loadInternal$9(CoreContainer.java:1048)
at com.codahale.metrics.InstrumentedExecutorService$InstrumentedRunnable.run(InstrumentedExecutorService.java:212)
at org.apache.solr.common.util.ExecutorUtil$MDCAwareThreadPoolExecutor.lambda$execute$0(ExecutorUtil.java:381)
at java.base/java.util.concurrent.ThreadPoolExecutor.runWorker(ThreadPoolExecutor.java:1095)
at java.base/java.util.concurrent.ThreadPoolExecutor$Worker.run(ThreadPoolExecutor.java:619)
at java.base/java.lang.Thread.run(Thread.java:1447)
Caused by: java.lang.Exception: Submitter stack trace
at org.apache.solr.common.util.ExecutorUtil$MDCAwareThreadPoolExecutor.execute(ExecutorUtil.java:348)
at com.codahale.metrics.InstrumentedExecutorService.execute(InstrumentedExecutorService.java:95)
at org.apache.solr.core.CoreContainer.loadInternal(CoreContainer.java:1037)
at org.apache.solr.core.CoreContainer.load(CoreContainer.java:736)
at org.apache.solr.servlet.CoreContainerProvider.createCoreContainer(CoreContainerProvider.java:396)
at org.apache.solr.servlet.CoreContainerProvider.init(CoreContainerProvider.java:219)
at org.apache.solr.servlet.CoreContainerProvider.contextInitialized(CoreContainerProvider.java:106)
at org.apache.solr.embedded.JettySolrRunner$1.contextInitialized(JettySolrRunner.java:391)
at org.eclipse.jetty.ee10.servlet.ServletContextHandler.callContextInitialized(ServletContextHandler.java:1591)
at org.eclipse.jetty.ee10.servlet.ServletContextHandler.contextInitialized(ServletContextHandler.java:500)
at org.eclipse.jetty.ee10.servlet.ServletHandler.initialize(ServletHandler.java:676)
at org.eclipse.jetty.ee10.servlet.ServletContextHandler.startContext(ServletContextHandler.java:1325)
at org.eclipse.jetty.ee10.servlet.ServletContextHandler.lambda$doStart$0(ServletContextHandler.java:1051)
at org.eclipse.jetty.server.handler.ContextHandler$ScopedContext.call(ContextHandler.java:1456)
at org.eclipse.jetty.ee10.servlet.ServletContextHandler.doStart(ServletContextHandler.java:1048)
at org.eclipse.jetty.util.component.AbstractLifeCycle.start(AbstractLifeCycle.java:93)
at org.eclipse.jetty.util.component.ContainerLifeCycle.start(ContainerLifeCycle.java:169)
at org.eclipse.jetty.util.component.ContainerLifeCycle.doStart(ContainerLifeCycle.java:120)
at org.eclipse.jetty.server.Handler$Abstract.doStart(Handler.java:491)
at org.eclipse.jetty.util.component.AbstractLifeCycle.start(AbstractLifeCycle.java:93)
at org.eclipse.jetty.util.component.ContainerLifeCycle.start(ContainerLifeCycle.java:169)
at org.eclipse.jetty.util.component.ContainerLifeCycle.doStart(ContainerLifeCycle.java:120)
at org.eclipse.jetty.server.Handler$Abstract.doStart(Handler.java:491)
at org.eclipse.jetty.server.handler.gzip.GzipHandler.doStart(GzipHandler.java:132)
at org.eclipse.jetty.util.component.AbstractLifeCycle.start(AbstractLifeCycle.java:93)
at org.eclipse.jetty.util.component.ContainerLifeCycle.start(ContainerLifeCycle.java:169)
at org.eclipse.jetty.util.component.ContainerLifeCycle.doStart(ContainerLifeCycle.java:120)
at org.eclipse.jetty.server.Handler$Abstract.doStart(Handler.java:491)
at org.eclipse.jetty.util.component.AbstractLifeCycle.start(AbstractLifeCycle.java:93)
at org.eclipse.jetty.util.component.ContainerLifeCycle.start(ContainerLifeCycle.java:169)
at org.eclipse.jetty.server.Server.start(Server.java:643)
at org.eclipse.jetty.util.component.ContainerLifeCycle.doStart(ContainerLifeCycle.java:120)
at org.eclipse.jetty.server.Handler$Abstract.doStart(Handler.java:491)
at org.eclipse.jetty.server.Server.doStart(Server.java:584)
at org.eclipse.jetty.util.component.AbstractLifeCycle.start(AbstractLifeCycle.java:93)
at org.apache.solr.embedded.JettySolrRunner.retryOnPortBindFailure(JettySolrRunner.java:582)
at org.apache.solr.embedded.JettySolrRunner.start(JettySolrRunner.java:528)
at org.apache.solr.embedded.JettySolrRunner.start(JettySolrRunner.java:499)
at org.apache.solr.handler.ReplicationTestHelper.createAndStartJetty(ReplicationTestHelper.java:73)
at org.apache.solr.handler.TestUserManagedReplicationWithAuth.setUp(TestUserManagedReplicationWithAuth.java:105)
at java.base/jdk.internal.reflect.DirectMethodHandleAccessor.invoke(DirectMethodHandleAccessor.java:104)
at java.base/java.lang.reflect.Method.invoke(Method.java:565)
at com.carrotsearch.randomizedtesting.RandomizedRunner.invoke(RandomizedRunner.java:1763)
at com.carrotsearch.randomizedtesting.RandomizedRunner$9.evaluate(RandomizedRunner.java:980)
at com.carrotsearch.randomizedtesting.RandomizedRunner$10.evaluate(RandomizedRunner.java:996)
at com.carrotsearch.randomizedtesting.rules.SystemPropertiesRestoreRule$1.evaluate(SystemPropertiesRestoreRule.java:80)
at org.junit.rules.RunRules.evaluate(RunRules.java:20)
at org.apache.lucene.tests.util.TestRuleSetupTeardownChained$1.evaluate(TestRuleSetupTeardownChained.java:48)
at org.apache.lucene.tests.util.AbstractBeforeAfterRule$1.evaluate(AbstractBeforeAfterRule.java:43)
at org.apache.lucene.tests.util.TestRuleThreadAndTestName$1.evaluate(TestRuleThreadAndTestName.java:45)
at org.apache.lucene.tests.util.TestRuleIgnoreAfterMaxFailures$1.evaluate(TestRuleIgnoreAfterMaxFailures.java:60)
at org.apache.lucene.tests.util.TestRuleMarkFailure$1.evaluate(TestRuleMarkFailure.java:44)
at org.junit.rules.RunRules.evaluate(RunRules.java:20)
at com.carrotsearch.randomizedtesting.rules.StatementAdapter.evaluate(StatementAdapter.java:36)
at com.carrotsearch.randomizedtesting.ThreadLeakControl$StatementRunner.run(ThreadLeakControl.java:390)
at com.carrotsearch.randomizedtesting.ThreadLeakControl.forkTimeoutingTask(ThreadLeakControl.java:843)
at com.carrotsearch.randomizedtesting.ThreadLeakControl$3.evaluate(ThreadLeakControl.java:490)
at com.carrotsearch.randomizedtesting.RandomizedRunner.runSingleTest(RandomizedRunner.java:955)
at com.carrotsearch.randomizedtesting.RandomizedRunner$5.evaluate(RandomizedRunner.java:840)
at com.carrotsearch.randomizedtesting.RandomizedRunner$6.evaluate(RandomizedRunner.java:891)
at com.carrotsearch.randomizedtesting.RandomizedRunner$7.evaluate(RandomizedRunner.java:902)
at com.carrotsearch.randomizedtesting.rules.StatementAdapter.evaluate(StatementAdapter.java:36)
at com.carrotsearch.randomizedtesting.rules.StatementAdapter.evaluate(StatementAdapter.java:36)
at org.apache.lucene.tests.util.AbstractBeforeAfterRule$1.evaluate(AbstractBeforeAfterRule.java:43)
at com.carrotsearch.randomizedtesting.rules.SystemPropertiesRestoreRule$1.evaluate(SystemPropertiesRestoreRule.java:80)
at org.junit.rules.RunRules.evaluate(RunRules.java:20)
at org.apache.lucene.tests.util.AbstractBeforeAfterRule$1.evaluate(AbstractBeforeAfterRule.java:43)
at com.carrotsearch.randomizedtesting.rules.StatementAdapter.evaluate(StatementAdapter.java:36)
at org.apache.lucene.tests.util.TestRuleStoreClassName$1.evaluate(TestRuleStoreClassName.java:38)
at com.carrotsearch.randomizedtesting.rules.NoShadowingOrOverridesOnMethodsRule$1.evaluate(NoShadowingOrOverridesOnMethodsRule.java:40)
at com.carrotsearch.randomizedtesting.rules.NoShadowingOrOverridesOnMethodsRule$1.evaluate(NoShadowingOrOverridesOnMethodsRule.java:40)
at com.carrotsearch.randomizedtesting.rules.StatementAdapter.evaluate(StatementAdapter.java:36)
at com.carrotsearch.randomizedtesting.rules.StatementAdapter.evaluate(StatementAdapter.java:36)
at org.apache.lucene.tests.util.TestRuleAssertionsRequired$1.evaluate(TestRuleAssertionsRequired.java:53)
at org.apache.lucene.tests.util.AbstractBeforeAfterRule$1.evaluate(AbstractBeforeAfterRule.java:43)
at org.apache.lucene.tests.util.TestRuleMarkFailure$1.evaluate(TestRuleMarkFailure.java:44)
at org.apache.lucene.tests.util.TestRuleIgnoreAfterMaxFailures$1.evaluate(TestRuleIgnoreAfterMaxFailures.java:60)
at org.apache.lucene.tests.util.TestRuleIgnoreTestSuites$1.evaluate(TestRuleIgnoreTestSuites.java:47)
at org.junit.rules.RunRules.evaluate(RunRules.java:20)
at com.carrotsearch.randomizedtesting.rules.StatementAdapter.evaluate(StatementAdapter.java:36)
at com.carrotsearch.randomizedtesting.ThreadLeakControl$StatementRunner.run(ThreadLeakControl.java:390)
at com.carrotsearch.randomizedtesting.ThreadLeakControl.lambda$forkTimeoutingTask$0(ThreadLeakControl.java:850)
... 1 more
expected null, but was:<ObjectTracker found 5 object(s) that were not released!!! [SolrCore, Http2SolrClient, MockDirectoryWrapper, MockDirectoryWrapper, MockDirectoryWrapper]
org.apache.solr.core.SolrCore:org.apache.solr.common.util.ObjectReleaseTracker$ObjectTrackerException: org.apache.solr.core.SolrCore
at org.apache.solr.common.util.ObjectReleaseTracker.track(ObjectReleaseTracker.java:54)
at org.apache.solr.core.SolrCore.<init>(SolrCore.java:1227)
at org.apache.solr.core.SolrCore.<init>(SolrCore.java:1050)
at org.apache.solr.core.CoreContainer.createFromDescriptor(CoreContainer.java:1700)
at org.apache.solr.core.CoreContainer.lambda$loadInternal$9(CoreContainer.java:1048)
at com.codahale.metrics.InstrumentedExecutorService$InstrumentedRunnable.run(InstrumentedExecutorService.java:212)
at org.apache.solr.common.util.ExecutorUtil$MDCAwareThreadPoolExecutor.lambda$execute$0(ExecutorUtil.java:381)
at java.base/java.util.concurrent.ThreadPoolExecutor.runWorker(ThreadPoolExecutor.java:1095)
at java.base/java.util.concurrent.ThreadPoolExecutor$Worker.run(ThreadPoolExecutor.java:619)
at java.base/java.lang.Thread.run(Thread.java:1447)
Caused by: java.lang.Exception: Submitter stack trace
at org.apache.solr.common.util.ExecutorUtil$MDCAwareThreadPoolExecutor.execute(ExecutorUtil.java:348)
at com.codahale.metrics.InstrumentedExecutorService.execute(InstrumentedExecutorService.java:95)
at org.apache.solr.core.CoreContainer.loadInternal(CoreContainer.java:1037)
at org.apache.solr.core.CoreContainer.load(CoreContainer.java:736)
at org.apache.solr.servlet.CoreContainerProvider.createCoreContainer(CoreContainerProvider.java:396)
at org.apache.solr.servlet.CoreContainerProvider.init(CoreContainerProvider.java:219)
at org.apache.solr.servlet.CoreContainerProvider.contextInitialized(CoreContainerProvider.java:106)
at org.apache.solr.embedded.JettySolrRunner$1.contextInitialized(JettySolrRunner.java:391)
at org.eclipse.jetty.ee10.servlet.ServletContextHandler.callContextInitialized(ServletContextHandler.java:1591)
at org.eclipse.jetty.ee10.servlet.ServletContextHandler.contextInitialized(ServletContextHandler.java:500)
at org.eclipse.jetty.ee10.servlet.ServletHandler.initialize(ServletHandler.java:676)
at org.eclipse.jetty.ee10.servlet.ServletContextHandler.startContext(ServletContextHandler.java:1325)
at org.eclipse.jetty.ee10.servlet.ServletContextHandler.lambda$doStart$0(ServletContextHandler.java:1051)
at org.eclipse.jetty.server.handler.ContextHandler$ScopedContext.call(ContextHandler.java:1456)
at org.eclipse.jetty.ee10.servlet.ServletContextHandler.doStart(ServletContextHandler.java:1048)
at org.eclipse.jetty.util.component.AbstractLifeCycle.start(AbstractLifeCycle.java:93)
at org.eclipse.jetty.util.component.ContainerLifeCycle.start(ContainerLifeCycle.java:169)
at org.eclipse.jetty.util.component.ContainerLifeCycle.doStart(ContainerLifeCycle.java:120)
at org.eclipse.jetty.server.Handler$Abstract.doStart(Handler.java:491)
at org.eclipse.jetty.util.component.AbstractLifeCycle.start(AbstractLifeCycle.java:93)
at org.eclipse.jetty.util.component.ContainerLifeCycle.start(ContainerLifeCycle.java:169)
at org.eclipse.jetty.util.component.ContainerLifeCycle.doStart(ContainerLifeCycle.java:120)
at org.eclipse.jetty.server.Handler$Abstract.doStart(Handler.java:491)
at org.eclipse.jetty.server.handler.gzip.GzipHandler.doStart(GzipHandler.java:132)
at org.eclipse.jetty.util.component.AbstractLifeCycle.start(AbstractLifeCycle.java:93)
at org.eclipse.jetty.util.component.ContainerLifeCycle.start(ContainerLifeCycle.java:169)
at org.eclipse.jetty.util.component.ContainerLifeCycle.doStart(ContainerLifeCycle.java:120)
at org.eclipse.jetty.server.Handler$Abstract.doStart(Handler.java:491)
at org.eclipse.jetty.util.component.AbstractLifeCycle.start(AbstractLifeCycle.java:93)
at org.eclipse.jetty.util.component.ContainerLifeCycle.start(ContainerLifeCycle.java:169)
at org.eclipse.jetty.server.Server.start(Server.java:643)
at org.eclipse.jetty.util.component.ContainerLifeCycle.doStart(ContainerLifeCycle.java:120)
at org.eclipse.jetty.server.Handler$Abstract.doStart(Handler.java:491)
at org.eclipse.jetty.server.Server.doStart(Server.java:584)
at org.eclipse.jetty.util.component.AbstractLifeCycle.start(AbstractLifeCycle.java:93)
at org.apache.solr.embedded.JettySolrRunner.retryOnPortBindFailure(JettySolrRunner.java:582)
at org.apache.solr.embedded.JettySolrRunner.start(JettySolrRunner.java:528)
at org.apache.solr.embedded.JettySolrRunner.start(JettySolrRunner.java:499)
at org.apache.solr.handler.ReplicationTestHelper.createAndStartJetty(ReplicationTestHelper.java:73)
at org.apache.solr.handler.TestUserManagedReplicationWithAuth.setUp(TestUserManagedReplicationWithAuth.java:105)
at java.base/jdk.internal.reflect.DirectMethodHandleAccessor.invoke(DirectMethodHandleAccessor.java:104)
at java.base/java.lang.reflect.Method.invoke(Method.java:565)
at com.carrotsearch.randomizedtesting.RandomizedRunner.invoke(RandomizedRunner.java:1763)
at com.carrotsearch.randomizedtesting.RandomizedRunner$9.evaluate(RandomizedRunner.java:980)
at com.carrotsearch.randomizedtesting.RandomizedRunner$10.evaluate(RandomizedRunner.java:996)
at com.carrotsearch.randomizedtesting.rules.SystemPropertiesRestoreRule$1.evaluate(SystemPropertiesRestoreRule.java:80)
at org.junit.rules.RunRules.evaluate(RunRules.java:20)
at org.apache.lucene.tests.util.TestRuleSetupTeardownChained$1.evaluate(TestRuleSetupTeardownChained.java:48)
at org.apache.lucene.tests.util.AbstractBeforeAfterRule$1.evaluate(AbstractBeforeAfterRule.java:43)
at org.apache.lucene.tests.util.TestRuleThreadAndTestName$1.evaluate(TestRuleThreadAndTestName.java:45)
at org.apache.lucene.tests.util.TestRuleIgnoreAfterMaxFailures$1.evaluate(TestRuleIgnoreAfterMaxFailures.java:60)
at org.apache.lucene.tests.util.TestRuleMarkFailure$1.evaluate(TestRuleMarkFailure.java:44)
at org.junit.rules.RunRules.evaluate(RunRules.java:20)
at com.carrotsearch.randomizedtesting.rules.StatementAdapter.evaluate(StatementAdapter.java:36)
at com.carrotsearch.randomizedtesting.ThreadLeakControl$StatementRunner.run(ThreadLeakControl.java:390)
at com.carrotsearch.randomizedtesting.ThreadLeakControl.forkTimeoutingTask(ThreadLeakControl.java:843)
at com.carrotsearch.randomizedtesting.ThreadLeakControl$3.evaluate(ThreadLeakControl.java:490)
at com.carrotsearch.randomizedtesting.RandomizedRunner.runSingleTest(RandomizedRunner.java:955)
at com.carrotsearch.randomizedtesting.RandomizedRunner$5.evaluate(RandomizedRunner.java:840)
at com.carrotsearch.randomizedtesting.RandomizedRunner$6.evaluate(RandomizedRunner.java:891)
at com.carrotsearch.randomizedtesting.RandomizedRunner$7.evaluate(RandomizedRunner.java:902)
at com.carrotsearch.randomizedtesting.rules.StatementAdapter.evaluate(StatementAdapter.java:36)
at com.carrotsearch.randomizedtesting.rules.StatementAdapter.evaluate(StatementAdapter.java:36)
at org.apache.lucene.tests.util.AbstractBeforeAfterRule$1.evaluate(AbstractBeforeAfterRule.java:43)
at com.carrotsearch.randomizedtesting.rules.SystemPropertiesRestoreRule$1.evaluate(SystemPropertiesRestoreRule.java:80)
at org.junit.rules.RunRules.evaluate(RunRules.java:20)
at org.apache.lucene.tests.util.AbstractBeforeAfterRule$1.evaluate(AbstractBeforeAfterRule.java:43)
at com.carrotsearch.randomizedtesting.rules.StatementAdapter.evaluate(StatementAdapter.java:36)
at org.apache.lucene.tests.util.TestRuleStoreClassName$1.evaluate(TestRuleStoreClassName.java:38)
at com.carrotsearch.randomizedtesting.rules.NoShadowingOrOverridesOnMethodsRule$1.evaluate(NoShadowingOrOverridesOnMethodsRule.java:40)
at com.carrotsearch.randomizedtesting.rules.NoShadowingOrOverridesOnMethodsRule$1.evaluate(NoShadowingOrOverridesOnMethodsRule.java:40)
at com.carrotsearch.randomizedtesting.rules.StatementAdapter.evaluate(StatementAdapter.java:36)
at com.carrotsearch.randomizedtesting.rules.StatementAdapter.evaluate(StatementAdapter.java:36)
at org.apache.lucene.tests.util.TestRuleAssertionsRequired$1.evaluate(TestRuleAssertionsRequired.java:53)
at org.apache.lucene.tests.util.AbstractBeforeAfterRule$1.evaluate(AbstractBeforeAfterRule.java:43)
at org.apache.lucene.tests.util.TestRuleMarkFailure$1.evaluate(TestRuleMarkFailure.java:44)
at org.apache.lucene.tests.util.TestRuleIgnoreAfterMaxFailures$1.evaluate(TestRuleIgnoreAfterMaxFailures.java:60)
at org.apache.lucene.tests.util.TestRuleIgnoreTestSuites$1.evaluate(TestRuleIgnoreTestSuites.java:47)
at org.junit.rules.RunRules.evaluate(RunRules.java:20)
at com.carrotsearch.randomizedtesting.rules.StatementAdapter.evaluate(StatementAdapter.java:36)
at com.carrotsearch.randomizedtesting.ThreadLeakControl$StatementRunner.run(ThreadLeakControl.java:390)
at com.carrotsearch.randomizedtesting.ThreadLeakControl.lambda$forkTimeoutingTask$0(ThreadLeakControl.java:850)
... 1 more
org.apache.solr.client.solrj.impl.Http2SolrClient:org.apache.solr.common.util.ObjectReleaseTracker$ObjectTrackerException: org.apache.solr.client.solrj.impl.Http2SolrClient
at org.apache.solr.common.util.ObjectReleaseTracker.track(ObjectReleaseTracker.java:54)
at org.apache.solr.client.solrj.impl.Http2SolrClient.<init>(Http2SolrClient.java:174)
at org.apache.solr.client.solrj.impl.Http2SolrClient$Builder.build(Http2SolrClient.java:1078)
at org.apache.solr.handler.IndexFetcher.createSolrClient(IndexFetcher.java:261)
at org.apache.solr.handler.IndexFetcher.<init>(IndexFetcher.java:294)
at org.apache.solr.handler.ReplicationHandler.inform(ReplicationHandler.java:1239)
at org.apache.solr.core.SolrResourceLoader.inform(SolrResourceLoader.java:757)
at org.apache.solr.core.SolrCore.<init>(SolrCore.java:1176)
at org.apache.solr.core.SolrCore.<init>(SolrCore.java:1050)
at org.apache.solr.core.CoreContainer.createFromDescriptor(CoreContainer.java:1700)
at org.apache.solr.core.CoreContainer.lambda$loadInternal$9(CoreContainer.java:1048)
at com.codahale.metrics.InstrumentedExecutorService$InstrumentedRunnable.run(InstrumentedExecutorService.java:212)
at org.apache.solr.common.util.ExecutorUtil$MDCAwareThreadPoolExecutor.lambda$execute$0(ExecutorUtil.java:381)
at java.base/java.util.concurrent.ThreadPoolExecutor.runWorker(ThreadPoolExecutor.java:1095)
at java.base/java.util.concurrent.ThreadPoolExecutor$Worker.run(ThreadPoolExecutor.java:619)
at java.base/java.lang.Thread.run(Thread.java:1447)
Caused by: java.lang.Exception: Submitter stack trace
at org.apache.solr.common.util.ExecutorUtil$MDCAwareThreadPoolExecutor.execute(ExecutorUtil.java:348)
at com.codahale.metrics.InstrumentedExecutorService.execute(InstrumentedExecutorService.java:95)
at org.apache.solr.core.CoreContainer.loadInternal(CoreContainer.java:1037)
at org.apache.solr.core.CoreContainer.load(CoreContainer.java:736)
at org.apache.solr.servlet.CoreContainerProvider.createCoreContainer(CoreContainerProvider.java:396)
at org.apache.solr.servlet.CoreContainerProvider.init(CoreContainerProvider.java:219)
at org.apache.solr.servlet.CoreContainerProvider.contextInitialized(CoreContainerProvider.java:106)
at org.apache.solr.embedded.JettySolrRunner$1.contextInitialized(JettySolrRunner.java:391)
at org.eclipse.jetty.ee10.servlet.ServletContextHandler.callContextInitialized(ServletContextHandler.java:1591)
at org.eclipse.jetty.ee10.servlet.ServletContextHandler.contextInitialized(ServletContextHandler.java:500)
at org.eclipse.jetty.ee10.servlet.ServletHandler.initialize(ServletHandler.java:676)
at org.eclipse.jetty.ee10.servlet.ServletContextHandler.startContext(ServletContextHandler.java:1325)
at org.eclipse.jetty.ee10.servlet.ServletContextHandler.lambda$doStart$0(ServletContextHandler.java:1051)
at org.eclipse.jetty.server.handler.ContextHandler$ScopedContext.call(ContextHandler.java:1456)
at org.eclipse.jetty.ee10.servlet.ServletContextHandler.doStart(ServletContextHandler.java:1048)
at org.eclipse.jetty.util.component.AbstractLifeCycle.start(AbstractLifeCycle.java:93)
at org.eclipse.jetty.util.component.ContainerLifeCycle.start(ContainerLifeCycle.java:169)
at org.eclipse.jetty.util.component.ContainerLifeCycle.doStart(ContainerLifeCycle.java:120)
at org.eclipse.jetty.server.Handler$Abstract.doStart(Handler.java:491)
at org.eclipse.jetty.util.component.AbstractLifeCycle.start(AbstractLifeCycle.java:93)
at org.eclipse.jetty.util.component.ContainerLifeCycle.start(ContainerLifeCycle.java:169)
at org.eclipse.jetty.util.component.ContainerLifeCycle.doStart(ContainerLifeCycle.java:120)
at org.eclipse.jetty.server.Handler$Abstract.doStart(Handler.java:491)
at org.eclipse.jetty.server.handler.gzip.GzipHandler.doStart(GzipHandler.java:132)
at org.eclipse.jetty.util.component.AbstractLifeCycle.start(AbstractLifeCycle.java:93)
at org.eclipse.jetty.util.component.ContainerLifeCycle.start(ContainerLifeCycle.java:169)
at org.eclipse.jetty.util.component.ContainerLifeCycle.doStart(ContainerLifeCycle.java:120)
at org.eclipse.jetty.server.Handler$Abstract.doStart(Handler.java:491)
at org.eclipse.jetty.util.component.AbstractLifeCycle.start(AbstractLifeCycle.java:93)
at org.eclipse.jetty.util.component.ContainerLifeCycle.start(ContainerLifeCycle.java:169)
at org.eclipse.jetty.server.Server.start(Server.java:643)
at org.eclipse.jetty.util.component.ContainerLifeCycle.doStart(ContainerLifeCycle.java:120)
at org.eclipse.jetty.server.Handler$Abstract.doStart(Handler.java:491)
at org.eclipse.jetty.server.Server.doStart(Server.java:584)
at org.eclipse.jetty.util.component.AbstractLifeCycle.start(AbstractLifeCycle.java:93)
at org.apache.solr.embedded.JettySolrRunner.retryOnPortBindFailure(JettySolrRunner.java:582)
at org.apache.solr.embedded.JettySolrRunner.start(JettySolrRunner.java:528)
at org.apache.solr.embedded.JettySolrRunner.start(JettySolrRunner.java:499)
at org.apache.solr.handler.ReplicationTestHelper.createAndStartJetty(ReplicationTestHelper.java:73)
at org.apache.solr.handler.TestUserManagedReplicationWithAuth.setUp(TestUserManagedReplicationWithAuth.java:105)
at java.base/jdk.internal.reflect.DirectMethodHandleAccessor.invoke(DirectMethodHandleAccessor.java:104)
at java.base/java.lang.reflect.Method.invoke(Method.java:565)
at com.carrotsearch.randomizedtesting.RandomizedRunner.invoke(RandomizedRunner.java:1763)
at com.carrotsearch.randomizedtesting.RandomizedRunner$9.evaluate(RandomizedRunner.java:980)
at com.carrotsearch.randomizedtesting.RandomizedRunner$10.evaluate(RandomizedRunner.java:996)
at com.carrotsearch.randomizedtesting.rules.SystemPropertiesRestoreRule$1.evaluate(SystemPropertiesRestoreRule.java:80)
at org.junit.rules.RunRules.evaluate(RunRules.java:20)
at org.apache.lucene.tests.util.TestRuleSetupTeardownChained$1.evaluate(TestRuleSetupTeardownChained.java:48)
at org.apache.lucene.tests.util.AbstractBeforeAfterRule$1.evaluate(AbstractBeforeAfterRule.java:43)
at org.apache.lucene.tests.util.TestRuleThreadAndTestName$1.evaluate(TestRuleThreadAndTestName.java:45)
at org.apache.lucene.tests.util.TestRuleIgnoreAfterMaxFailures$1.evaluate(TestRuleIgnoreAfterMaxFailures.java:60)
at org.apache.lucene.tests.util.TestRuleMarkFailure$1.evaluate(TestRuleMarkFailure.java:44)
at org.junit.rules.RunRules.evaluate(RunRules.java:20)
at com.carrotsearch.randomizedtesting.rules.StatementAdapter.evaluate(StatementAdapter.java:36)
at com.carrotsearch.randomizedtesting.ThreadLeakControl$StatementRunner.run(ThreadLeakControl.java:390)
at com.carrotsearch.randomizedtesting.ThreadLeakControl.forkTimeoutingTask(ThreadLeakControl.java:843)
at com.carrotsearch.randomizedtesting.ThreadLeakControl$3.evaluate(ThreadLeakControl.java:490)
at com.carrotsearch.randomizedtesting.RandomizedRunner.runSingleTest(RandomizedRunner.java:955)
at com.carrotsearch.randomizedtesting.RandomizedRunner$5.evaluate(RandomizedRunner.java:840)
at com.carrotsearch.randomizedtesting.RandomizedRunner$6.evaluate(RandomizedRunner.java:891)
at com.carrotsearch.randomizedtesting.RandomizedRunner$7.evaluate(RandomizedRunner.java:902)
at com.carrotsearch.randomizedtesting.rules.StatementAdapter.evaluate(StatementAdapter.java:36)
at com.carrotsearch.randomizedtesting.rules.StatementAdapter.evaluate(StatementAdapter.java:36)
at org.apache.lucene.tests.util.AbstractBeforeAfterRule$1.evaluate(AbstractBeforeAfterRule.java:43)
at com.carrotsearch.randomizedtesting.rules.SystemPropertiesRestoreRule$1.evaluate(SystemPropertiesRestoreRule.java:80)
at org.junit.rules.RunRules.evaluate(RunRules.java:20)
at org.apache.lucene.tests.util.AbstractBeforeAfterRule$1.evaluate(AbstractBeforeAfterRule.java:43)
at com.carrotsearch.randomizedtesting.rules.StatementAdapter.evaluate(StatementAdapter.java:36)
at org.apache.lucene.tests.util.TestRuleStoreClassName$1.evaluate(TestRuleStoreClassName.java:38)
at com.carrotsearch.randomizedtesting.rules.NoShadowingOrOverridesOnMethodsRule$1.evaluate(NoShadowingOrOverridesOnMethodsRule.java:40)
at com.carrotsearch.randomizedtesting.rules.NoShadowingOrOverridesOnMethodsRule$1.evaluate(NoShadowingOrOverridesOnMethodsRule.java:40)
at com.carrotsearch.randomizedtesting.rules.StatementAdapter.evaluate(StatementAdapter.java:36)
at com.carrotsearch.randomizedtesting.rules.StatementAdapter.evaluate(StatementAdapter.java:36)
at org.apache.lucene.tests.util.TestRuleAssertionsRequired$1.evaluate(TestRuleAssertionsRequired.java:53)
at org.apache.lucene.tests.util.AbstractBeforeAfterRule$1.evaluate(AbstractBeforeAfterRule.java:43)
at org.apache.lucene.tests.util.TestRuleMarkFailure$1.evaluate(TestRuleMarkFailure.java:44)
at org.apache.lucene.tests.util.TestRuleIgnoreAfterMaxFailures$1.evaluate(TestRuleIgnoreAfterMaxFailures.java:60)
at org.apache.lucene.tests.util.TestRuleIgnoreTestSuites$1.evaluate(TestRuleIgnoreTestSuites.java:47)
at org.junit.rules.RunRules.evaluate(RunRules.java:20)
at com.carrotsearch.randomizedtesting.rules.StatementAdapter.evaluate(StatementAdapter.java:36)
at com.carrotsearch.randomizedtesting.ThreadLeakControl$StatementRunner.run(ThreadLeakControl.java:390)
at com.carrotsearch.randomizedtesting.ThreadLeakControl.lambda$forkTimeoutingTask$0(ThreadLeakControl.java:850)
... 1 more
org.apache.lucene.tests.store.MockDirectoryWrapper:org.apache.solr.common.util.ObjectReleaseTracker$ObjectTrackerException: org.apache.lucene.tests.store.MockDirectoryWrapper
at org.apache.solr.common.util.ObjectReleaseTracker.track(ObjectReleaseTracker.java:54)
at org.apache.solr.core.CachingDirectoryFactory.get(CachingDirectoryFactory.java:405)
at org.apache.solr.update.SolrIndexWriter.create(SolrIndexWriter.java:108)
at org.apache.solr.core.SolrCore.initIndex(SolrCore.java:900)
at org.apache.solr.core.SolrCore.<init>(SolrCore.java:1127)
at org.apache.solr.core.SolrCore.<init>(SolrCore.java:1050)
at org.apache.solr.core.CoreContainer.createFromDescriptor(CoreContainer.java:1700)
at org.apache.solr.core.CoreContainer.lambda$loadInternal$9(CoreContainer.java:1048)
at com.codahale.metrics.InstrumentedExecutorService$InstrumentedRunnable.run(InstrumentedExecutorService.java:212)
at org.apache.solr.common.util.ExecutorUtil$MDCAwareThreadPoolExecutor.lambda$execute$0(ExecutorUtil.java:381)
at java.base/java.util.concurrent.ThreadPoolExecutor.runWorker(ThreadPoolExecutor.java:1095)
at java.base/java.util.concurrent.ThreadPoolExecutor$Worker.run(ThreadPoolExecutor.java:619)
at java.base/java.lang.Thread.run(Thread.java:1447)
Caused by: java.lang.Exception: Submitter stack trace
at org.apache.solr.common.util.ExecutorUtil$MDCAwareThreadPoolExecutor.execute(ExecutorUtil.java:348)
at com.codahale.metrics.InstrumentedExecutorService.execute(InstrumentedExecutorService.java:95)
at org.apache.solr.core.CoreContainer.loadInternal(CoreContainer.java:1037)
at org.apache.solr.core.CoreContainer.load(CoreContainer.java:736)
at org.apache.solr.servlet.CoreContainerProvider.createCoreContainer(CoreContainerProvider.java:396)
at org.apache.solr.servlet.CoreContainerProvider.init(CoreContainerProvider.java:219)
at org.apache.solr.servlet.CoreContainerProvider.contextInitialized(CoreContainerProvider.java:106)
at org.apache.solr.embedded.JettySolrRunner$1.contextInitialized(JettySolrRunner.java:391)
at org.eclipse.jetty.ee10.servlet.ServletContextHandler.callContextInitialized(ServletContextHandler.java:1591)
at org.eclipse.jetty.ee10.servlet.ServletContextHandler.contextInitialized(ServletContextHandler.java:500)
at org.eclipse.jetty.ee10.servlet.ServletHandler.initialize(ServletHandler.java:676)
at org.eclipse.jetty.ee10.servlet.ServletContextHandler.startContext(ServletContextHandler.java:1325)
at org.eclipse.jetty.ee10.servlet.ServletContextHandler.lambda$doStart$0(ServletContextHandler.java:1051)
at org.eclipse.jetty.server.handler.ContextHandler$ScopedContext.call(ContextHandler.java:1456)
at org.eclipse.jetty.ee10.servlet.ServletContextHandler.doStart(ServletContextHandler.java:1048)
at org.eclipse.jetty.util.component.AbstractLifeCycle.start(AbstractLifeCycle.java:93)
at org.eclipse.jetty.util.component.ContainerLifeCycle.start(ContainerLifeCycle.java:169)
at org.eclipse.jetty.util.component.ContainerLifeCycle.doStart(ContainerLifeCycle.java:120)
at org.eclipse.jetty.server.Handler$Abstract.doStart(Handler.java:491)
at org.eclipse.jetty.util.component.AbstractLifeCycle.start(AbstractLifeCycle.java:93)
at org.eclipse.jetty.util.component.ContainerLifeCycle.start(ContainerLifeCycle.java:169)
at org.eclipse.jetty.util.component.ContainerLifeCycle.doStart(ContainerLifeCycle.java:120)
at org.eclipse.jetty.server.Handler$Abstract.doStart(Handler.java:491)
at org.eclipse.jetty.server.handler.gzip.GzipHandler.doStart(GzipHandler.java:132)
at org.eclipse.jetty.util.component.AbstractLifeCycle.start(AbstractLifeCycle.java:93)
at org.eclipse.jetty.util.component.ContainerLifeCycle.start(ContainerLifeCycle.java:169)
at org.eclipse.jetty.util.component.ContainerLifeCycle.doStart(ContainerLifeCycle.java:120)
at org.eclipse.jetty.server.Handler$Abstract.doStart(Handler.java:491)
at org.eclipse.jetty.util.component.AbstractLifeCycle.start(AbstractLifeCycle.java:93)
at org.eclipse.jetty.util.component.ContainerLifeCycle.start(ContainerLifeCycle.java:169)
at org.eclipse.jetty.server.Server.start(Server.java:643)
at org.eclipse.jetty.util.component.ContainerLifeCycle.doStart(ContainerLifeCycle.java:120)
at org.eclipse.jetty.server.Handler$Abstract.doStart(Handler.java:491)
at org.eclipse.jetty.server.Server.doStart(Server.java:584)
at org.eclipse.jetty.util.component.AbstractLifeCycle.start(AbstractLifeCycle.java:93)
at org.apache.solr.embedded.JettySolrRunner.retryOnPortBindFailure(JettySolrRunner.java:582)
at org.apache.solr.embedded.JettySolrRunner.start(JettySolrRunner.java:528)
at org.apache.solr.embedded.JettySolrRunner.start(JettySolrRunner.java:499)
at org.apache.solr.handler.ReplicationTestHelper.createAndStartJetty(ReplicationTestHelper.java:73)
at org.apache.solr.handler.TestUserManagedReplicationWithAuth.setUp(TestUserManagedReplicationWithAuth.java:105)
at java.base/jdk.internal.reflect.DirectMethodHandleAccessor.invoke(DirectMethodHandleAccessor.java:104)
at java.base/java.lang.reflect.Method.invoke(Method.java:565)
at com.carrotsearch.randomizedtesting.RandomizedRunner.invoke(RandomizedRunner.java:1763)
at com.carrotsearch.randomizedtesting.RandomizedRunner$9.evaluate(RandomizedRunner.java:980)
at com.carrotsearch.randomizedtesting.RandomizedRunner$10.evaluate(RandomizedRunner.java:996)
at com.carrotsearch.randomizedtesting.rules.SystemPropertiesRestoreRule$1.evaluate(SystemPropertiesRestoreRule.java:80)
at org.junit.rules.RunRules.evaluate(RunRules.java:20)
at org.apache.lucene.tests.util.TestRuleSetupTeardownChained$1.evaluate(TestRuleSetupTeardownChained.java:48)
at org.apache.lucene.tests.util.AbstractBeforeAfterRule$1.evaluate(AbstractBeforeAfterRule.java:43)
at org.apache.lucene.tests.util.TestRuleThreadAndTestName$1.evaluate(TestRuleThreadAndTestName.java:45)
at org.apache.lucene.tests.util.TestRuleIgnoreAfterMaxFailures$1.evaluate(TestRuleIgnoreAfterMaxFailures.java:60)
at org.apache.lucene.tests.util.TestRuleMarkFailure$1.evaluate(TestRuleMarkFailure.java:44)
at org.junit.rules.RunRules.evaluate(RunRules.java:20)
at com.carrotsearch.randomizedtesting.rules.StatementAdapter.evaluate(StatementAdapter.java:36)
at com.carrotsearch.randomizedtesting.ThreadLeakControl$StatementRunner.run(ThreadLeakControl.java:390)
at com.carrotsearch.randomizedtesting.ThreadLeakControl.forkTimeoutingTask(ThreadLeakControl.java:843)
at com.carrotsearch.randomizedtesting.ThreadLeakControl$3.evaluate(ThreadLeakControl.java:490)
at com.carrotsearch.randomizedtesting.RandomizedRunner.runSingleTest(RandomizedRunner.java:955)
at com.carrotsearch.randomizedtesting.RandomizedRunner$5.evaluate(RandomizedRunner.java:840)
at com.carrotsearch.randomizedtesting.RandomizedRunner$6.evaluate(RandomizedRunner.java:891)
at com.carrotsearch.randomizedtesting.RandomizedRunner$7.evaluate(RandomizedRunner.java:902)
at com.carrotsearch.randomizedtesting.rules.StatementAdapter.evaluate(StatementAdapter.java:36)
at com.carrotsearch.randomizedtesting.rules.StatementAdapter.evaluate(StatementAdapter.java:36)
at org.apache.lucene.tests.util.AbstractBeforeAfterRule$1.evaluate(AbstractBeforeAfterRule.java:43)
at com.carrotsearch.randomizedtesting.rules.SystemPropertiesRestoreRule$1.evaluate(SystemPropertiesRestoreRule.java:80)
at org.junit.rules.RunRules.evaluate(RunRules.java:20)
at org.apache.lucene.tests.util.AbstractBeforeAfterRule$1.evaluate(AbstractBeforeAfterRule.java:43)
at com.carrotsearch.randomizedtesting.rules.StatementAdapter.evaluate(StatementAdapter.java:36)
at org.apache.lucene.tests.util.TestRuleStoreClassName$1.evaluate(TestRuleStoreClassName.java:38)
at com.carrotsearch.randomizedtesting.rules.NoShadowingOrOverridesOnMethodsRule$1.evaluate(NoShadowingOrOverridesOnMethodsRule.java:40)
at com.carrotsearch.randomizedtesting.rules.NoShadowingOrOverridesOnMethodsRule$1.evaluate(NoShadowingOrOverridesOnMethodsRule.java:40)
at com.carrotsearch.randomizedtesting.rules.StatementAdapter.evaluate(StatementAdapter.java:36)
at com.carrotsearch.randomizedtesting.rules.StatementAdapter.evaluate(StatementAdapter.java:36)
at org.apache.lucene.tests.util.TestRuleAssertionsRequired$1.evaluate(TestRuleAssertionsRequired.java:53)
at org.apache.lucene.tests.util.AbstractBeforeAfterRule$1.evaluate(AbstractBeforeAfterRule.java:43)
at org.apache.lucene.tests.util.TestRuleMarkFailure$1.evaluate(TestRuleMarkFailure.java:44)
at org.apache.lucene.tests.util.TestRuleIgnoreAfterMaxFailures$1.evaluate(TestRuleIgnoreAfterMaxFailures.java:60)
at org.apache.lucene.tests.util.TestRuleIgnoreTestSuites$1.evaluate(TestRuleIgnoreTestSuites.java:47)
at org.junit.rules.RunRules.evaluate(RunRules.java:20)
at com.carrotsearch.randomizedtesting.rules.StatementAdapter.evaluate(StatementAdapter.java:36)
at com.carrotsearch.randomizedtesting.ThreadLeakControl$StatementRunner.run(ThreadLeakControl.java:390)
at com.carrotsearch.randomizedtesting.ThreadLeakControl.lambda$forkTimeoutingTask$0(ThreadLeakControl.java:850)
... 1 more
org.apache.lucene.tests.store.MockDirectoryWrapper:org.apache.solr.common.util.ObjectReleaseTracker$ObjectTrackerException: org.apache.lucene.tests.store.MockDirectoryWrapper
at org.apache.solr.common.util.ObjectReleaseTracker.track(ObjectReleaseTracker.java:54)
at org.apache.solr.core.CachingDirectoryFactory.get(CachingDirectoryFactory.java:405)
at org.apache.solr.core.SolrCore.initSnapshotMetaDataManager(SolrCore.java:606)
at org.apache.solr.core.SolrCore.<init>(SolrCore.java:1123)
at org.apache.solr.core.SolrCore.<init>(SolrCore.java:1050)
at org.apache.solr.core.CoreContainer.createFromDescriptor(CoreContainer.java:1700)
at org.apache.solr.core.CoreContainer.lambda$loadInternal$9(CoreContainer.java:1048)
at com.codahale.metrics.InstrumentedExecutorService$InstrumentedRunnable.run(InstrumentedExecutorService.java:212)
at org.apache.solr.common.util.ExecutorUtil$MDCAwareThreadPoolExecutor.lambda$execute$0(ExecutorUtil.java:381)
at java.base/java.util.concurrent.ThreadPoolExecutor.runWorker(ThreadPoolExecutor.java:1095)
at java.base/java.util.concurrent.ThreadPoolExecutor$Worker.run(ThreadPoolExecutor.java:619)
at java.base/java.lang.Thread.run(Thread.java:1447)
Caused by: java.lang.Exception: Submitter stack trace
at org.apache.solr.common.util.ExecutorUtil$MDCAwareThreadPoolExecutor.execute(ExecutorUtil.java:348)
at com.codahale.metrics.InstrumentedExecutorService.execute(InstrumentedExecutorService.java:95)
at org.apache.solr.core.CoreContainer.loadInternal(CoreContainer.java:1037)
at org.apache.solr.core.CoreContainer.load(CoreContainer.java:736)
at org.apache.solr.servlet.CoreContainerProvider.createCoreContainer(CoreContainerProvider.java:396)
at org.apache.solr.servlet.CoreContainerProvider.init(CoreContainerProvider.java:219)
at org.apache.solr.servlet.CoreContainerProvider.contextInitialized(CoreContainerProvider.java:106)
at org.apache.solr.embedded.JettySolrRunner$1.contextInitialized(JettySolrRunner.java:391)
at org.eclipse.jetty.ee10.servlet.ServletContextHandler.callContextInitialized(ServletContextHandler.java:1591)
at org.eclipse.jetty.ee10.servlet.ServletContextHandler.contextInitialized(ServletContextHandler.java:500)
at org.eclipse.jetty.ee10.servlet.ServletHandler.initialize(ServletHandler.java:676)
at org.eclipse.jetty.ee10.servlet.ServletContextHandler.startContext(ServletContextHandler.java:1325)
at org.eclipse.jetty.ee10.servlet.ServletContextHandler.lambda$doStart$0(ServletContextHandler.java:1051)
at org.eclipse.jetty.server.handler.ContextHandler$ScopedContext.call(ContextHandler.java:1456)
at org.eclipse.jetty.ee10.servlet.ServletContextHandler.doStart(ServletContextHandler.java:1048)
at org.eclipse.jetty.util.component.AbstractLifeCycle.start(AbstractLifeCycle.java:93)
at org.eclipse.jetty.util.component.ContainerLifeCycle.start(ContainerLifeCycle.java:169)
at org.eclipse.jetty.util.component.ContainerLifeCycle.doStart(ContainerLifeCycle.java:120)
at org.eclipse.jetty.server.Handler$Abstract.doStart(Handler.java:491)
at org.eclipse.jetty.util.component.AbstractLifeCycle.start(AbstractLifeCycle.java:93)
at org.eclipse.jetty.util.component.ContainerLifeCycle.start(ContainerLifeCycle.java:169)
at org.eclipse.jetty.util.component.ContainerLifeCycle.doStart(ContainerLifeCycle.java:120)
at org.eclipse.jetty.server.Handler$Abstract.doStart(Handler.java:491)
at org.eclipse.jetty.server.handler.gzip.GzipHandler.doStart(GzipHandler.java:132)
at org.eclipse.jetty.util.component.AbstractLifeCycle.start(AbstractLifeCycle.java:93)
at org.eclipse.jetty.util.component.ContainerLifeCycle.start(ContainerLifeCycle.java:169)
at org.eclipse.jetty.util.component.ContainerLifeCycle.doStart(ContainerLifeCycle.java:120)
at org.eclipse.jetty.server.Handler$Abstract.doStart(Handler.java:491)
at org.eclipse.jetty.util.component.AbstractLifeCycle.start(AbstractLifeCycle.java:93)
at org.eclipse.jetty.util.component.ContainerLifeCycle.start(ContainerLifeCycle.java:169)
at org.eclipse.jetty.server.Server.start(Server.java:643)
at org.eclipse.jetty.util.component.ContainerLifeCycle.doStart(ContainerLifeCycle.java:120)
at org.eclipse.jetty.server.Handler$Abstract.doStart(Handler.java:491)
at org.eclipse.jetty.server.Server.doStart(Server.java:584)
at org.eclipse.jetty.util.component.AbstractLifeCycle.start(AbstractLifeCycle.java:93)
at org.apache.solr.embedded.JettySolrRunner.retryOnPortBindFailure(JettySolrRunner.java:582)
at org.apache.solr.embedded.JettySolrRunner.start(JettySolrRunner.java:528)
at org.apache.solr.embedded.JettySolrRunner.start(JettySolrRunner.java:499)
at org.apache.solr.handler.ReplicationTestHelper.createAndStartJetty(ReplicationTestHelper.java:73)
at org.apache.solr.handler.TestUserManagedReplicationWithAuth.setUp(TestUserManagedReplicationWithAuth.java:105)
at java.base/jdk.internal.reflect.DirectMethodHandleAccessor.invoke(DirectMethodHandleAccessor.java:104)
at java.base/java.lang.reflect.Method.invoke(Method.java:565)
at com.carrotsearch.randomizedtesting.RandomizedRunner.invoke(RandomizedRunner.java:1763)
at com.carrotsearch.randomizedtesting.RandomizedRunner$9.evaluate(RandomizedRunner.java:980)
at com.carrotsearch.randomizedtesting.RandomizedRunner$10.evaluate(RandomizedRunner.java:996)
at com.carrotsearch.randomizedtesting.rules.SystemPropertiesRestoreRule$1.evaluate(SystemPropertiesRestoreRule.java:80)
at org.junit.rules.RunRules.evaluate(RunRules.java:20)
at org.apache.lucene.tests.util.TestRuleSetupTeardownChained$1.evaluate(TestRuleSetupTeardownChained.java:48)
at org.apache.lucene.tests.util.AbstractBeforeAfterRule$1.evaluate(AbstractBeforeAfterRule.java:43)
at org.apache.lucene.tests.util.TestRuleThreadAndTestName$1.evaluate(TestRuleThreadAndTestName.java:45)
at org.apache.lucene.tests.util.TestRuleIgnoreAfterMaxFailures$1.evaluate(TestRuleIgnoreAfterMaxFailures.java:60)
at org.apache.lucene.tests.util.TestRuleMarkFailure$1.evaluate(TestRuleMarkFailure.java:44)
at org.junit.rules.RunRules.evaluate(RunRules.java:20)
at com.carrotsearch.randomizedtesting.rules.StatementAdapter.evaluate(StatementAdapter.java:36)
at com.carrotsearch.randomizedtesting.ThreadLeakControl$StatementRunner.run(ThreadLeakControl.java:390)
at com.carrotsearch.randomizedtesting.ThreadLeakControl.forkTimeoutingTask(ThreadLeakControl.java:843)
at com.carrotsearch.randomizedtesting.ThreadLeakControl$3.evaluate(ThreadLeakControl.java:490)
at com.carrotsearch.randomizedtesting.RandomizedRunner.runSingleTest(RandomizedRunner.java:955)
at com.carrotsearch.randomizedtesting.RandomizedRunner$5.evaluate(RandomizedRunner.java:840)
at com.carrotsearch.randomizedtesting.RandomizedRunner$6.evaluate(RandomizedRunner.java:891)
at com.carrotsearch.randomizedtesting.RandomizedRunner$7.evaluate(RandomizedRunner.java:902)
at com.carrotsearch.randomizedtesting.rules.StatementAdapter.evaluate(StatementAdapter.java:36)
at com.carrotsearch.randomizedtesting.rules.StatementAdapter.evaluate(StatementAdapter.java:36)
at org.apache.lucene.tests.util.AbstractBeforeAfterRule$1.evaluate(AbstractBeforeAfterRule.java:43)
at com.carrotsearch.randomizedtesting.rules.SystemPropertiesRestoreRule$1.evaluate(SystemPropertiesRestoreRule.java:80)
at org.junit.rules.RunRules.evaluate(RunRules.java:20)
at org.apache.lucene.tests.util.AbstractBeforeAfterRule$1.evaluate(AbstractBeforeAfterRule.java:43)
at com.carrotsearch.randomizedtesting.rules.StatementAdapter.evaluate(StatementAdapter.java:36)
at org.apache.lucene.tests.util.TestRuleStoreClassName$1.evaluate(TestRuleStoreClassName.java:38)
at com.carrotsearch.randomizedtesting.rules.NoShadowingOrOverridesOnMethodsRule$1.evaluate(NoShadowingOrOverridesOnMethodsRule.java:40)
at com.carrotsearch.randomizedtesting.rules.NoShadowingOrOverridesOnMethodsRule$1.evaluate(NoShadowingOrOverridesOnMethodsRule.java:40)
at com.carrotsearch.randomizedtesting.rules.StatementAdapter.evaluate(StatementAdapter.java:36)
at com.carrotsearch.randomizedtesting.rules.StatementAdapter.evaluate(StatementAdapter.java:36)
at org.apache.lucene.tests.util.TestRuleAssertionsRequired$1.evaluate(TestRuleAssertionsRequired.java:53)
at org.apache.lucene.tests.util.AbstractBeforeAfterRule$1.evaluate(AbstractBeforeAfterRule.java:43)
at org.apache.lucene.tests.util.TestRuleMarkFailure$1.evaluate(TestRuleMarkFailure.java:44)
at org.apache.lucene.tests.util.TestRuleIgnoreAfterMaxFailures$1.evaluate(TestRuleIgnoreAfterMaxFailures.java:60)
at org.apache.lucene.tests.util.TestRuleIgnoreTestSuites$1.evaluate(TestRuleIgnoreTestSuites.java:47)
at org.junit.rules.RunRules.evaluate(RunRules.java:20)
at com.carrotsearch.randomizedtesting.rules.StatementAdapter.evaluate(StatementAdapter.java:36)
at com.carrotsearch.randomizedtesting.ThreadLeakControl$StatementRunner.run(ThreadLeakControl.java:390)
at com.carrotsearch.randomizedtesting.ThreadLeakControl.lambda$forkTimeoutingTask$0(ThreadLeakControl.java:850)
... 1 more
org.apache.lucene.tests.store.MockDirectoryWrapper:org.apache.solr.common.util.ObjectReleaseTracker$ObjectTrackerException: org.apache.lucene.tests.store.MockDirectoryWrapper
at org.apache.solr.common.util.ObjectReleaseTracker.track(ObjectReleaseTracker.java:54)
at org.apache.solr.core.CachingDirectoryFactory.get(CachingDirectoryFactory.java:405)
at org.apache.solr.core.SolrCore.getNewIndexDir(SolrCore.java:411)
at org.apache.solr.core.SolrCore.initIndex(SolrCore.java:861)
at org.apache.solr.core.SolrCore.<init>(SolrCore.java:1127)
at org.apache.solr.core.SolrCore.<init>(SolrCore.java:1050)
at org.apache.solr.core.CoreContainer.createFromDescriptor(CoreContainer.java:1700)
at org.apache.solr.core.CoreContainer.lambda$loadInternal$9(CoreContainer.java:1048)
at com.codahale.metrics.InstrumentedExecutorService$InstrumentedRunnable.run(InstrumentedExecutorService.java:212)
at org.apache.solr.common.util.ExecutorUtil$MDCAwareThreadPoolExecutor.lambda$execute$0(ExecutorUtil.java:381)
at java.base/java.util.concurrent.ThreadPoolExecutor.runWorker(ThreadPoolExecutor.java:1095)
at java.base/java.util.concurrent.ThreadPoolExecutor$Worker.run(ThreadPoolExecutor.java:619)
at java.base/java.lang.Thread.run(Thread.java:1447)
Caused by: java.lang.Exception: Submitter stack trace
at org.apache.solr.common.util.ExecutorUtil$MDCAwareThreadPoolExecutor.execute(ExecutorUtil.java:348)
at com.codahale.metrics.InstrumentedExecutorService.execute(InstrumentedExecutorService.java:95)
at org.apache.solr.core.CoreContainer.loadInternal(CoreContainer.java:1037)
at org.apache.solr.core.CoreContainer.load(CoreContainer.java:736)
at org.apache.solr.servlet.CoreContainerProvider.createCoreContainer(CoreContainerProvider.java:396)
at org.apache.solr.servlet.CoreContainerProvider.init(CoreContainerProvider.java:219)
at org.apache.solr.servlet.CoreContainerProvider.contextInitialized(CoreContainerProvider.java:106)
at org.apache.solr.embedded.JettySolrRunner$1.contextInitialized(JettySolrRunner.java:391)
at org.eclipse.jetty.ee10.servlet.ServletContextHandler.callContextInitialized(ServletContextHandler.java:1591)
at org.eclipse.jetty.ee10.servlet.ServletContextHandler.contextInitialized(ServletContextHandler.java:500)
at org.eclipse.jetty.ee10.servlet.ServletHandler.initialize(ServletHandler.java:676)
at org.eclipse.jetty.ee10.servlet.ServletContextHandler.startContext(ServletContextHandler.java:1325)
at org.eclipse.jetty.ee10.servlet.ServletContextHandler.lambda$doStart$0(ServletContextHandler.java:1051)
at org.eclipse.jetty.server.handler.ContextHandler$ScopedContext.call(ContextHandler.java:1456)
at org.eclipse.jetty.ee10.servlet.ServletContextHandler.doStart(ServletContextHandler.java:1048)
at org.eclipse.jetty.util.component.AbstractLifeCycle.start(AbstractLifeCycle.java:93)
at org.eclipse.jetty.util.component.ContainerLifeCycle.start(ContainerLifeCycle.java:169)
at org.eclipse.jetty.util.component.ContainerLifeCycle.doStart(ContainerLifeCycle.java:120)
at org.eclipse.jetty.server.Handler$Abstract.doStart(Handler.java:491)
at org.eclipse.jetty.util.component.AbstractLifeCycle.start(AbstractLifeCycle.java:93)
at org.eclipse.jetty.util.component.ContainerLifeCycle.start(ContainerLifeCycle.java:169)
at org.eclipse.jetty.util.component.ContainerLifeCycle.doStart(ContainerLifeCycle.java:120)
at org.eclipse.jetty.server.Handler$Abstract.doStart(Handler.java:491)
at org.eclipse.jetty.server.handler.gzip.GzipHandler.doStart(GzipHandler.java:132)
at org.eclipse.jetty.util.component.AbstractLifeCycle.start(AbstractLifeCycle.java:93)
at org.eclipse.jetty.util.component.ContainerLifeCycle.start(ContainerLifeCycle.java:169)
at org.eclipse.jetty.util.component.ContainerLifeCycle.doStart(ContainerLifeCycle.java:120)
at org.eclipse.jetty.server.Handler$Abstract.doStart(Handler.java:491)
at org.eclipse.jetty.util.component.AbstractLifeCycle.start(AbstractLifeCycle.java:93)
at org.eclipse.jetty.util.component.ContainerLifeCycle.start(ContainerLifeCycle.java:169)
at org.eclipse.jetty.server.Server.start(Server.java:643)
at org.eclipse.jetty.util.component.ContainerLifeCycle.doStart(ContainerLifeCycle.java:120)
at org.eclipse.jetty.server.Handler$Abstract.doStart(Handler.java:491)
at org.eclipse.jetty.server.Server.doStart(Server.java:584)
at org.eclipse.jetty.util.component.AbstractLifeCycle.start(AbstractLifeCycle.java:93)
at org.apache.solr.embedded.JettySolrRunner.retryOnPortBindFailure(JettySolrRunner.java:582)
at org.apache.solr.embedded.JettySolrRunner.start(JettySolrRunner.java:528)
at org.apache.solr.embedded.JettySolrRunner.start(JettySolrRunner.java:499)
at org.apache.solr.handler.ReplicationTestHelper.createAndStartJetty(ReplicationTestHelper.java:73)
at org.apache.solr.handler.TestUserManagedReplicationWithAuth.setUp(TestUserManagedReplicationWithAuth.java:105)
at java.base/jdk.internal.reflect.DirectMethodHandleAccessor.invoke(DirectMethodHandleAccessor.java:104)
at java.base/java.lang.reflect.Method.invoke(Method.java:565)
at com.carrotsearch.randomizedtesting.RandomizedRunner.invoke(RandomizedRunner.java:1763)
at com.carrotsearch.randomizedtesting.RandomizedRunner$9.evaluate(RandomizedRunner.java:980)
at com.carrotsearch.randomizedtesting.RandomizedRunner$10.evaluate(RandomizedRunner.java:996)
at com.carrotsearch.randomizedtesting.rules.SystemPropertiesRestoreRule$1.evaluate(SystemPropertiesRestoreRule.java:80)
at org.junit.rules.RunRules.evaluate(RunRules.java:20)
at org.apache.lucene.tests.util.TestRuleSetupTeardownChained$1.evaluate(TestRuleSetupTeardownChained.java:48)
at org.apache.lucene.tests.util.AbstractBeforeAfterRule$1.evaluate(AbstractBeforeAfterRule.java:43)
at org.apache.lucene.tests.util.TestRuleThreadAndTestName$1.evaluate(TestRuleThreadAndTestName.java:45)
at org.apache.lucene.tests.util.TestRuleIgnoreAfterMaxFailures$1.evaluate(TestRuleIgnoreAfterMaxFailures.java:60)
at org.apache.lucene.tests.util.TestRuleMarkFailure$1.evaluate(TestRuleMarkFailure.java:44)
at org.junit.rules.RunRules.evaluate(RunRules.java:20)
at com.carrotsearch.randomizedtesting.rules.StatementAdapter.evaluate(StatementAdapter.java:36)
at com.carrotsearch.randomizedtesting.ThreadLeakControl$StatementRunner.run(ThreadLeakControl.java:390)
at com.carrotsearch.randomizedtesting.ThreadLeakControl.forkTimeoutingTask(ThreadLeakControl.java:843)
at com.carrotsearch.randomizedtesting.ThreadLeakControl$3.evaluate(ThreadLeakControl.java:490)
at com.carrotsearch.randomizedtesting.RandomizedRunner.runSingleTest(RandomizedRunner.java:955)
at com.carrotsearch.randomizedtesting.RandomizedRunner$5.evaluate(RandomizedRunner.java:840)
at com.carrotsearch.randomizedtesting.RandomizedRunner$6.evaluate(RandomizedRunner.java:891)
at com.carrotsearch.randomizedtesting.RandomizedRunner$7.evaluate(RandomizedRunner.java:902)
at com.carrotsearch.randomizedtesting.rules.StatementAdapter.evaluate(StatementAdapter.java:36)
at com.carrotsearch.randomizedtesting.rules.StatementAdapter.evaluate(StatementAdapter.java:36)
at org.apache.lucene.tests.util.AbstractBeforeAfterRule$1.evaluate(AbstractBeforeAfterRule.java:43)
at com.carrotsearch.randomizedtesting.rules.SystemPropertiesRestoreRule$1.evaluate(SystemPropertiesRestoreRule.java:80)
at org.junit.rules.RunRules.evaluate(RunRules.java:20)
at org.apache.lucene.tests.util.AbstractBeforeAfterRule$1.evaluate(AbstractBeforeAfterRule.java:43)
at com.carrotsearch.randomizedtesting.rules.StatementAdapter.evaluate(StatementAdapter.java:36)
at org.apache.lucene.tests.util.TestRuleStoreClassName$1.evaluate(TestRuleStoreClassName.java:38)
at com.carrotsearch.randomizedtesting.rules.NoShadowingOrOverridesOnMethodsRule$1.evaluate(NoShadowingOrOverridesOnMethodsRule.java:40)
at com.carrotsearch.randomizedtesting.rules.NoShadowingOrOverridesOnMethodsRule$1.evaluate(NoShadowingOrOverridesOnMethodsRule.java:40)
at com.carrotsearch.randomizedtesting.rules.StatementAdapter.evaluate(StatementAdapter.java:36)
at com.carrotsearch.randomizedtesting.rules.StatementAdapter.evaluate(StatementAdapter.java:36)
at org.apache.lucene.tests.util.TestRuleAssertionsRequired$1.evaluate(TestRuleAssertionsRequired.java:53)
at org.apache.lucene.tests.util.AbstractBeforeAfterRule$1.evaluate(AbstractBeforeAfterRule.java:43)
at org.apache.lucene.tests.util.TestRuleMarkFailure$1.evaluate(TestRuleMarkFailure.java:44)
at org.apache.lucene.tests.util.TestRuleIgnoreAfterMaxFailures$1.evaluate(TestRuleIgnoreAfterMaxFailures.java:60)
at org.apache.lucene.tests.util.TestRuleIgnoreTestSuites$1.evaluate(TestRuleIgnoreTestSuites.java:47)
at org.junit.rules.RunRules.evaluate(RunRules.java:20)
at com.carrotsearch.randomizedtesting.rules.StatementAdapter.evaluate(StatementAdapter.java:36)
at com.carrotsearch.randomizedtesting.ThreadLeakControl$StatementRunner.run(ThreadLeakControl.java:390)
at com.carrotsearch.randomizedtesting.ThreadLeakControl.lambda$forkTimeoutingTask$0(ThreadLeakControl.java:850)
... 1 more
>
Stack Trace:
java.lang.AssertionError: ObjectTracker found 5 object(s) that were not released!!! [SolrCore, Http2SolrClient, MockDirectoryWrapper, MockDirectoryWrapper, MockDirectoryWrapper]
org.apache.solr.core.SolrCore:org.apache.solr.common.util.ObjectReleaseTracker$ObjectTrackerException: org.apache.solr.core.SolrCore
at org.apache.solr.common.util.ObjectReleaseTracker.track(ObjectReleaseTracker.java:54)
at org.apache.solr.core.SolrCore.<init>(SolrCore.java:1227)
at org.apache.solr.core.SolrCore.<init>(SolrCore.java:1050)
at org.apache.solr.core.CoreContainer.createFromDescriptor(CoreContainer.java:1700)
at org.apache.solr.core.CoreContainer.lambda$loadInternal$9(CoreContainer.java:1048)
at com.codahale.metrics.InstrumentedExecutorService$InstrumentedRunnable.run(InstrumentedExecutorService.java:212)
at org.apache.solr.common.util.ExecutorUtil$MDCAwareThreadPoolExecutor.lambda$execute$0(ExecutorUtil.java:381)
at java.base/java.util.concurrent.ThreadPoolExecutor.runWorker(ThreadPoolExecutor.java:1095)
at java.base/java.util.concurrent.ThreadPoolExecutor$Worker.run(ThreadPoolExecutor.java:619)
at java.base/java.lang.Thread.run(Thread.java:1447)
Caused by: java.lang.Exception: Submitter stack trace
at org.apache.solr.common.util.ExecutorUtil$MDCAwareThreadPoolExecutor.execute(ExecutorUtil.java:348)
at com.codahale.metrics.InstrumentedExecutorService.execute(InstrumentedExecutorService.java:95)
at org.apache.solr.core.CoreContainer.loadInternal(CoreContainer.java:1037)
at org.apache.solr.core.CoreContainer.load(CoreContainer.java:736)
at org.apache.solr.servlet.CoreContainerProvider.createCoreContainer(CoreContainerProvider.java:396)
at org.apache.solr.servlet.CoreContainerProvider.init(CoreContainerProvider.java:219)
at org.apache.solr.servlet.CoreContainerProvider.contextInitialized(CoreContainerProvider.java:106)
at org.apache.solr.embedded.JettySolrRunner$1.contextInitialized(JettySolrRunner.java:391)
at org.eclipse.jetty.ee10.servlet.ServletContextHandler.callContextInitialized(ServletContextHandler.java:1591)
at org.eclipse.jetty.ee10.servlet.ServletContextHandler.contextInitialized(ServletContextHandler.java:500)
at org.eclipse.jetty.ee10.servlet.ServletHandler.initialize(ServletHandler.java:676)
at org.eclipse.jetty.ee10.servlet.ServletContextHandler.startContext(ServletContextHandler.java:1325)
at org.eclipse.jetty.ee10.servlet.ServletContextHandler.lambda$doStart$0(ServletContextHandler.java:1051)
at org.eclipse.jetty.server.handler.ContextHandler$ScopedContext.call(ContextHandler.java:1456)
at org.eclipse.jetty.ee10.servlet.ServletContextHandler.doStart(ServletContextHandler.java:1048)
at org.eclipse.jetty.util.component.AbstractLifeCycle.start(AbstractLifeCycle.java:93)
at org.eclipse.jetty.util.component.ContainerLifeCycle.start(ContainerLifeCycle.java:169)
at org.eclipse.jetty.util.component.ContainerLifeCycle.doStart(ContainerLifeCycle.java:120)
at org.eclipse.jetty.server.Handler$Abstract.doStart(Handler.java:491)
at org.eclipse.jetty.util.component.AbstractLifeCycle.start(AbstractLifeCycle.java:93)
at org.eclipse.jetty.util.component.ContainerLifeCycle.start(ContainerLifeCycle.java:169)
at org.eclipse.jetty.util.component.ContainerLifeCycle.doStart(ContainerLifeCycle.java:120)
at org.eclipse.jetty.server.Handler$Abstract.doStart(Handler.java:491)
at org.eclipse.jetty.server.handler.gzip.GzipHandler.doStart(GzipHandler.java:132)
at org.eclipse.jetty.util.component.AbstractLifeCycle.start(AbstractLifeCycle.java:93)
at org.eclipse.jetty.util.component.ContainerLifeCycle.start(ContainerLifeCycle.java:169)
at org.eclipse.jetty.util.component.ContainerLifeCycle.doStart(ContainerLifeCycle.java:120)
at org.eclipse.jetty.server.Handler$Abstract.doStart(Handler.java:491)
at org.eclipse.jetty.util.component.AbstractLifeCycle.start(AbstractLifeCycle.java:93)
at org.eclipse.jetty.util.component.ContainerLifeCycle.start(ContainerLifeCycle.java:169)
at org.eclipse.jetty.server.Server.start(Server.java:643)
at org.eclipse.jetty.util.component.ContainerLifeCycle.doStart(ContainerLifeCycle.java:120)
at org.eclipse.jetty.server.Handler$Abstract.doStart(Handler.java:491)
at org.eclipse.jetty.server.Server.doStart(Server.java:584)
at org.eclipse.jetty.util.component.AbstractLifeCycle.start(AbstractLifeCycle.java:93)
at org.apache.solr.embedded.JettySolrRunner.retryOnPortBindFailure(JettySolrRunner.java:582)
at org.apache.solr.embedded.JettySolrRunner.start(JettySolrRunner.java:528)
at org.apache.solr.embedded.JettySolrRunner.start(JettySolrRunner.java:499)
at org.apache.solr.handler.ReplicationTestHelper.createAndStartJetty(ReplicationTestHelper.java:73)
at org.apache.solr.handler.TestUserManagedReplicationWithAuth.setUp(TestUserManagedReplicationWithAuth.java:105)
at java.base/jdk.internal.reflect.DirectMethodHandleAccessor.invoke(DirectMethodHandleAccessor.java:104)
at java.base/java.lang.reflect.Method.invoke(Method.java:565)
at com.carrotsearch.randomizedtesting.RandomizedRunner.invoke(RandomizedRunner.java:1763)
at com.carrotsearch.randomizedtesting.RandomizedRunner$9.evaluate(RandomizedRunner.java:980)
at com.carrotsearch.randomizedtesting.RandomizedRunner$10.evaluate(RandomizedRunner.java:996)
at com.carrotsearch.randomizedtesting.rules.SystemPropertiesRestoreRule$1.evaluate(SystemPropertiesRestoreRule.java:80)
at org.junit.rules.RunRules.evaluate(RunRules.java:20)
at org.apache.lucene.tests.util.TestRuleSetupTeardownChained$1.evaluate(TestRuleSetupTeardownChained.java:48)
at org.apache.lucene.tests.util.AbstractBeforeAfterRule$1.evaluate(AbstractBeforeAfterRule.java:43)
at org.apache.lucene.tests.util.TestRuleThreadAndTestName$1.evaluate(TestRuleThreadAndTestName.java:45)
at org.apache.lucene.tests.util.TestRuleIgnoreAfterMaxFailures$1.evaluate(TestRuleIgnoreAfterMaxFailures.java:60)
at org.apache.lucene.tests.util.TestRuleMarkFailure$1.evaluate(TestRuleMarkFailure.java:44)
at org.junit.rules.RunRules.evaluate(RunRules.java:20)
at com.carrotsearch.randomizedtesting.rules.StatementAdapter.evaluate(StatementAdapter.java:36)
at com.carrotsearch.randomizedtesting.ThreadLeakControl$StatementRunner.run(ThreadLeakControl.java:390)
at com.carrotsearch.randomizedtesting.ThreadLeakControl.forkTimeoutingTask(ThreadLeakControl.java:843)
at com.carrotsearch.randomizedtesting.ThreadLeakControl$3.evaluate(ThreadLeakControl.java:490)
at com.carrotsearch.randomizedtesting.RandomizedRunner.runSingleTest(RandomizedRunner.java:955)
at com.carrotsearch.randomizedtesting.RandomizedRunner$5.evaluate(RandomizedRunner.java:840)
at com.carrotsearch.randomizedtesting.RandomizedRunner$6.evaluate(RandomizedRunner.java:891)
at com.carrotsearch.randomizedtesting.RandomizedRunner$7.evaluate(RandomizedRunner.java:902)
at com.carrotsearch.randomizedtesting.rules.StatementAdapter.evaluate(StatementAdapter.java:36)
at com.carrotsearch.randomizedtesting.rules.StatementAdapter.evaluate(StatementAdapter.java:36)
at org.apache.lucene.tests.util.AbstractBeforeAfterRule$1.evaluate(AbstractBeforeAfterRule.java:43)
at com.carrotsearch.randomizedtesting.rules.SystemPropertiesRestoreRule$1.evaluate(SystemPropertiesRestoreRule.java:80)
at org.junit.rules.RunRules.evaluate(RunRules.java:20)
at org.apache.lucene.tests.util.AbstractBeforeAfterRule$1.evaluate(AbstractBeforeAfterRule.java:43)
at com.carrotsearch.randomizedtesting.rules.StatementAdapter.evaluate(StatementAdapter.java:36)
at org.apache.lucene.tests.util.TestRuleStoreClassName$1.evaluate(TestRuleStoreClassName.java:38)
at com.carrotsearch.randomizedtesting.rules.NoShadowingOrOverridesOnMethodsRule$1.evaluate(NoShadowingOrOverridesOnMethodsRule.java:40)
at com.carrotsearch.randomizedtesting.rules.NoShadowingOrOverridesOnMethodsRule$1.evaluate(NoShadowingOrOverridesOnMethodsRule.java:40)
at com.carrotsearch.randomizedtesting.rules.StatementAdapter.evaluate(StatementAdapter.java:36)
at com.carrotsearch.randomizedtesting.rules.StatementAdapter.evaluate(StatementAdapter.java:36)
at org.apache.lucene.tests.util.TestRuleAssertionsRequired$1.evaluate(TestRuleAssertionsRequired.java:53)
at org.apache.lucene.tests.util.AbstractBeforeAfterRule$1.evaluate(AbstractBeforeAfterRule.java:43)
at org.apache.lucene.tests.util.TestRuleMarkFailure$1.evaluate(TestRuleMarkFailure.java:44)
at org.apache.lucene.tests.util.TestRuleIgnoreAfterMaxFailures$1.evaluate(TestRuleIgnoreAfterMaxFailures.java:60)
at org.apache.lucene.tests.util.TestRuleIgnoreTestSuites$1.evaluate(TestRuleIgnoreTestSuites.java:47)
at org.junit.rules.RunRules.evaluate(RunRules.java:20)
at com.carrotsearch.randomizedtesting.rules.StatementAdapter.evaluate(StatementAdapter.java:36)
at com.carrotsearch.randomizedtesting.ThreadLeakControl$StatementRunner.run(ThreadLeakControl.java:390)
at com.carrotsearch.randomizedtesting.ThreadLeakControl.lambda$forkTimeoutingTask$0(ThreadLeakControl.java:850)
... 1 more
org.apache.solr.client.solrj.impl.Http2SolrClient:org.apache.solr.common.util.ObjectReleaseTracker$ObjectTrackerException: org.apache.solr.client.solrj.impl.Http2SolrClient
at org.apache.solr.common.util.ObjectReleaseTracker.track(ObjectReleaseTracker.java:54)
at org.apache.solr.client.solrj.impl.Http2SolrClient.<init>(Http2SolrClient.java:174)
at org.apache.solr.client.solrj.impl.Http2SolrClient$Builder.build(Http2SolrClient.java:1078)
at org.apache.solr.handler.IndexFetcher.createSolrClient(IndexFetcher.java:261)
at org.apache.solr.handler.IndexFetcher.<init>(IndexFetcher.java:294)
at org.apache.solr.handler.ReplicationHandler.inform(ReplicationHandler.java:1239)
at org.apache.solr.core.SolrResourceLoader.inform(SolrResourceLoader.java:757)
at org.apache.solr.core.SolrCore.<init>(SolrCore.java:1176)
at org.apache.solr.core.SolrCore.<init>(SolrCore.java:1050)
at org.apache.solr.core.CoreContainer.createFromDescriptor(CoreContainer.java:1700)
at org.apache.solr.core.CoreContainer.lambda$loadInternal$9(CoreContainer.java:1048)
at com.codahale.metrics.InstrumentedExecutorService$InstrumentedRunnable.run(InstrumentedExecutorService.java:212)
at org.apache.solr.common.util.ExecutorUtil$MDCAwareThreadPoolExecutor.lambda$execute$0(ExecutorUtil.java:381)
at java.base/java.util.concurrent.ThreadPoolExecutor.runWorker(ThreadPoolExecutor.java:1095)
at java.base/java.util.concurrent.ThreadPoolExecutor$Worker.run(ThreadPoolExecutor.java:619)
at java.base/java.lang.Thread.run(Thread.java:1447)
Caused by: java.lang.Exception: Submitter stack trace
at org.apache.solr.common.util.ExecutorUtil$MDCAwareThreadPoolExecutor.execute(ExecutorUtil.java:348)
at com.codahale.metrics.InstrumentedExecutorService.execute(InstrumentedExecutorService.java:95)
at org.apache.solr.core.CoreContainer.loadInternal(CoreContainer.java:1037)
at org.apache.solr.core.CoreContainer.load(CoreContainer.java:736)
at org.apache.solr.servlet.CoreContainerProvider.createCoreContainer(CoreContainerProvider.java:396)
at org.apache.solr.servlet.CoreContainerProvider.init(CoreContainerProvider.java:219)
at org.apache.solr.servlet.CoreContainerProvider.contextInitialized(CoreContainerProvider.java:106)
at org.apache.solr.embedded.JettySolrRunner$1.contextInitialized(JettySolrRunner.java:391)
at org.eclipse.jetty.ee10.servlet.ServletContextHandler.callContextInitialized(ServletContextHandler.java:1591)
at org.eclipse.jetty.ee10.servlet.ServletContextHandler.contextInitialized(ServletContextHandler.java:500)
at org.eclipse.jetty.ee10.servlet.ServletHandler.initialize(ServletHandler.java:676)
at org.eclipse.jetty.ee10.servlet.ServletContextHandler.startContext(ServletContextHandler.java:1325)
at org.eclipse.jetty.ee10.servlet.ServletContextHandler.lambda$doStart$0(ServletContextHandler.java:1051)
at org.eclipse.jetty.server.handler.ContextHandler$ScopedContext.call(ContextHandler.java:1456)
at org.eclipse.jetty.ee10.servlet.ServletContextHandler.doStart(ServletContextHandler.java:1048)
at org.eclipse.jetty.util.component.AbstractLifeCycle.start(AbstractLifeCycle.java:93)
at org.eclipse.jetty.util.component.ContainerLifeCycle.start(ContainerLifeCycle.java:169)
at org.eclipse.jetty.util.component.ContainerLifeCycle.doStart(ContainerLifeCycle.java:120)
at org.eclipse.jetty.server.Handler$Abstract.doStart(Handler.java:491)
at org.eclipse.jetty.util.component.AbstractLifeCycle.start(AbstractLifeCycle.java:93)
at org.eclipse.jetty.util.component.ContainerLifeCycle.start(ContainerLifeCycle.java:169)
at org.eclipse.jetty.util.component.ContainerLifeCycle.doStart(ContainerLifeCycle.java:120)
at org.eclipse.jetty.server.Handler$Abstract.doStart(Handler.java:491)
at org.eclipse.jetty.server.handler.gzip.GzipHandler.doStart(GzipHandler.java:132)
at org.eclipse.jetty.util.component.AbstractLifeCycle.start(AbstractLifeCycle.java:93)
at org.eclipse.jetty.util.component.ContainerLifeCycle.start(ContainerLifeCycle.java:169)
at org.eclipse.jetty.util.component.ContainerLifeCycle.doStart(ContainerLifeCycle.java:120)
at org.eclipse.jetty.server.Handler$Abstract.doStart(Handler.java:491)
at org.eclipse.jetty.util.component.AbstractLifeCycle.start(AbstractLifeCycle.java:93)
at org.eclipse.jetty.util.component.ContainerLifeCycle.start(ContainerLifeCycle.java:169)
at org.eclipse.jetty.server.Server.start(Server.java:643)
at org.eclipse.jetty.util.component.ContainerLifeCycle.doStart(ContainerLifeCycle.java:120)
at org.eclipse.jetty.server.Handler$Abstract.doStart(Handler.java:491)
at org.eclipse.jetty.server.Server.doStart(Server.java:584)
at org.eclipse.jetty.util.component.AbstractLifeCycle.start(AbstractLifeCycle.java:93)
at org.apache.solr.embedded.JettySolrRunner.retryOnPortBindFailure(JettySolrRunner.java:582)
at org.apache.solr.embedded.JettySolrRunner.start(JettySolrRunner.java:528)
at org.apache.solr.embedded.JettySolrRunner.start(JettySolrRunner.java:499)
at org.apache.solr.handler.ReplicationTestHelper.createAndStartJetty(ReplicationTestHelper.java:73)
at org.apache.solr.handler.TestUserManagedReplicationWithAuth.setUp(TestUserManagedReplicationWithAuth.java:105)
at java.base/jdk.internal.reflect.DirectMethodHandleAccessor.invoke(DirectMethodHandleAccessor.java:104)
at java.base/java.lang.reflect.Method.invoke(Method.java:565)
at com.carrotsearch.randomizedtesting.RandomizedRunner.invoke(RandomizedRunner.java:1763)
at com.carrotsearch.randomizedtesting.RandomizedRunner$9.evaluate(RandomizedRunner.java:980)
at com.carrotsearch.randomizedtesting.RandomizedRunner$10.evaluate(RandomizedRunner.java:996)
at com.carrotsearch.randomizedtesting.rules.SystemPropertiesRestoreRule$1.evaluate(SystemPropertiesRestoreRule.java:80)
at org.junit.rules.RunRules.evaluate(RunRules.java:20)
at org.apache.lucene.tests.util.TestRuleSetupTeardownChained$1.evaluate(TestRuleSetupTeardownChained.java:48)
at org.apache.lucene.tests.util.AbstractBeforeAfterRule$1.evaluate(AbstractBeforeAfterRule.java:43)
at org.apache.lucene.tests.util.TestRuleThreadAndTestName$1.evaluate(TestRuleThreadAndTestName.java:45)
at org.apache.lucene.tests.util.TestRuleIgnoreAfterMaxFailures$1.evaluate(TestRuleIgnoreAfterMaxFailures.java:60)
at org.apache.lucene.tests.util.TestRuleMarkFailure$1.evaluate(TestRuleMarkFailure.java:44)
at org.junit.rules.RunRules.evaluate(RunRules.java:20)
at com.carrotsearch.randomizedtesting.rules.StatementAdapter.evaluate(StatementAdapter.java:36)
at com.carrotsearch.randomizedtesting.ThreadLeakControl$StatementRunner.run(ThreadLeakControl.java:390)
at com.carrotsearch.randomizedtesting.ThreadLeakControl.forkTimeoutingTask(ThreadLeakControl.java:843)
at com.carrotsearch.randomizedtesting.ThreadLeakControl$3.evaluate(ThreadLeakControl.java:490)
at com.carrotsearch.randomizedtesting.RandomizedRunner.runSingleTest(RandomizedRunner.java:955)
at com.carrotsearch.randomizedtesting.RandomizedRunner$5.evaluate(RandomizedRunner.java:840)
at com.carrotsearch.randomizedtesting.RandomizedRunner$6.evaluate(RandomizedRunner.java:891)
at com.carrotsearch.randomizedtesting.RandomizedRunner$7.evaluate(RandomizedRunner.java:902)
at com.carrotsearch.randomizedtesting.rules.StatementAdapter.evaluate(StatementAdapter.java:36)
at com.carrotsearch.randomizedtesting.rules.StatementAdapter.evaluate(StatementAdapter.java:36)
at org.apache.lucene.tests.util.AbstractBeforeAfterRule$1.evaluate(AbstractBeforeAfterRule.java:43)
at com.carrotsearch.randomizedtesting.rules.SystemPropertiesRestoreRule$1.evaluate(SystemPropertiesRestoreRule.java:80)
at org.junit.rules.RunRules.evaluate(RunRules.java:20)
at org.apache.lucene.tests.util.AbstractBeforeAfterRule$1.evaluate(AbstractBeforeAfterRule.java:43)
at com.carrotsearch.randomizedtesting.rules.StatementAdapter.evaluate(StatementAdapter.java:36)
at org.apache.lucene.tests.util.TestRuleStoreClassName$1.evaluate(TestRuleStoreClassName.java:38)
at com.carrotsearch.randomizedtesting.rules.NoShadowingOrOverridesOnMethodsRule$1.evaluate(NoShadowingOrOverridesOnMethodsRule.java:40)
at com.carrotsearch.randomizedtesting.rules.NoShadowingOrOverridesOnMethodsRule$1.evaluate(NoShadowingOrOverridesOnMethodsRule.java:40)
at com.carrotsearch.randomizedtesting.rules.StatementAdapter.evaluate(StatementAdapter.java:36)
at com.carrotsearch.randomizedtesting.rules.StatementAdapter.evaluate(StatementAdapter.java:36)
at org.apache.lucene.tests.util.TestRuleAssertionsRequired$1.evaluate(TestRuleAssertionsRequired.java:53)
at org.apache.lucene.tests.util.AbstractBeforeAfterRule$1.evaluate(AbstractBeforeAfterRule.java:43)
at org.apache.lucene.tests.util.TestRuleMarkFailure$1.evaluate(TestRuleMarkFailure.java:44)
at org.apache.lucene.tests.util.TestRuleIgnoreAfterMaxFailures$1.evaluate(TestRuleIgnoreAfterMaxFailures.java:60)
at org.apache.lucene.tests.util.TestRuleIgnoreTestSuites$1.evaluate(TestRuleIgnoreTestSuites.java:47)
at org.junit.rules.RunRules.evaluate(RunRules.java:20)
at com.carrotsearch.randomizedtesting.rules.StatementAdapter.evaluate(StatementAdapter.java:36)
at com.carrotsearch.randomizedtesting.ThreadLeakControl$StatementRunner.run(ThreadLeakControl.java:390)
at com.carrotsearch.randomizedtesting.ThreadLeakControl.lambda$forkTimeoutingTask$0(ThreadLeakControl.java:850)
... 1 more
org.apache.lucene.tests.store.MockDirectoryWrapper:org.apache.solr.common.util.ObjectReleaseTracker$ObjectTrackerException: org.apache.lucene.tests.store.MockDirectoryWrapper
at org.apache.solr.common.util.ObjectReleaseTracker.track(ObjectReleaseTracker.java:54)
at org.apache.solr.core.CachingDirectoryFactory.get(CachingDirectoryFactory.java:405)
at org.apache.solr.update.SolrIndexWriter.create(SolrIndexWriter.java:108)
at org.apache.solr.core.SolrCore.initIndex(SolrCore.java:900)
at org.apache.solr.core.SolrCore.<init>(SolrCore.java:1127)
at org.apache.solr.core.SolrCore.<init>(SolrCore.java:1050)
at org.apache.solr.core.CoreContainer.createFromDescriptor(CoreContainer.java:1700)
at org.apache.solr.core.CoreContainer.lambda$loadInternal$9(CoreContainer.java:1048)
at com.codahale.metrics.InstrumentedExecutorService$InstrumentedRunnable.run(InstrumentedExecutorService.java:212)
at org.apache.solr.common.util.ExecutorUtil$MDCAwareThreadPoolExecutor.lambda$execute$0(ExecutorUtil.java:381)
at java.base/java.util.concurrent.ThreadPoolExecutor.runWorker(ThreadPoolExecutor.java:1095)
at java.base/java.util.concurrent.ThreadPoolExecutor$Worker.run(ThreadPoolExecutor.java:619)
at java.base/java.lang.Thread.run(Thread.java:1447)
Caused by: java.lang.Exception: Submitter stack trace
at org.apache.solr.common.util.ExecutorUtil$MDCAwareThreadPoolExecutor.execute(ExecutorUtil.java:348)
at com.codahale.metrics.InstrumentedExecutorService.execute(InstrumentedExecutorService.java:95)
at org.apache.solr.core.CoreContainer.loadInternal(CoreContainer.java:1037)
at org.apache.solr.core.CoreContainer.load(CoreContainer.java:736)
at org.apache.solr.servlet.CoreContainerProvider.createCoreContainer(CoreContainerProvider.java:396)
at org.apache.solr.servlet.CoreContainerProvider.init(CoreContainerProvider.java:219)
at org.apache.solr.servlet.CoreContainerProvider.contextInitialized(CoreContainerProvider.java:106)
at org.apache.solr.embedded.JettySolrRunner$1.contextInitialized(JettySolrRunner.java:391)
at org.eclipse.jetty.ee10.servlet.ServletContextHandler.callContextInitialized(ServletContextHandler.java:1591)
at org.eclipse.jetty.ee10.servlet.ServletContextHandler.contextInitialized(ServletContextHandler.java:500)
at org.eclipse.jetty.ee10.servlet.ServletHandler.initialize(ServletHandler.java:676)
at org.eclipse.jetty.ee10.servlet.ServletContextHandler.startContext(ServletContextHandler.java:1325)
at org.eclipse.jetty.ee10.servlet.ServletContextHandler.lambda$doStart$0(ServletContextHandler.java:1051)
at org.eclipse.jetty.server.handler.ContextHandler$ScopedContext.call(ContextHandler.java:1456)
at org.eclipse.jetty.ee10.servlet.ServletContextHandler.doStart(ServletContextHandler.java:1048)
at org.eclipse.jetty.util.component.AbstractLifeCycle.start(AbstractLifeCycle.java:93)
at org.eclipse.jetty.util.component.ContainerLifeCycle.start(ContainerLifeCycle.java:169)
at org.eclipse.jetty.util.component.ContainerLifeCycle.doStart(ContainerLifeCycle.java:120)
at org.eclipse.jetty.server.Handler$Abstract.doStart(Handler.java:491)
at org.eclipse.jetty.util.component.AbstractLifeCycle.start(AbstractLifeCycle.java:93)
at org.eclipse.jetty.util.component.ContainerLifeCycle.start(ContainerLifeCycle.java:169)
at org.eclipse.jetty.util.component.ContainerLifeCycle.doStart(ContainerLifeCycle.java:120)
at org.eclipse.jetty.server.Handler$Abstract.doStart(Handler.java:491)
at org.eclipse.jetty.server.handler.gzip.GzipHandler.doStart(GzipHandler.java:132)
at org.eclipse.jetty.util.component.AbstractLifeCycle.start(AbstractLifeCycle.java:93)
at org.eclipse.jetty.util.component.ContainerLifeCycle.start(ContainerLifeCycle.java:169)
at org.eclipse.jetty.util.component.ContainerLifeCycle.doStart(ContainerLifeCycle.java:120)
at org.eclipse.jetty.server.Handler$Abstract.doStart(Handler.java:491)
at org.eclipse.jetty.util.component.AbstractLifeCycle.start(AbstractLifeCycle.java:93)
at org.eclipse.jetty.util.component.ContainerLifeCycle.start(ContainerLifeCycle.java:169)
at org.eclipse.jetty.server.Server.start(Server.java:643)
at org.eclipse.jetty.util.component.ContainerLifeCycle.doStart(ContainerLifeCycle.java:120)
at org.eclipse.jetty.server.Handler$Abstract.doStart(Handler.java:491)
at org.eclipse.jetty.server.Server.doStart(Server.java:584)
at org.eclipse.jetty.util.component.AbstractLifeCycle.start(AbstractLifeCycle.java:93)
at org.apache.solr.embedded.JettySolrRunner.retryOnPortBindFailure(JettySolrRunner.java:582)
at org.apache.solr.embedded.JettySolrRunner.start(JettySolrRunner.java:528)
at org.apache.solr.embedded.JettySolrRunner.start(JettySolrRunner.java:499)
at org.apache.solr.handler.ReplicationTestHelper.createAndStartJetty(ReplicationTestHelper.java:73)
at org.apache.solr.handler.TestUserManagedReplicationWithAuth.setUp(TestUserManagedReplicationWithAuth.java:105)
at java.base/jdk.internal.reflect.DirectMethodHandleAccessor.invoke(DirectMethodHandleAccessor.java:104)
at java.base/java.lang.reflect.Method.invoke(Method.java:565)
at com.carrotsearch.randomizedtesting.RandomizedRunner.invoke(RandomizedRunner.java:1763)
at com.carrotsearch.randomizedtesting.RandomizedRunner$9.evaluate(RandomizedRunner.java:980)
at com.carrotsearch.randomizedtesting.RandomizedRunner$10.evaluate(RandomizedRunner.java:996)
at com.carrotsearch.randomizedtesting.rules.SystemPropertiesRestoreRule$1.evaluate(SystemPropertiesRestoreRule.java:80)
at org.junit.rules.RunRules.evaluate(RunRules.java:20)
at org.apache.lucene.tests.util.TestRuleSetupTeardownChained$1.evaluate(TestRuleSetupTeardownChained.java:48)
at org.apache.lucene.tests.util.AbstractBeforeAfterRule$1.evaluate(AbstractBeforeAfterRule.java:43)
at org.apache.lucene.tests.util.TestRuleThreadAndTestName$1.evaluate(TestRuleThreadAndTestName.java:45)
at org.apache.lucene.tests.util.TestRuleIgnoreAfterMaxFailures$1.evaluate(TestRuleIgnoreAfterMaxFailures.java:60)
at org.apache.lucene.tests.util.TestRuleMarkFailure$1.evaluate(TestRuleMarkFailure.java:44)
at org.junit.rules.RunRules.evaluate(RunRules.java:20)
at com.carrotsearch.randomizedtesting.rules.StatementAdapter.evaluate(StatementAdapter.java:36)
at com.carrotsearch.randomizedtesting.ThreadLeakControl$StatementRunner.run(ThreadLeakControl.java:390)
at com.carrotsearch.randomizedtesting.ThreadLeakControl.forkTimeoutingTask(ThreadLeakControl.java:843)
at com.carrotsearch.randomizedtesting.ThreadLeakControl$3.evaluate(ThreadLeakControl.java:490)
at com.carrotsearch.randomizedtesting.RandomizedRunner.runSingleTest(RandomizedRunner.java:955)
at com.carrotsearch.randomizedtesting.RandomizedRunner$5.evaluate(RandomizedRunner.java:840)
at com.carrotsearch.randomizedtesting.RandomizedRunner$6.evaluate(RandomizedRunner.java:891)
at com.carrotsearch.randomizedtesting.RandomizedRunner$7.evaluate(RandomizedRunner.java:902)
at com.carrotsearch.randomizedtesting.rules.StatementAdapter.evaluate(StatementAdapter.java:36)
at com.carrotsearch.randomizedtesting.rules.StatementAdapter.evaluate(StatementAdapter.java:36)
at org.apache.lucene.tests.util.AbstractBeforeAfterRule$1.evaluate(AbstractBeforeAfterRule.java:43)
at com.carrotsearch.randomizedtesting.rules.SystemPropertiesRestoreRule$1.evaluate(SystemPropertiesRestoreRule.java:80)
at org.junit.rules.RunRules.evaluate(RunRules.java:20)
at org.apache.lucene.tests.util.AbstractBeforeAfterRule$1.evaluate(AbstractBeforeAfterRule.java:43)
at com.carrotsearch.randomizedtesting.rules.StatementAdapter.evaluate(StatementAdapter.java:36)
at org.apache.lucene.tests.util.TestRuleStoreClassName$1.evaluate(TestRuleStoreClassName.java:38)
at com.carrotsearch.randomizedtesting.rules.NoShadowingOrOverridesOnMethodsRule$1.evaluate(NoShadowingOrOverridesOnMethodsRule.java:40)
at com.carrotsearch.randomizedtesting.rules.NoShadowingOrOverridesOnMethodsRule$1.evaluate(NoShadowingOrOverridesOnMethodsRule.java:40)
at com.carrotsearch.randomizedtesting.rules.StatementAdapter.evaluate(StatementAdapter.java:36)
at com.carrotsearch.randomizedtesting.rules.StatementAdapter.evaluate(StatementAdapter.java:36)
at org.apache.lucene.tests.util.TestRuleAssertionsRequired$1.evaluate(TestRuleAssertionsRequired.java:53)
at org.apache.lucene.tests.util.AbstractBeforeAfterRule$1.evaluate(AbstractBeforeAfterRule.java:43)
at org.apache.lucene.tests.util.TestRuleMarkFailure$1.evaluate(TestRuleMarkFailure.java:44)
at org.apache.lucene.tests.util.TestRuleIgnoreAfterMaxFailures$1.evaluate(TestRuleIgnoreAfterMaxFailures.java:60)
at org.apache.lucene.tests.util.TestRuleIgnoreTestSuites$1.evaluate(TestRuleIgnoreTestSuites.java:47)
at org.junit.rules.RunRules.evaluate(RunRules.java:20)
at com.carrotsearch.randomizedtesting.rules.StatementAdapter.evaluate(StatementAdapter.java:36)
at com.carrotsearch.randomizedtesting.ThreadLeakControl$StatementRunner.run(ThreadLeakControl.java:390)
at com.carrotsearch.randomizedtesting.ThreadLeakControl.lambda$forkTimeoutingTask$0(ThreadLeakControl.java:850)
... 1 more
org.apache.lucene.tests.store.MockDirectoryWrapper:org.apache.solr.common.util.ObjectReleaseTracker$ObjectTrackerException: org.apache.lucene.tests.store.MockDirectoryWrapper
at org.apache.solr.common.util.ObjectReleaseTracker.track(ObjectReleaseTracker.java:54)
at org.apache.solr.core.CachingDirectoryFactory.get(CachingDirectoryFactory.java:405)
at org.apache.solr.core.SolrCore.initSnapshotMetaDataManager(SolrCore.java:606)
at org.apache.solr.core.SolrCore.<init>(SolrCore.java:1123)
at org.apache.solr.core.SolrCore.<init>(SolrCore.java:1050)
at org.apache.solr.core.CoreContainer.createFromDescriptor(CoreContainer.java:1700)
at org.apache.solr.core.CoreContainer.lambda$loadInternal$9(CoreContainer.java:1048)
at com.codahale.metrics.InstrumentedExecutorService$InstrumentedRunnable.run(InstrumentedExecutorService.java:212)
at org.apache.solr.common.util.ExecutorUtil$MDCAwareThreadPoolExecutor.lambda$execute$0(ExecutorUtil.java:381)
at java.base/java.util.concurrent.ThreadPoolExecutor.runWorker(ThreadPoolExecutor.java:1095)
at java.base/java.util.concurrent.ThreadPoolExecutor$Worker.run(ThreadPoolExecutor.java:619)
at java.base/java.lang.Thread.run(Thread.java:1447)
Caused by: java.lang.Exception: Submitter stack trace
at org.apache.solr.common.util.ExecutorUtil$MDCAwareThreadPoolExecutor.execute(ExecutorUtil.java:348)
at com.codahale.metrics.InstrumentedExecutorService.execute(InstrumentedExecutorService.java:95)
at org.apache.solr.core.CoreContainer.loadInternal(CoreContainer.java:1037)
at org.apache.solr.core.CoreContainer.load(CoreContainer.java:736)
at org.apache.solr.servlet.CoreContainerProvider.createCoreContainer(CoreContainerProvider.java:396)
at org.apache.solr.servlet.CoreContainerProvider.init(CoreContainerProvider.java:219)
at org.apache.solr.servlet.CoreContainerProvider.contextInitialized(CoreContainerProvider.java:106)
at org.apache.solr.embedded.JettySolrRunner$1.contextInitialized(JettySolrRunner.java:391)
at org.eclipse.jetty.ee10.servlet.ServletContextHandler.callContextInitialized(ServletContextHandler.java:1591)
at org.eclipse.jetty.ee10.servlet.ServletContextHandler.contextInitialized(ServletContextHandler.java:500)
at org.eclipse.jetty.ee10.servlet.ServletHandler.initialize(ServletHandler.java:676)
at org.eclipse.jetty.ee10.servlet.ServletContextHandler.startContext(ServletContextHandler.java:1325)
at org.eclipse.jetty.ee10.servlet.ServletContextHandler.lambda$doStart$0(ServletContextHandler.java:1051)
at org.eclipse.jetty.server.handler.ContextHandler$ScopedContext.call(ContextHandler.java:1456)
at org.eclipse.jetty.ee10.servlet.ServletContextHandler.doStart(ServletContextHandler.java:1048)
at org.eclipse.jetty.util.component.AbstractLifeCycle.start(AbstractLifeCycle.java:93)
at org.eclipse.jetty.util.component.ContainerLifeCycle.start(ContainerLifeCycle.java:169)
at org.eclipse.jetty.util.component.ContainerLifeCycle.doStart(ContainerLifeCycle.java:120)
at org.eclipse.jetty.server.Handler$Abstract.doStart(Handler.java:491)
at org.eclipse.jetty.util.component.AbstractLifeCycle.start(AbstractLifeCycle.java:93)
at org.eclipse.jetty.util.component.ContainerLifeCycle.start(ContainerLifeCycle.java:169)
at org.eclipse.jetty.util.component.ContainerLifeCycle.doStart(ContainerLifeCycle.java:120)
at org.eclipse.jetty.server.Handler$Abstract.doStart(Handler.java:491)
at org.eclipse.jetty.server.handler.gzip.GzipHandler.doStart(GzipHandler.java:132)
at org.eclipse.jetty.util.component.AbstractLifeCycle.start(AbstractLifeCycle.java:93)
at org.eclipse.jetty.util.component.ContainerLifeCycle.start(ContainerLifeCycle.java:169)
at org.eclipse.jetty.util.component.ContainerLifeCycle.doStart(ContainerLifeCycle.java:120)
at org.eclipse.jetty.server.Handler$Abstract.doStart(Handler.java:491)
at org.eclipse.jetty.util.component.AbstractLifeCycle.start(AbstractLifeCycle.java:93)
at org.eclipse.jetty.util.component.ContainerLifeCycle.start(ContainerLifeCycle.java:169)
at org.eclipse.jetty.server.Server.start(Server.java:643)
at org.eclipse.jetty.util.component.ContainerLifeCycle.doStart(ContainerLifeCycle.java:120)
at org.eclipse.jetty.server.Handler$Abstract.doStart(Handler.java:491)
at org.eclipse.jetty.server.Server.doStart(Server.java:584)
at org.eclipse.jetty.util.component.AbstractLifeCycle.start(AbstractLifeCycle.java:93)
at org.apache.solr.embedded.JettySolrRunner.retryOnPortBindFailure(JettySolrRunner.java:582)
at org.apache.solr.embedded.JettySolrRunner.start(JettySolrRunner.java:528)
at org.apache.solr.embedded.JettySolrRunner.start(JettySolrRunner.java:499)
at org.apache.solr.handler.ReplicationTestHelper.createAndStartJetty(ReplicationTestHelper.java:73)
at org.apache.solr.handler.TestUserManagedReplicationWithAuth.setUp(TestUserManagedReplicationWithAuth.java:105)
at java.base/jdk.internal.reflect.DirectMethodHandleAccessor.invoke(DirectMethodHandleAccessor.java:104)
at java.base/java.lang.reflect.Method.invoke(Method.java:565)
at com.carrotsearch.randomizedtesting.RandomizedRunner.invoke(RandomizedRunner.java:1763)
at com.carrotsearch.randomizedtesting.RandomizedRunner$9.evaluate(RandomizedRunner.java:980)
at com.carrotsearch.randomizedtesting.RandomizedRunner$10.evaluate(RandomizedRunner.java:996)
at com.carrotsearch.randomizedtesting.rules.SystemPropertiesRestoreRule$1.evaluate(SystemPropertiesRestoreRule.java:80)
at org.junit.rules.RunRules.evaluate(RunRules.java:20)
at org.apache.lucene.tests.util.TestRuleSetupTeardownChained$1.evaluate(TestRuleSetupTeardownChained.java:48)
at org.apache.lucene.tests.util.AbstractBeforeAfterRule$1.evaluate(AbstractBeforeAfterRule.java:43)
at org.apache.lucene.tests.util.TestRuleThreadAndTestName$1.evaluate(TestRuleThreadAndTestName.java:45)
at org.apache.lucene.tests.util.TestRuleIgnoreAfterMaxFailures$1.evaluate(TestRuleIgnoreAfterMaxFailures.java:60)
at org.apache.lucene.tests.util.TestRuleMarkFailure$1.evaluate(TestRuleMarkFailure.java:44)
at org.junit.rules.RunRules.evaluate(RunRules.java:20)
at com.carrotsearch.randomizedtesting.rules.StatementAdapter.evaluate(StatementAdapter.java:36)
at com.carrotsearch.randomizedtesting.ThreadLeakControl$StatementRunner.run(ThreadLeakControl.java:390)
at com.carrotsearch.randomizedtesting.ThreadLeakControl.forkTimeoutingTask(ThreadLeakControl.java:843)
at com.carrotsearch.randomizedtesting.ThreadLeakControl$3.evaluate(ThreadLeakControl.java:490)
at com.carrotsearch.randomizedtesting.RandomizedRunner.runSingleTest(RandomizedRunner.java:955)
at com.carrotsearch.randomizedtesting.RandomizedRunner$5.evaluate(RandomizedRunner.java:840)
at com.carrotsearch.randomizedtesting.RandomizedRunner$6.evaluate(RandomizedRunner.java:891)
at com.carrotsearch.randomizedtesting.RandomizedRunner$7.evaluate(RandomizedRunner.java:902)
at com.carrotsearch.randomizedtesting.rules.StatementAdapter.evaluate(StatementAdapter.java:36)
at com.carrotsearch.randomizedtesting.rules.StatementAdapter.evaluate(StatementAdapter.java:36)
at org.apache.lucene.tests.util.AbstractBeforeAfterRule$1.evaluate(AbstractBeforeAfterRule.java:43)
at com.carrotsearch.randomizedtesting.rules.SystemPropertiesRestoreRule$1.evaluate(SystemPropertiesRestoreRule.java:80)
at org.junit.rules.RunRules.evaluate(RunRules.java:20)
at org.apache.lucene.tests.util.AbstractBeforeAfterRule$1.evaluate(AbstractBeforeAfterRule.java:43)
at com.carrotsearch.randomizedtesting.rules.StatementAdapter.evaluate(StatementAdapter.java:36)
at org.apache.lucene.tests.util.TestRuleStoreClassName$1.evaluate(TestRuleStoreClassName.java:38)
at com.carrotsearch.randomizedtesting.rules.NoShadowingOrOverridesOnMethodsRule$1.evaluate(NoShadowingOrOverridesOnMethodsRule.java:40)
at com.carrotsearch.randomizedtesting.rules.NoShadowingOrOverridesOnMethodsRule$1.evaluate(NoShadowingOrOverridesOnMethodsRule.java:40)
at com.carrotsearch.randomizedtesting.rules.StatementAdapter.evaluate(StatementAdapter.java:36)
at com.carrotsearch.randomizedtesting.rules.StatementAdapter.evaluate(StatementAdapter.java:36)
at org.apache.lucene.tests.util.TestRuleAssertionsRequired$1.evaluate(TestRuleAssertionsRequired.java:53)
at org.apache.lucene.tests.util.AbstractBeforeAfterRule$1.evaluate(AbstractBeforeAfterRule.java:43)
at org.apache.lucene.tests.util.TestRuleMarkFailure$1.evaluate(TestRuleMarkFailure.java:44)
at org.apache.lucene.tests.util.TestRuleIgnoreAfterMaxFailures$1.evaluate(TestRuleIgnoreAfterMaxFailures.java:60)
at org.apache.lucene.tests.util.TestRuleIgnoreTestSuites$1.evaluate(TestRuleIgnoreTestSuites.java:47)
at org.junit.rules.RunRules.evaluate(RunRules.java:20)
at com.carrotsearch.randomizedtesting.rules.StatementAdapter.evaluate(StatementAdapter.java:36)
at com.carrotsearch.randomizedtesting.ThreadLeakControl$StatementRunner.run(ThreadLeakControl.java:390)
at com.carrotsearch.randomizedtesting.ThreadLeakControl.lambda$forkTimeoutingTask$0(ThreadLeakControl.java:850)
... 1 more
org.apache.lucene.tests.store.MockDirectoryWrapper:org.apache.solr.common.util.ObjectReleaseTracker$ObjectTrackerException: org.apache.lucene.tests.store.MockDirectoryWrapper
at org.apache.solr.common.util.ObjectReleaseTracker.track(ObjectReleaseTracker.java:54)
at org.apache.solr.core.CachingDirectoryFactory.get(CachingDirectoryFactory.java:405)
at org.apache.solr.core.SolrCore.getNewIndexDir(SolrCore.java:411)
at org.apache.solr.core.SolrCore.initIndex(SolrCore.java:861)
at org.apache.solr.core.SolrCore.<init>(SolrCore.java:1127)
at org.apache.solr.core.SolrCore.<init>(SolrCore.java:1050)
at org.apache.solr.core.CoreContainer.createFromDescriptor(CoreContainer.java:1700)
at org.apache.solr.core.CoreContainer.lambda$loadInternal$9(CoreContainer.java:1048)
at com.codahale.metrics.InstrumentedExecutorService$InstrumentedRunnable.run(InstrumentedExecutorService.java:212)
at org.apache.solr.common.util.ExecutorUtil$MDCAwareThreadPoolExecutor.lambda$execute$0(ExecutorUtil.java:381)
at java.base/java.util.concurrent.ThreadPoolExecutor.runWorker(ThreadPoolExecutor.java:1095)
at java.base/java.util.concurrent.ThreadPoolExecutor$Worker.run(ThreadPoolExecutor.java:619)
at java.base/java.lang.Thread.run(Thread.java:1447)
Caused by: java.lang.Exception: Submitter stack trace
at org.apache.solr.common.util.ExecutorUtil$MDCAwareThreadPoolExecutor.execute(ExecutorUtil.java:348)
at com.codahale.metrics.InstrumentedExecutorService.execute(InstrumentedExecutorService.java:95)
at org.apache.solr.core.CoreContainer.loadInternal(CoreContainer.java:1037)
at org.apache.solr.core.CoreContainer.load(CoreContainer.java:736)
at org.apache.solr.servlet.CoreContainerProvider.createCoreContainer(CoreContainerProvider.java:396)
at org.apache.solr.servlet.CoreContainerProvider.init(CoreContainerProvider.java:219)
at org.apache.solr.servlet.CoreContainerProvider.contextInitialized(CoreContainerProvider.java:106)
at org.apache.solr.embedded.JettySolrRunner$1.contextInitialized(JettySolrRunner.java:391)
at org.eclipse.jetty.ee10.servlet.ServletContextHandler.callContextInitialized(ServletContextHandler.java:1591)
at org.eclipse.jetty.ee10.servlet.ServletContextHandler.contextInitialized(ServletContextHandler.java:500)
at org.eclipse.jetty.ee10.servlet.ServletHandler.initialize(ServletHandler.java:676)
at org.eclipse.jetty.ee10.servlet.ServletContextHandler.startContext(ServletContextHandler.java:1325)
at org.eclipse.jetty.ee10.servlet.ServletContextHandler.lambda$doStart$0(ServletContextHandler.java:1051)
at org.eclipse.jetty.server.handler.ContextHandler$ScopedContext.call(ContextHandler.java:1456)
at org.eclipse.jetty.ee10.servlet.ServletContextHandler.doStart(ServletContextHandler.java:1048)
at org.eclipse.jetty.util.component.AbstractLifeCycle.start(AbstractLifeCycle.java:93)
at org.eclipse.jetty.util.component.ContainerLifeCycle.start(ContainerLifeCycle.java:169)
at org.eclipse.jetty.util.component.ContainerLifeCycle.doStart(ContainerLifeCycle.java:120)
at org.eclipse.jetty.server.Handler$Abstract.doStart(Handler.java:491)
at org.eclipse.jetty.util.component.AbstractLifeCycle.start(AbstractLifeCycle.java:93)
at org.eclipse.jetty.util.component.ContainerLifeCycle.start(ContainerLifeCycle.java:169)
at org.eclipse.jetty.util.component.ContainerLifeCycle.doStart(ContainerLifeCycle.java:120)
at org.eclipse.jetty.server.Handler$Abstract.doStart(Handler.java:491)
at org.eclipse.jetty.server.handler.gzip.GzipHandler.doStart(GzipHandler.java:132)
at org.eclipse.jetty.util.component.AbstractLifeCycle.start(AbstractLifeCycle.java:93)
at org.eclipse.jetty.util.component.ContainerLifeCycle.start(ContainerLifeCycle.java:169)
at org.eclipse.jetty.util.component.ContainerLifeCycle.doStart(ContainerLifeCycle.java:120)
at org.eclipse.jetty.server.Handler$Abstract.doStart(Handler.java:491)
at org.eclipse.jetty.util.component.AbstractLifeCycle.start(AbstractLifeCycle.java:93)
at org.eclipse.jetty.util.component.ContainerLifeCycle.start(ContainerLifeCycle.java:169)
at org.eclipse.jetty.server.Server.start(Server.java:643)
at org.eclipse.jetty.util.component.ContainerLifeCycle.doStart(ContainerLifeCycle.java:120)
at org.eclipse.jetty.server.Handler$Abstract.doStart(Handler.java:491)
at org.eclipse.jetty.server.Server.doStart(Server.java:584)
at org.eclipse.jetty.util.component.AbstractLifeCycle.start(AbstractLifeCycle.java:93)
at org.apache.solr.embedded.JettySolrRunner.retryOnPortBindFailure(JettySolrRunner.java:582)
at org.apache.solr.embedded.JettySolrRunner.start(JettySolrRunner.java:528)
at org.apache.solr.embedded.JettySolrRunner.start(JettySolrRunner.java:499)
at org.apache.solr.handler.ReplicationTestHelper.createAndStartJetty(ReplicationTestHelper.java:73)
at org.apache.solr.handler.TestUserManagedReplicationWithAuth.setUp(TestUserManagedReplicationWithAuth.java:105)
at java.base/jdk.internal.reflect.DirectMethodHandleAccessor.invoke(DirectMethodHandleAccessor.java:104)
at java.base/java.lang.reflect.Method.invoke(Method.java:565)
at com.carrotsearch.randomizedtesting.RandomizedRunner.invoke(RandomizedRunner.java:1763)
at com.carrotsearch.randomizedtesting.RandomizedRunner$9.evaluate(RandomizedRunner.java:980)
at com.carrotsearch.randomizedtesting.RandomizedRunner$10.evaluate(RandomizedRunner.java:996)
at com.carrotsearch.randomizedtesting.rules.SystemPropertiesRestoreRule$1.evaluate(SystemPropertiesRestoreRule.java:80)
at org.junit.rules.RunRules.evaluate(RunRules.java:20)
at org.apache.lucene.tests.util.TestRuleSetupTeardownChained$1.evaluate(TestRuleSetupTeardownChained.java:48)
at org.apache.lucene.tests.util.AbstractBeforeAfterRule$1.evaluate(AbstractBeforeAfterRule.java:43)
at org.apache.lucene.tests.util.TestRuleThreadAndTestName$1.evaluate(TestRuleThreadAndTestName.java:45)
at org.apache.lucene.tests.util.TestRuleIgnoreAfterMaxFailures$1.evaluate(TestRuleIgnoreAfterMaxFailures.java:60)
at org.apache.lucene.tests.util.TestRuleMarkFailure$1.evaluate(TestRuleMarkFailure.java:44)
at org.junit.rules.RunRules.evaluate(RunRules.java:20)
at com.carrotsearch.randomizedtesting.rules.StatementAdapter.evaluate(StatementAdapter.java:36)
at com.carrotsearch.randomizedtesting.ThreadLeakControl$StatementRunner.run(ThreadLeakControl.java:390)
at com.carrotsearch.randomizedtesting.ThreadLeakControl.forkTimeoutingTask(ThreadLeakControl.java:843)
at com.carrotsearch.randomizedtesting.ThreadLeakControl$3.evaluate(ThreadLeakControl.java:490)
at com.carrotsearch.randomizedtesting.RandomizedRunner.runSingleTest(RandomizedRunner.java:955)
at com.carrotsearch.randomizedtesting.RandomizedRunner$5.evaluate(RandomizedRunner.java:840)
at com.carrotsearch.randomizedtesting.RandomizedRunner$6.evaluate(RandomizedRunner.java:891)
at com.carrotsearch.randomizedtesting.RandomizedRunner$7.evaluate(RandomizedRunner.java:902)
at com.carrotsearch.randomizedtesting.rules.StatementAdapter.evaluate(StatementAdapter.java:36)
at com.carrotsearch.randomizedtesting.rules.StatementAdapter.evaluate(StatementAdapter.java:36)
at org.apache.lucene.tests.util.AbstractBeforeAfterRule$1.evaluate(AbstractBeforeAfterRule.java:43)
at com.carrotsearch.randomizedtesting.rules.SystemPropertiesRestoreRule$1.evaluate(SystemPropertiesRestoreRule.java:80)
at org.junit.rules.RunRules.evaluate(RunRules.java:20)
at org.apache.lucene.tests.util.AbstractBeforeAfterRule$1.evaluate(AbstractBeforeAfterRule.java:43)
at com.carrotsearch.randomizedtesting.rules.StatementAdapter.evaluate(StatementAdapter.java:36)
at org.apache.lucene.tests.util.TestRuleStoreClassName$1.evaluate(TestRuleStoreClassName.java:38)
at com.carrotsearch.randomizedtesting.rules.NoShadowingOrOverridesOnMethodsRule$1.evaluate(NoShadowingOrOverridesOnMethodsRule.java:40)
at com.carrotsearch.randomizedtesting.rules.NoShadowingOrOverridesOnMethodsRule$1.evaluate(NoShadowingOrOverridesOnMethodsRule.java:40)
at com.carrotsearch.randomizedtesting.rules.StatementAdapter.evaluate(StatementAdapter.java:36)
at com.carrotsearch.randomizedtesting.rules.StatementAdapter.evaluate(StatementAdapter.java:36)
at org.apache.lucene.tests.util.TestRuleAssertionsRequired$1.evaluate(TestRuleAssertionsRequired.java:53)
at org.apache.lucene.tests.util.AbstractBeforeAfterRule$1.evaluate(AbstractBeforeAfterRule.java:43)
at org.apache.lucene.tests.util.TestRuleMarkFailure$1.evaluate(TestRuleMarkFailure.java:44)
at org.apache.lucene.tests.util.TestRuleIgnoreAfterMaxFailures$1.evaluate(TestRuleIgnoreAfterMaxFailures.java:60)
at org.apache.lucene.tests.util.TestRuleIgnoreTestSuites$1.evaluate(TestRuleIgnoreTestSuites.java:47)
at org.junit.rules.RunRules.evaluate(RunRules.java:20)
at com.carrotsearch.randomizedtesting.rules.StatementAdapter.evaluate(StatementAdapter.java:36)
at com.carrotsearch.randomizedtesting.ThreadLeakControl$StatementRunner.run(ThreadLeakControl.java:390)
at com.carrotsearch.randomizedtesting.ThreadLeakControl.lambda$forkTimeoutingTask$0(ThreadLeakControl.java:850)
... 1 more
expected null, but was:<ObjectTracker found 5 object(s) that were not released!!! [SolrCore, Http2SolrClient, MockDirectoryWrapper, MockDirectoryWrapper, MockDirectoryWrapper]
org.apache.solr.core.SolrCore:org.apache.solr.common.util.ObjectReleaseTracker$ObjectTrackerException: org.apache.solr.core.SolrCore
at org.apache.solr.common.util.ObjectReleaseTracker.track(ObjectReleaseTracker.java:54)
at org.apache.solr.core.SolrCore.<init>(SolrCore.java:1227)
at org.apache.solr.core.SolrCore.<init>(SolrCore.java:1050)
at org.apache.solr.core.CoreContainer.createFromDescriptor(CoreContainer.java:1700)
at org.apache.solr.core.CoreContainer.lambda$loadInternal$9(CoreContainer.java:1048)
at com.codahale.metrics.InstrumentedExecutorService$InstrumentedRunnable.run(InstrumentedExecutorService.java:212)
at org.apache.solr.common.util.ExecutorUtil$MDCAwareThreadPoolExecutor.lambda$execute$0(ExecutorUtil.java:381)
at java.base/java.util.concurrent.ThreadPoolExecutor.runWorker(ThreadPoolExecutor.java:1095)
at java.base/java.util.concurrent.ThreadPoolExecutor$Worker.run(ThreadPoolExecutor.java:619)
at java.base/java.lang.Thread.run(Thread.java:1447)
Caused by: java.lang.Exception: Submitter stack trace
at org.apache.solr.common.util.ExecutorUtil$MDCAwareThreadPoolExecutor.execute(ExecutorUtil.java:348)
at com.codahale.metrics.InstrumentedExecutorService.execute(InstrumentedExecutorService.java:95)
at org.apache.solr.core.CoreContainer.loadInternal(CoreContainer.java:1037)
at org.apache.solr.core.CoreContainer.load(CoreContainer.java:736)
at org.apache.solr.servlet.CoreContainerProvider.createCoreContainer(CoreContainerProvider.java:396)
at org.apache.solr.servlet.CoreContainerProvider.init(CoreContainerProvider.java:219)
at org.apache.solr.servlet.CoreContainerProvider.contextInitialized(CoreContainerProvider.java:106)
at org.apache.solr.embedded.JettySolrRunner$1.contextInitialized(JettySolrRunner.java:391)
at org.eclipse.jetty.ee10.servlet.ServletContextHandler.callContextInitialized(ServletContextHandler.java:1591)
at org.eclipse.jetty.ee10.servlet.ServletContextHandler.contextInitialized(ServletContextHandler.java:500)
at org.eclipse.jetty.ee10.servlet.ServletHandler.initialize(ServletHandler.java:676)
at org.eclipse.jetty.ee10.servlet.ServletContextHandler.startContext(ServletContextHandler.java:1325)
at org.eclipse.jetty.ee10.servlet.ServletContextHandler.lambda$doStart$0(ServletContextHandler.java:1051)
at org.eclipse.jetty.server.handler.ContextHandler$ScopedContext.call(ContextHandler.java:1456)
at org.eclipse.jetty.ee10.servlet.ServletContextHandler.doStart(ServletContextHandler.java:1048)
at org.eclipse.jetty.util.component.AbstractLifeCycle.start(AbstractLifeCycle.java:93)
at org.eclipse.jetty.util.component.ContainerLifeCycle.start(ContainerLifeCycle.java:169)
at org.eclipse.jetty.util.component.ContainerLifeCycle.doStart(ContainerLifeCycle.java:120)
at org.eclipse.jetty.server.Handler$Abstract.doStart(Handler.java:491)
at org.eclipse.jetty.util.component.AbstractLifeCycle.start(AbstractLifeCycle.java:93)
at org.eclipse.jetty.util.component.ContainerLifeCycle.start(ContainerLifeCycle.java:169)
at org.eclipse.jetty.util.component.ContainerLifeCycle.doStart(ContainerLifeCycle.java:120)
at org.eclipse.jetty.server.Handler$Abstract.doStart(Handler.java:491)
at org.eclipse.jetty.server.handler.gzip.GzipHandler.doStart(GzipHandler.java:132)
at org.eclipse.jetty.util.component.AbstractLifeCycle.start(AbstractLifeCycle.java:93)
at org.eclipse.jetty.util.component.ContainerLifeCycle.start(ContainerLifeCycle.java:169)
at org.eclipse.jetty.util.component.ContainerLifeCycle.doStart(ContainerLifeCycle.java:120)
at org.eclipse.jetty.server.Handler$Abstract.doStart(Handler.java:491)
at org.eclipse.jetty.util.component.AbstractLifeCycle.start(AbstractLifeCycle.java:93)
at org.eclipse.jetty.util.component.ContainerLifeCycle.start(ContainerLifeCycle.java:169)
at org.eclipse.jetty.server.Server.start(Server.java:643)
at org.eclipse.jetty.util.component.ContainerLifeCycle.doStart(ContainerLifeCycle.java:120)
at org.eclipse.jetty.server.Handler$Abstract.doStart(Handler.java:491)
at org.eclipse.jetty.server.Server.doStart(Server.java:584)
at org.eclipse.jetty.util.component.AbstractLifeCycle.start(AbstractLifeCycle.java:93)
at org.apache.solr.embedded.JettySolrRunner.retryOnPortBindFailure(JettySolrRunner.java:582)
at org.apache.solr.embedded.JettySolrRunner.start(JettySolrRunner.java:528)
at org.apache.solr.embedded.JettySolrRunner.start(JettySolrRunner.java:499)
at org.apache.solr.handler.ReplicationTestHelper.createAndStartJetty(ReplicationTestHelper.java:73)
at org.apache.solr.handler.TestUserManagedReplicationWithAuth.setUp(TestUserManagedReplicationWithAuth.java:105)
at java.base/jdk.internal.reflect.DirectMethodHandleAccessor.invoke(DirectMethodHandleAccessor.java:104)
at java.base/java.lang.reflect.Method.invoke(Method.java:565)
at com.carrotsearch.randomizedtesting.RandomizedRunner.invoke(RandomizedRunner.java:1763)
at com.carrotsearch.randomizedtesting.RandomizedRunner$9.evaluate(RandomizedRunner.java:980)
at com.carrotsearch.randomizedtesting.RandomizedRunner$10.evaluate(RandomizedRunner.java:996)
at com.carrotsearch.randomizedtesting.rules.SystemPropertiesRestoreRule$1.evaluate(SystemPropertiesRestoreRule.java:80)
at org.junit.rules.RunRules.evaluate(RunRules.java:20)
at org.apache.lucene.tests.util.TestRuleSetupTeardownChained$1.evaluate(TestRuleSetupTeardownChained.java:48)
at org.apache.lucene.tests.util.AbstractBeforeAfterRule$1.evaluate(AbstractBeforeAfterRule.java:43)
at org.apache.lucene.tests.util.TestRuleThreadAndTestName$1.evaluate(TestRuleThreadAndTestName.java:45)
at org.apache.lucene.tests.util.TestRuleIgnoreAfterMaxFailures$1.evaluate(TestRuleIgnoreAfterMaxFailures.java:60)
at org.apache.lucene.tests.util.TestRuleMarkFailure$1.evaluate(TestRuleMarkFailure.java:44)
at org.junit.rules.RunRules.evaluate(RunRules.java:20)
at com.carrotsearch.randomizedtesting.rules.StatementAdapter.evaluate(StatementAdapter.java:36)
at com.carrotsearch.randomizedtesting.ThreadLeakControl$StatementRunner.run(ThreadLeakControl.java:390)
at com.carrotsearch.randomizedtesting.ThreadLeakControl.forkTimeoutingTask(ThreadLeakControl.java:843)
at com.carrotsearch.randomizedtesting.ThreadLeakControl$3.evaluate(ThreadLeakControl.java:490)
at com.carrotsearch.randomizedtesting.RandomizedRunner.runSingleTest(RandomizedRunner.java:955)
at com.carrotsearch.randomizedtesting.RandomizedRunner$5.evaluate(RandomizedRunner.java:840)
at com.carrotsearch.randomizedtesting.RandomizedRunner$6.evaluate(RandomizedRunner.java:891)
at com.carrotsearch.randomizedtesting.RandomizedRunner$7.evaluate(RandomizedRunner.java:902)
at com.carrotsearch.randomizedtesting.rules.StatementAdapter.evaluate(StatementAdapter.java:36)
at com.carrotsearch.randomizedtesting.rules.StatementAdapter.evaluate(StatementAdapter.java:36)
at org.apache.lucene.tests.util.AbstractBeforeAfterRule$1.evaluate(AbstractBeforeAfterRule.java:43)
at com.carrotsearch.randomizedtesting.rules.SystemPropertiesRestoreRule$1.evaluate(SystemPropertiesRestoreRule.java:80)
at org.junit.rules.RunRules.evaluate(RunRules.java:20)
at org.apache.lucene.tests.util.AbstractBeforeAfterRule$1.evaluate(AbstractBeforeAfterRule.java:43)
at com.carrotsearch.randomizedtesting.rules.StatementAdapter.evaluate(StatementAdapter.java:36)
at org.apache.lucene.tests.util.TestRuleStoreClassName$1.evaluate(TestRuleStoreClassName.java:38)
at com.carrotsearch.randomizedtesting.rules.NoShadowingOrOverridesOnMethodsRule$1.evaluate(NoShadowingOrOverridesOnMethodsRule.java:40)
at com.carrotsearch.randomizedtesting.rules.NoShadowingOrOverridesOnMethodsRule$1.evaluate(NoShadowingOrOverridesOnMethodsRule.java:40)
at com.carrotsearch.randomizedtesting.rules.StatementAdapter.evaluate(StatementAdapter.java:36)
at com.carrotsearch.randomizedtesting.rules.StatementAdapter.evaluate(StatementAdapter.java:36)
at org.apache.lucene.tests.util.TestRuleAssertionsRequired$1.evaluate(TestRuleAssertionsRequired.java:53)
at org.apache.lucene.tests.util.AbstractBeforeAfterRule$1.evaluate(AbstractBeforeAfterRule.java:43)
at org.apache.lucene.tests.util.TestRuleMarkFailure$1.evaluate(TestRuleMarkFailure.java:44)
at org.apache.lucene.tests.util.TestRuleIgnoreAfterMaxFailures$1.evaluate(TestRuleIgnoreAfterMaxFailures.java:60)
at org.apache.lucene.tests.util.TestRuleIgnoreTestSuites$1.evaluate(TestRuleIgnoreTestSuites.java:47)
at org.junit.rules.RunRules.evaluate(RunRules.java:20)
at com.carrotsearch.randomizedtesting.rules.StatementAdapter.evaluate(StatementAdapter.java:36)
at com.carrotsearch.randomizedtesting.ThreadLeakControl$StatementRunner.run(ThreadLeakControl.java:390)
at com.carrotsearch.randomizedtesting.ThreadLeakControl.lambda$forkTimeoutingTask$0(ThreadLeakControl.java:850)
... 1 more
org.apache.solr.client.solrj.impl.Http2SolrClient:org.apache.solr.common.util.ObjectReleaseTracker$ObjectTrackerException: org.apache.solr.client.solrj.impl.Http2SolrClient
at org.apache.solr.common.util.ObjectReleaseTracker.track(ObjectReleaseTracker.java:54)
at org.apache.solr.client.solrj.impl.Http2SolrClient.<init>(Http2SolrClient.java:174)
at org.apache.solr.client.solrj.impl.Http2SolrClient$Builder.build(Http2SolrClient.java:1078)
at org.apache.solr.handler.IndexFetcher.createSolrClient(IndexFetcher.java:261)
at org.apache.solr.handler.IndexFetcher.<init>(IndexFetcher.java:294)
at org.apache.solr.handler.ReplicationHandler.inform(ReplicationHandler.java:1239)
at org.apache.solr.core.SolrResourceLoader.inform(SolrResourceLoader.java:757)
at org.apache.solr.core.SolrCore.<init>(SolrCore.java:1176)
at org.apache.solr.core.SolrCore.<init>(SolrCore.java:1050)
at org.apache.solr.core.CoreContainer.createFromDescriptor(CoreContainer.java:1700)
at org.apache.solr.core.CoreContainer.lambda$loadInternal$9(CoreContainer.java:1048)
at com.codahale.metrics.InstrumentedExecutorService$InstrumentedRunnable.run(InstrumentedExecutorService.java:212)
at org.apache.solr.common.util.ExecutorUtil$MDCAwareThreadPoolExecutor.lambda$execute$0(ExecutorUtil.java:381)
at java.base/java.util.concurrent.ThreadPoolExecutor.runWorker(ThreadPoolExecutor.java:1095)
at java.base/java.util.concurrent.ThreadPoolExecutor$Worker.run(ThreadPoolExecutor.java:619)
at java.base/java.lang.Thread.run(Thread.java:1447)
Caused by: java.lang.Exception: Submitter stack trace
at org.apache.solr.common.util.ExecutorUtil$MDCAwareThreadPoolExecutor.execute(ExecutorUtil.java:348)
at com.codahale.metrics.InstrumentedExecutorService.execute(InstrumentedExecutorService.java:95)
at org.apache.solr.core.CoreContainer.loadInternal(CoreContainer.java:1037)
at org.apache.solr.core.CoreContainer.load(CoreContainer.java:736)
at org.apache.solr.servlet.CoreContainerProvider.createCoreContainer(CoreContainerProvider.java:396)
at org.apache.solr.servlet.CoreContainerProvider.init(CoreContainerProvider.java:219)
at org.apache.solr.servlet.CoreContainerProvider.contextInitialized(CoreContainerProvider.java:106)
at org.apache.solr.embedded.JettySolrRunner$1.contextInitialized(JettySolrRunner.java:391)
at org.eclipse.jetty.ee10.servlet.ServletContextHandler.callContextInitialized(ServletContextHandler.java:1591)
at org.eclipse.jetty.ee10.servlet.ServletContextHandler.contextInitialized(ServletContextHandler.java:500)
at org.eclipse.jetty.ee10.servlet.ServletHandler.initialize(ServletHandler.java:676)
at org.eclipse.jetty.ee10.servlet.ServletContextHandler.startContext(ServletContextHandler.java:1325)
at org.eclipse.jetty.ee10.servlet.ServletContextHandler.lambda$doStart$0(ServletContextHandler.java:1051)
at org.eclipse.jetty.server.handler.ContextHandler$ScopedContext.call(ContextHandler.java:1456)
at org.eclipse.jetty.ee10.servlet.ServletContextHandler.doStart(ServletContextHandler.java:1048)
at org.eclipse.jetty.util.component.AbstractLifeCycle.start(AbstractLifeCycle.java:93)
at org.eclipse.jetty.util.component.ContainerLifeCycle.start(ContainerLifeCycle.java:169)
at org.eclipse.jetty.util.component.ContainerLifeCycle.doStart(ContainerLifeCycle.java:120)
at org.eclipse.jetty.server.Handler$Abstract.doStart(Handler.java:491)
at org.eclipse.jetty.util.component.AbstractLifeCycle.start(AbstractLifeCycle.java:93)
at org.eclipse.jetty.util.component.ContainerLifeCycle.start(ContainerLifeCycle.java:169)
at org.eclipse.jetty.util.component.ContainerLifeCycle.doStart(ContainerLifeCycle.java:120)
at org.eclipse.jetty.server.Handler$Abstract.doStart(Handler.java:491)
at org.eclipse.jetty.server.handler.gzip.GzipHandler.doStart(GzipHandler.java:132)
at org.eclipse.jetty.util.component.AbstractLifeCycle.start(AbstractLifeCycle.java:93)
at org.eclipse.jetty.util.component.ContainerLifeCycle.start(ContainerLifeCycle.java:169)
at org.eclipse.jetty.util.component.ContainerLifeCycle.doStart(ContainerLifeCycle.java:120)
at org.eclipse.jetty.server.Handler$Abstract.doStart(Handler.java:491)
at org.eclipse.jetty.util.component.AbstractLifeCycle.start(AbstractLifeCycle.java:93)
at org.eclipse.jetty.util.component.ContainerLifeCycle.start(ContainerLifeCycle.java:169)
at org.eclipse.jetty.server.Server.start(Server.java:643)
at org.eclipse.jetty.util.component.ContainerLifeCycle.doStart(ContainerLifeCycle.java:120)
at org.eclipse.jetty.server.Handler$Abstract.doStart(Handler.java:491)
at org.eclipse.jetty.server.Server.doStart(Server.java:584)
at org.eclipse.jetty.util.component.AbstractLifeCycle.start(AbstractLifeCycle.java:93)
at org.apache.solr.embedded.JettySolrRunner.retryOnPortBindFailure(JettySolrRunner.java:582)
at org.apache.solr.embedded.JettySolrRunner.start(JettySolrRunner.java:528)
at org.apache.solr.embedded.JettySolrRunner.start(JettySolrRunner.java:499)
at org.apache.solr.handler.ReplicationTestHelper.createAndStartJetty(ReplicationTestHelper.java:73)
at org.apache.solr.handler.TestUserManagedReplicationWithAuth.setUp(TestUserManagedReplicationWithAuth.java:105)
at java.base/jdk.internal.reflect.DirectMethodHandleAccessor.invoke(DirectMethodHandleAccessor.java:104)
at java.base/java.lang.reflect.Method.invoke(Method.java:565)
at com.carrotsearch.randomizedtesting.RandomizedRunner.invoke(RandomizedRunner.java:1763)
at com.carrotsearch.randomizedtesting.RandomizedRunner$9.evaluate(RandomizedRunner.java:980)
at com.carrotsearch.randomizedtesting.RandomizedRunner$10.evaluate(RandomizedRunner.java:996)
at com.carrotsearch.randomizedtesting.rules.SystemPropertiesRestoreRule$1.evaluate(SystemPropertiesRestoreRule.java:80)
at org.junit.rules.RunRules.evaluate(RunRules.java:20)
at org.apache.lucene.tests.util.TestRuleSetupTeardownChained$1.evaluate(TestRuleSetupTeardownChained.java:48)
at org.apache.lucene.tests.util.AbstractBeforeAfterRule$1.evaluate(AbstractBeforeAfterRule.java:43)
at org.apache.lucene.tests.util.TestRuleThreadAndTestName$1.evaluate(TestRuleThreadAndTestName.java:45)
at org.apache.lucene.tests.util.TestRuleIgnoreAfterMaxFailures$1.evaluate(TestRuleIgnoreAfterMaxFailures.java:60)
at org.apache.lucene.tests.util.TestRuleMarkFailure$1.evaluate(TestRuleMarkFailure.java:44)
at org.junit.rules.RunRules.evaluate(RunRules.java:20)
at com.carrotsearch.randomizedtesting.rules.StatementAdapter.evaluate(StatementAdapter.java:36)
at com.carrotsearch.randomizedtesting.ThreadLeakControl$StatementRunner.run(ThreadLeakControl.java:390)
at com.carrotsearch.randomizedtesting.ThreadLeakControl.forkTimeoutingTask(ThreadLeakControl.java:843)
at com.carrotsearch.randomizedtesting.ThreadLeakControl$3.evaluate(ThreadLeakControl.java:490)
at com.carrotsearch.randomizedtesting.RandomizedRunner.runSingleTest(RandomizedRunner.java:955)
at com.carrotsearch.randomizedtesting.RandomizedRunner$5.evaluate(RandomizedRunner.java:840)
at com.carrotsearch.randomizedtesting.RandomizedRunner$6.evaluate(RandomizedRunner.java:891)
at com.carrotsearch.randomizedtesting.RandomizedRunner$7.evaluate(RandomizedRunner.java:902)
at com.carrotsearch.randomizedtesting.rules.StatementAdapter.evaluate(StatementAdapter.java:36)
at com.carrotsearch.randomizedtesting.rules.StatementAdapter.evaluate(StatementAdapter.java:36)
at org.apache.lucene.tests.util.AbstractBeforeAfterRule$1.evaluate(AbstractBeforeAfterRule.java:43)
at com.carrotsearch.randomizedtesting.rules.SystemPropertiesRestoreRule$1.evaluate(SystemPropertiesRestoreRule.java:80)
at org.junit.rules.RunRules.evaluate(RunRules.java:20)
at org.apache.lucene.tests.util.AbstractBeforeAfterRule$1.evaluate(AbstractBeforeAfterRule.java:43)
at com.carrotsearch.randomizedtesting.rules.StatementAdapter.evaluate(StatementAdapter.java:36)
at org.apache.lucene.tests.util.TestRuleStoreClassName$1.evaluate(TestRuleStoreClassName.java:38)
at com.carrotsearch.randomizedtesting.rules.NoShadowingOrOverridesOnMethodsRule$1.evaluate(NoShadowingOrOverridesOnMethodsRule.java:40)
at com.carrotsearch.randomizedtesting.rules.NoShadowingOrOverridesOnMethodsRule$1.evaluate(NoShadowingOrOverridesOnMethodsRule.java:40)
at com.carrotsearch.randomizedtesting.rules.StatementAdapter.evaluate(StatementAdapter.java:36)
at com.carrotsearch.randomizedtesting.rules.StatementAdapter.evaluate(StatementAdapter.java:36)
at org.apache.lucene.tests.util.TestRuleAssertionsRequired$1.evaluate(TestRuleAssertionsRequired.java:53)
at org.apache.lucene.tests.util.AbstractBeforeAfterRule$1.evaluate(AbstractBeforeAfterRule.java:43)
at org.apache.lucene.tests.util.TestRuleMarkFailure$1.evaluate(TestRuleMarkFailure.java:44)
at org.apache.lucene.tests.util.TestRuleIgnoreAfterMaxFailures$1.evaluate(TestRuleIgnoreAfterMaxFailures.java:60)
at org.apache.lucene.tests.util.TestRuleIgnoreTestSuites$1.evaluate(TestRuleIgnoreTestSuites.java:47)
at org.junit.rules.RunRules.evaluate(RunRules.java:20)
at com.carrotsearch.randomizedtesting.rules.StatementAdapter.evaluate(StatementAdapter.java:36)
at com.carrotsearch.randomizedtesting.ThreadLeakControl$StatementRunner.run(ThreadLeakControl.java:390)
at com.carrotsearch.randomizedtesting.ThreadLeakControl.lambda$forkTimeoutingTask$0(ThreadLeakControl.java:850)
... 1 more
org.apache.lucene.tests.store.MockDirectoryWrapper:org.apache.solr.common.util.ObjectReleaseTracker$ObjectTrackerException: org.apache.lucene.tests.store.MockDirectoryWrapper
at org.apache.solr.common.util.ObjectReleaseTracker.track(ObjectReleaseTracker.java:54)
at org.apache.solr.core.CachingDirectoryFactory.get(CachingDirectoryFactory.java:405)
at org.apache.solr.update.SolrIndexWriter.create(SolrIndexWriter.java:108)
at org.apache.solr.core.SolrCore.initIndex(SolrCore.java:900)
at org.apache.solr.core.SolrCore.<init>(SolrCore.java:1127)
at org.apache.solr.core.SolrCore.<init>(SolrCore.java:1050)
at org.apache.solr.core.CoreContainer.createFromDescriptor(CoreContainer.java:1700)
at org.apache.solr.core.CoreContainer.lambda$loadInternal$9(CoreContainer.java:1048)
at com.codahale.metrics.InstrumentedExecutorService$InstrumentedRunnable.run(InstrumentedExecutorService.java:212)
at org.apache.solr.common.util.ExecutorUtil$MDCAwareThreadPoolExecutor.lambda$execute$0(ExecutorUtil.java:381)
at java.base/java.util.concurrent.ThreadPoolExecutor.runWorker(ThreadPoolExecutor.java:1095)
at java.base/java.util.concurrent.ThreadPoolExecutor$Worker.run(ThreadPoolExecutor.java:619)
at java.base/java.lang.Thread.run(Thread.java:1447)
Caused by: java.lang.Exception: Submitter stack trace
at org.apache.solr.common.util.ExecutorUtil$MDCAwareThreadPoolExecutor.execute(ExecutorUtil.java:348)
at com.codahale.metrics.InstrumentedExecutorService.execute(InstrumentedExecutorService.java:95)
at org.apache.solr.core.CoreContainer.loadInternal(CoreContainer.java:1037)
at org.apache.solr.core.CoreContainer.load(CoreContainer.java:736)
at org.apache.solr.servlet.CoreContainerProvider.createCoreContainer(CoreContainerProvider.java:396)
at org.apache.solr.servlet.CoreContainerProvider.init(CoreContainerProvider.java:219)
at org.apache.solr.servlet.CoreContainerProvider.contextInitialized(CoreContainerProvider.java:106)
at org.apache.solr.embedded.JettySolrRunner$1.contextInitialized(JettySolrRunner.java:391)
at org.eclipse.jetty.ee10.servlet.ServletContextHandler.callContextInitialized(ServletContextHandler.java:1591)
at org.eclipse.jetty.ee10.servlet.ServletContextHandler.contextInitialized(ServletContextHandler.java:500)
at org.eclipse.jetty.ee10.servlet.ServletHandler.initialize(ServletHandler.java:676)
at org.eclipse.jetty.ee10.servlet.ServletContextHandler.startContext(ServletContextHandler.java:1325)
at org.eclipse.jetty.ee10.servlet.ServletContextHandler.lambda$doStart$0(ServletContextHandler.java:1051)
at org.eclipse.jetty.server.handler.ContextHandler$ScopedContext.call(ContextHandler.java:1456)
at org.eclipse.jetty.ee10.servlet.ServletContextHandler.doStart(ServletContextHandler.java:1048)
at org.eclipse.jetty.util.component.AbstractLifeCycle.start(AbstractLifeCycle.java:93)
at org.eclipse.jetty.util.component.ContainerLifeCycle.start(ContainerLifeCycle.java:169)
at org.eclipse.jetty.util.component.ContainerLifeCycle.doStart(ContainerLifeCycle.java:120)
at org.eclipse.jetty.server.Handler$Abstract.doStart(Handler.java:491)
at org.eclipse.jetty.util.component.AbstractLifeCycle.start(AbstractLifeCycle.java:93)
at org.eclipse.jetty.util.component.ContainerLifeCycle.start(ContainerLifeCycle.java:169)
at org.eclipse.jetty.util.component.ContainerLifeCycle.doStart(ContainerLifeCycle.java:120)
at org.eclipse.jetty.server.Handler$Abstract.doStart(Handler.java:491)
at org.eclipse.jetty.server.handler.gzip.GzipHandler.doStart(GzipHandler.java:132)
at org.eclipse.jetty.util.component.AbstractLifeCycle.start(AbstractLifeCycle.java:93)
at org.eclipse.jetty.util.component.ContainerLifeCycle.start(ContainerLifeCycle.java:169)
at org.eclipse.jetty.util.component.ContainerLifeCycle.doStart(ContainerLifeCycle.java:120)
at org.eclipse.jetty.server.Handler$Abstract.doStart(Handler.java:491)
at org.eclipse.jetty.util.component.AbstractLifeCycle.start(AbstractLifeCycle.java:93)
at org.eclipse.jetty.util.component.ContainerLifeCycle.start(ContainerLifeCycle.java:169)
at org.eclipse.jetty.server.Server.start(Server.java:643)
at org.eclipse.jetty.util.component.ContainerLifeCycle.doStart(ContainerLifeCycle.java:120)
at org.eclipse.jetty.server.Handler$Abstract.doStart(Handler.java:491)
at org.eclipse.jetty.server.Server.doStart(Server.java:584)
at org.eclipse.jetty.util.component.AbstractLifeCycle.start(AbstractLifeCycle.java:93)
at org.apache.solr.embedded.JettySolrRunner.retryOnPortBindFailure(JettySolrRunner.java:582)
at org.apache.solr.embedded.JettySolrRunner.start(JettySolrRunner.java:528)
at org.apache.solr.embedded.JettySolrRunner.start(JettySolrRunner.java:499)
at org.apache.solr.handler.ReplicationTestHelper.createAndStartJetty(ReplicationTestHelper.java:73)
at org.apache.solr.handler.TestUserManagedReplicationWithAuth.setUp(TestUserManagedReplicationWithAuth.java:105)
at java.base/jdk.internal.reflect.DirectMethodHandleAccessor.invoke(DirectMethodHandleAccessor.java:104)
at java.base/java.lang.reflect.Method.invoke(Method.java:565)
at com.carrotsearch.randomizedtesting.RandomizedRunner.invoke(RandomizedRunner.java:1763)
at com.carrotsearch.randomizedtesting.RandomizedRunner$9.evaluate(RandomizedRunner.java:980)
at com.carrotsearch.randomizedtesting.RandomizedRunner$10.evaluate(RandomizedRunner.java:996)
at com.carrotsearch.randomizedtesting.rules.SystemPropertiesRestoreRule$1.evaluate(SystemPropertiesRestoreRule.java:80)
at org.junit.rules.RunRules.evaluate(RunRules.java:20)
at org.apache.lucene.tests.util.TestRuleSetupTeardownChained$1.evaluate(TestRuleSetupTeardownChained.java:48)
at org.apache.lucene.tests.util.AbstractBeforeAfterRule$1.evaluate(AbstractBeforeAfterRule.java:43)
at org.apache.lucene.tests.util.TestRuleThreadAndTestName$1.evaluate(TestRuleThreadAndTestName.java:45)
at org.apache.lucene.tests.util.TestRuleIgnoreAfterMaxFailures$1.evaluate(TestRuleIgnoreAfterMaxFailures.java:60)
at org.apache.lucene.tests.util.TestRuleMarkFailure$1.evaluate(TestRuleMarkFailure.java:44)
at org.junit.rules.RunRules.evaluate(RunRules.java:20)
at com.carrotsearch.randomizedtesting.rules.StatementAdapter.evaluate(StatementAdapter.java:36)
at com.carrotsearch.randomizedtesting.ThreadLeakControl$StatementRunner.run(ThreadLeakControl.java:390)
at com.carrotsearch.randomizedtesting.ThreadLeakControl.forkTimeoutingTask(ThreadLeakControl.java:843)
at com.carrotsearch.randomizedtesting.ThreadLeakControl$3.evaluate(ThreadLeakControl.java:490)
at com.carrotsearch.randomizedtesting.RandomizedRunner.runSingleTest(RandomizedRunner.java:955)
at com.carrotsearch.randomizedtesting.RandomizedRunner$5.evaluate(RandomizedRunner.java:840)
at com.carrotsearch.randomizedtesting.RandomizedRunner$6.evaluate(RandomizedRunner.java:891)
at com.carrotsearch.randomizedtesting.RandomizedRunner$7.evaluate(RandomizedRunner.java:902)
at com.carrotsearch.randomizedtesting.rules.StatementAdapter.evaluate(StatementAdapter.java:36)
at com.carrotsearch.randomizedtesting.rules.StatementAdapter.evaluate(StatementAdapter.java:36)
at org.apache.lucene.tests.util.AbstractBeforeAfterRule$1.evaluate(AbstractBeforeAfterRule.java:43)
at com.carrotsearch.randomizedtesting.rules.SystemPropertiesRestoreRule$1.evaluate(SystemPropertiesRestoreRule.java:80)
at org.junit.rules.RunRules.evaluate(RunRules.java:20)
at org.apache.lucene.tests.util.AbstractBeforeAfterRule$1.evaluate(AbstractBeforeAfterRule.java:43)
at com.carrotsearch.randomizedtesting.rules.StatementAdapter.evaluate(StatementAdapter.java:36)
at org.apache.lucene.tests.util.TestRuleStoreClassName$1.evaluate(TestRuleStoreClassName.java:38)
at com.carrotsearch.randomizedtesting.rules.NoShadowingOrOverridesOnMethodsRule$1.evaluate(NoShadowingOrOverridesOnMethodsRule.java:40)
at com.carrotsearch.randomizedtesting.rules.NoShadowingOrOverridesOnMethodsRule$1.evaluate(NoShadowingOrOverridesOnMethodsRule.java:40)
at com.carrotsearch.randomizedtesting.rules.StatementAdapter.evaluate(StatementAdapter.java:36)
at com.carrotsearch.randomizedtesting.rules.StatementAdapter.evaluate(StatementAdapter.java:36)
at org.apache.lucene.tests.util.TestRuleAssertionsRequired$1.evaluate(TestRuleAssertionsRequired.java:53)
at org.apache.lucene.tests.util.AbstractBeforeAfterRule$1.evaluate(AbstractBeforeAfterRule.java:43)
at org.apache.lucene.tests.util.TestRuleMarkFailure$1.evaluate(TestRuleMarkFailure.java:44)
at org.apache.lucene.tests.util.TestRuleIgnoreAfterMaxFailures$1.evaluate(TestRuleIgnoreAfterMaxFailures.java:60)
at org.apache.lucene.tests.util.TestRuleIgnoreTestSuites$1.evaluate(TestRuleIgnoreTestSuites.java:47)
at org.junit.rules.RunRules.evaluate(RunRules.java:20)
at com.carrotsearch.randomizedtesting.rules.StatementAdapter.evaluate(StatementAdapter.java:36)
at com.carrotsearch.randomizedtesting.ThreadLeakControl$StatementRunner.run(ThreadLeakControl.java:390)
at com.carrotsearch.randomizedtesting.ThreadLeakControl.lambda$forkTimeoutingTask$0(ThreadLeakControl.java:850)
... 1 more
org.apache.lucene.tests.store.MockDirectoryWrapper:org.apache.solr.common.util.ObjectReleaseTracker$ObjectTrackerException: org.apache.lucene.tests.store.MockDirectoryWrapper
at org.apache.solr.common.util.ObjectReleaseTracker.track(ObjectReleaseTracker.java:54)
at org.apache.solr.core.CachingDirectoryFactory.get(CachingDirectoryFactory.java:405)
at org.apache.solr.core.SolrCore.initSnapshotMetaDataManager(SolrCore.java:606)
at org.apache.solr.core.SolrCore.<init>(SolrCore.java:1123)
at org.apache.solr.core.SolrCore.<init>(SolrCore.java:1050)
at org.apache.solr.core.CoreContainer.createFromDescriptor(CoreContainer.java:1700)
at org.apache.solr.core.CoreContainer.lambda$loadInternal$9(CoreContainer.java:1048)
at com.codahale.metrics.InstrumentedExecutorService$InstrumentedRunnable.run(InstrumentedExecutorService.java:212)
at org.apache.solr.common.util.ExecutorUtil$MDCAwareThreadPoolExecutor.lambda$execute$0(ExecutorUtil.java:381)
at java.base/java.util.concurrent.ThreadPoolExecutor.runWorker(ThreadPoolExecutor.java:1095)
at java.base/java.util.concurrent.ThreadPoolExecutor$Worker.run(ThreadPoolExecutor.java:619)
at java.base/java.lang.Thread.run(Thread.java:1447)
Caused by: java.lang.Exception: Submitter stack trace
at org.apache.solr.common.util.ExecutorUtil$MDCAwareThreadPoolExecutor.execute(ExecutorUtil.java:348)
at com.codahale.metrics.InstrumentedExecutorService.execute(InstrumentedExecutorService.java:95)
at org.apache.solr.core.CoreContainer.loadInternal(CoreContainer.java:1037)
at org.apache.solr.core.CoreContainer.load(CoreContainer.java:736)
at org.apache.solr.servlet.CoreContainerProvider.createCoreContainer(CoreContainerProvider.java:396)
at org.apache.solr.servlet.CoreContainerProvider.init(CoreContainerProvider.java:219)
at org.apache.solr.servlet.CoreContainerProvider.contextInitialized(CoreContainerProvider.java:106)
at org.apache.solr.embedded.JettySolrRunner$1.contextInitialized(JettySolrRunner.java:391)
at org.eclipse.jetty.ee10.servlet.ServletContextHandler.callContextInitialized(ServletContextHandler.java:1591)
at org.eclipse.jetty.ee10.servlet.ServletContextHandler.contextInitialized(ServletContextHandler.java:500)
at org.eclipse.jetty.ee10.servlet.ServletHandler.initialize(ServletHandler.java:676)
at org.eclipse.jetty.ee10.servlet.ServletContextHandler.startContext(ServletContextHandler.java:1325)
at org.eclipse.jetty.ee10.servlet.ServletContextHandler.lambda$doStart$0(ServletContextHandler.java:1051)
at org.eclipse.jetty.server.handler.ContextHandler$ScopedContext.call(ContextHandler.java:1456)
at org.eclipse.jetty.ee10.servlet.ServletContextHandler.doStart(ServletContextHandler.java:1048)
at org.eclipse.jetty.util.component.AbstractLifeCycle.start(AbstractLifeCycle.java:93)
at org.eclipse.jetty.util.component.ContainerLifeCycle.start(ContainerLifeCycle.java:169)
at org.eclipse.jetty.util.component.ContainerLifeCycle.doStart(ContainerLifeCycle.java:120)
at org.eclipse.jetty.server.Handler$Abstract.doStart(Handler.java:491)
at org.eclipse.jetty.util.component.AbstractLifeCycle.start(AbstractLifeCycle.java:93)
at org.eclipse.jetty.util.component.ContainerLifeCycle.start(ContainerLifeCycle.java:169)
at org.eclipse.jetty.util.component.ContainerLifeCycle.doStart(ContainerLifeCycle.java:120)
at org.eclipse.jetty.server.Handler$Abstract.doStart(Handler.java:491)
at org.eclipse.jetty.server.handler.gzip.GzipHandler.doStart(GzipHandler.java:132)
at org.eclipse.jetty.util.component.AbstractLifeCycle.start(AbstractLifeCycle.java:93)
at org.eclipse.jetty.util.component.ContainerLifeCycle.start(ContainerLifeCycle.java:169)
at org.eclipse.jetty.util.component.ContainerLifeCycle.doStart(ContainerLifeCycle.java:120)
at org.eclipse.jetty.server.Handler$Abstract.doStart(Handler.java:491)
at org.eclipse.jetty.util.component.AbstractLifeCycle.start(AbstractLifeCycle.java:93)
at org.eclipse.jetty.util.component.ContainerLifeCycle.start(ContainerLifeCycle.java:169)
at org.eclipse.jetty.server.Server.start(Server.java:643)
at org.eclipse.jetty.util.component.ContainerLifeCycle.doStart(ContainerLifeCycle.java:120)
at org.eclipse.jetty.server.Handler$Abstract.doStart(Handler.java:491)
at org.eclipse.jetty.server.Server.doStart(Server.java:584)
at org.eclipse.jetty.util.component.AbstractLifeCycle.start(AbstractLifeCycle.java:93)
at org.apache.solr.embedded.JettySolrRunner.retryOnPortBindFailure(JettySolrRunner.java:582)
at org.apache.solr.embedded.JettySolrRunner.start(JettySolrRunner.java:528)
at org.apache.solr.embedded.JettySolrRunner.start(JettySolrRunner.java:499)
at org.apache.solr.handler.ReplicationTestHelper.createAndStartJetty(ReplicationTestHelper.java:73)
at org.apache.solr.handler.TestUserManagedReplicationWithAuth.setUp(TestUserManagedReplicationWithAuth.java:105)
at java.base/jdk.internal.reflect.DirectMethodHandleAccessor.invoke(DirectMethodHandleAccessor.java:104)
at java.base/java.lang.reflect.Method.invoke(Method.java:565)
at com.carrotsearch.randomizedtesting.RandomizedRunner.invoke(RandomizedRunner.java:1763)
at com.carrotsearch.randomizedtesting.RandomizedRunner$9.evaluate(RandomizedRunner.java:980)
at com.carrotsearch.randomizedtesting.RandomizedRunner$10.evaluate(RandomizedRunner.java:996)
at com.carrotsearch.randomizedtesting.rules.SystemPropertiesRestoreRule$1.evaluate(SystemPropertiesRestoreRule.java:80)
at org.junit.rules.RunRules.evaluate(RunRules.java:20)
at org.apache.lucene.tests.util.TestRuleSetupTeardownChained$1.evaluate(TestRuleSetupTeardownChained.java:48)
at org.apache.lucene.tests.util.AbstractBeforeAfterRule$1.evaluate(AbstractBeforeAfterRule.java:43)
at org.apache.lucene.tests.util.TestRuleThreadAndTestName$1.evaluate(TestRuleThreadAndTestName.java:45)
at org.apache.lucene.tests.util.TestRuleIgnoreAfterMaxFailures$1.evaluate(TestRuleIgnoreAfterMaxFailures.java:60)
at org.apache.lucene.tests.util.TestRuleMarkFailure$1.evaluate(TestRuleMarkFailure.java:44)
at org.junit.rules.RunRules.evaluate(RunRules.java:20)
at com.carrotsearch.randomizedtesting.rules.StatementAdapter.evaluate(StatementAdapter.java:36)
at com.carrotsearch.randomizedtesting.ThreadLeakControl$StatementRunner.run(ThreadLeakControl.java:390)
at com.carrotsearch.randomizedtesting.ThreadLeakControl.forkTimeoutingTask(ThreadLeakControl.java:843)
at com.carrotsearch.randomizedtesting.ThreadLeakControl$3.evaluate(ThreadLeakControl.java:490)
at com.carrotsearch.randomizedtesting.RandomizedRunner.runSingleTest(RandomizedRunner.java:955)
at com.carrotsearch.randomizedtesting.RandomizedRunner$5.evaluate(RandomizedRunner.java:840)
at com.carrotsearch.randomizedtesting.RandomizedRunner$6.evaluate(RandomizedRunner.java:891)
at com.carrotsearch.randomizedtesting.RandomizedRunner$7.evaluate(RandomizedRunner.java:902)
at com.carrotsearch.randomizedtesting.rules.StatementAdapter.evaluate(StatementAdapter.java:36)
at com.carrotsearch.randomizedtesting.rules.StatementAdapter.evaluate(StatementAdapter.java:36)
at org.apache.lucene.tests.util.AbstractBeforeAfterRule$1.evaluate(AbstractBeforeAfterRule.java:43)
at com.carrotsearch.randomizedtesting.rules.SystemPropertiesRestoreRule$1.evaluate(SystemPropertiesRestoreRule.java:80)
at org.junit.rules.RunRules.evaluate(RunRules.java:20)
at org.apache.lucene.tests.util.AbstractBeforeAfterRule$1.evaluate(AbstractBeforeAfterRule.java:43)
at com.carrotsearch.randomizedtesting.rules.StatementAdapter.evaluate(StatementAdapter.java:36)
at org.apache.lucene.tests.util.TestRuleStoreClassName$1.evaluate(TestRuleStoreClassName.java:38)
at com.carrotsearch.randomizedtesting.rules.NoShadowingOrOverridesOnMethodsRule$1.evaluate(NoShadowingOrOverridesOnMethodsRule.java:40)
at com.carrotsearch.randomizedtesting.rules.NoShadowingOrOverridesOnMethodsRule$1.evaluate(NoShadowingOrOverridesOnMethodsRule.java:40)
at com.carrotsearch.randomizedtesting.rules.StatementAdapter.evaluate(StatementAdapter.java:36)
at com.carrotsearch.randomizedtesting.rules.StatementAdapter.evaluate(StatementAdapter.java:36)
at org.apache.lucene.tests.util.TestRuleAssertionsRequired$1.evaluate(TestRuleAssertionsRequired.java:53)
at org.apache.lucene.tests.util.AbstractBeforeAfterRule$1.evaluate(AbstractBeforeAfterRule.java:43)
at org.apache.lucene.tests.util.TestRuleMarkFailure$1.evaluate(TestRuleMarkFailure.java:44)
at org.apache.lucene.tests.util.TestRuleIgnoreAfterMaxFailures$1.evaluate(TestRuleIgnoreAfterMaxFailures.java:60)
at org.apache.lucene.tests.util.TestRuleIgnoreTestSuites$1.evaluate(TestRuleIgnoreTestSuites.java:47)
at org.junit.rules.RunRules.evaluate(RunRules.java:20)
at com.carrotsearch.randomizedtesting.rules.StatementAdapter.evaluate(StatementAdapter.java:36)
at com.carrotsearch.randomizedtesting.ThreadLeakControl$StatementRunner.run(ThreadLeakControl.java:390)
at com.carrotsearch.randomizedtesting.ThreadLeakControl.lambda$forkTimeoutingTask$0(ThreadLeakControl.java:850)
... 1 more
org.apache.lucene.tests.store.MockDirectoryWrapper:org.apache.solr.common.util.ObjectReleaseTracker$ObjectTrackerException: org.apache.lucene.tests.store.MockDirectoryWrapper
at org.apache.solr.common.util.ObjectReleaseTracker.track(ObjectReleaseTracker.java:54)
at org.apache.solr.core.CachingDirectoryFactory.get(CachingDirectoryFactory.java:405)
at org.apache.solr.core.SolrCore.getNewIndexDir(SolrCore.java:411)
at org.apache.solr.core.SolrCore.initIndex(SolrCore.java:861)
at org.apache.solr.core.SolrCore.<init>(SolrCore.java:1127)
at org.apache.solr.core.SolrCore.<init>(SolrCore.java:1050)
at org.apache.solr.core.CoreContainer.createFromDescriptor(CoreContainer.java:1700)
at org.apache.solr.core.CoreContainer.lambda$loadInternal$9(CoreContainer.java:1048)
at com.codahale.metrics.InstrumentedExecutorService$InstrumentedRunnable.run(InstrumentedExecutorService.java:212)
at org.apache.solr.common.util.ExecutorUtil$MDCAwareThreadPoolExecutor.lambda$execute$0(ExecutorUtil.java:381)
at java.base/java.util.concurrent.ThreadPoolExecutor.runWorker(ThreadPoolExecutor.java:1095)
at java.base/java.util.concurrent.ThreadPoolExecutor$Worker.run(ThreadPoolExecutor.java:619)
at java.base/java.lang.Thread.run(Thread.java:1447)
Caused by: java.lang.Exception: Submitter stack trace
at org.apache.solr.common.util.ExecutorUtil$MDCAwareThreadPoolExecutor.execute(ExecutorUtil.java:348)
at com.codahale.metrics.InstrumentedExecutorService.execute(InstrumentedExecutorService.java:95)
at org.apache.solr.core.CoreContainer.loadInternal(CoreContainer.java:1037)
at org.apache.solr.core.CoreContainer.load(CoreContainer.java:736)
at org.apache.solr.servlet.CoreContainerProvider.createCoreContainer(CoreContainerProvider.java:396)
at org.apache.solr.servlet.CoreContainerProvider.init(CoreContainerProvider.java:219)
at org.apache.solr.servlet.CoreContainerProvider.contextInitialized(CoreContainerProvider.java:106)
at org.apache.solr.embedded.JettySolrRunner$1.contextInitialized(JettySolrRunner.java:391)
at org.eclipse.jetty.ee10.servlet.ServletContextHandler.callContextInitialized(ServletContextHandler.java:1591)
at org.eclipse.jetty.ee10.servlet.ServletContextHandler.contextInitialized(ServletContextHandler.java:500)
at org.eclipse.jetty.ee10.servlet.ServletHandler.initialize(ServletHandler.java:676)
at org.eclipse.jetty.ee10.servlet.ServletContextHandler.startContext(ServletContextHandler.java:1325)
at org.eclipse.jetty.ee10.servlet.ServletContextHandler.lambda$doStart$0(ServletContextHandler.java:1051)
at org.eclipse.jetty.server.handler.ContextHandler$ScopedContext.call(ContextHandler.java:1456)
at org.eclipse.jetty.ee10.servlet.ServletContextHandler.doStart(ServletContextHandler.java:1048)
at org.eclipse.jetty.util.component.AbstractLifeCycle.start(AbstractLifeCycle.java:93)
at org.eclipse.jetty.util.component.ContainerLifeCycle.start(ContainerLifeCycle.java:169)
at org.eclipse.jetty.util.component.ContainerLifeCycle.doStart(ContainerLifeCycle.java:120)
at org.eclipse.jetty.server.Handler$Abstract.doStart(Handler.java:491)
at org.eclipse.jetty.util.component.AbstractLifeCycle.start(AbstractLifeCycle.java:93)
at org.eclipse.jetty.util.component.ContainerLifeCycle.start(ContainerLifeCycle.java:169)
at org.eclipse.jetty.util.component.ContainerLifeCycle.doStart(ContainerLifeCycle.java:120)
at org.eclipse.jetty.server.Handler$Abstract.doStart(Handler.java:491)
at org.eclipse.jetty.server.handler.gzip.GzipHandler.doStart(GzipHandler.java:132)
at org.eclipse.jetty.util.component.AbstractLifeCycle.start(AbstractLifeCycle.java:93)
at org.eclipse.jetty.util.component.ContainerLifeCycle.start(ContainerLifeCycle.java:169)
at org.eclipse.jetty.util.component.ContainerLifeCycle.doStart(ContainerLifeCycle.java:120)
at org.eclipse.jetty.server.Handler$Abstract.doStart(Handler.java:491)
at org.eclipse.jetty.util.component.AbstractLifeCycle.start(AbstractLifeCycle.java:93)
at org.eclipse.jetty.util.component.ContainerLifeCycle.start(ContainerLifeCycle.java:169)
at org.eclipse.jetty.server.Server.start(Server.java:643)
at org.eclipse.jetty.util.component.ContainerLifeCycle.doStart(ContainerLifeCycle.java:120)
at org.eclipse.jetty.server.Handler$Abstract.doStart(Handler.java:491)
at org.eclipse.jetty.server.Server.doStart(Server.java:584)
at org.eclipse.jetty.util.component.AbstractLifeCycle.start(AbstractLifeCycle.java:93)
at org.apache.solr.embedded.JettySolrRunner.retryOnPortBindFailure(JettySolrRunner.java:582)
at org.apache.solr.embedded.JettySolrRunner.start(JettySolrRunner.java:528)
at org.apache.solr.embedded.JettySolrRunner.start(JettySolrRunner.java:499)
at org.apache.solr.handler.ReplicationTestHelper.createAndStartJetty(ReplicationTestHelper.java:73)
at org.apache.solr.handler.TestUserManagedReplicationWithAuth.setUp(TestUserManagedReplicationWithAuth.java:105)
at java.base/jdk.internal.reflect.DirectMethodHandleAccessor.invoke(DirectMethodHandleAccessor.java:104)
at java.base/java.lang.reflect.Method.invoke(Method.java:565)
at com.carrotsearch.randomizedtesting.RandomizedRunner.invoke(RandomizedRunner.java:1763)
at com.carrotsearch.randomizedtesting.RandomizedRunner$9.evaluate(RandomizedRunner.java:980)
at com.carrotsearch.randomizedtesting.RandomizedRunner$10.evaluate(RandomizedRunner.java:996)
at com.carrotsearch.randomizedtesting.rules.SystemPropertiesRestoreRule$1.evaluate(SystemPropertiesRestoreRule.java:80)
at org.junit.rules.RunRules.evaluate(RunRules.java:20)
at org.apache.lucene.tests.util.TestRuleSetupTeardownChained$1.evaluate(TestRuleSetupTeardownChained.java:48)
at org.apache.lucene.tests.util.AbstractBeforeAfterRule$1.evaluate(AbstractBeforeAfterRule.java:43)
at org.apache.lucene.tests.util.TestRuleThreadAndTestName$1.evaluate(TestRuleThreadAndTestName.java:45)
at org.apache.lucene.tests.util.TestRuleIgnoreAfterMaxFailures$1.evaluate(TestRuleIgnoreAfterMaxFailures.java:60)
at org.apache.lucene.tests.util.TestRuleMarkFailure$1.evaluate(TestRuleMarkFailure.java:44)
at org.junit.rules.RunRules.evaluate(RunRules.java:20)
at com.carrotsearch.randomizedtesting.rules.StatementAdapter.evaluate(StatementAdapter.java:36)
at com.carrotsearch.randomizedtesting.ThreadLeakControl$StatementRunner.run(ThreadLeakControl.java:390)
at com.carrotsearch.randomizedtesting.ThreadLeakControl.forkTimeoutingTask(ThreadLeakControl.java:843)
at com.carrotsearch.randomizedtesting.ThreadLeakControl$3.evaluate(ThreadLeakControl.java:490)
at com.carrotsearch.randomizedtesting.RandomizedRunner.runSingleTest(RandomizedRunner.java:955)
at com.carrotsearch.randomizedtesting.RandomizedRunner$5.evaluate(RandomizedRunner.java:840)
at com.carrotsearch.randomizedtesting.RandomizedRunner$6.evaluate(RandomizedRunner.java:891)
at com.carrotsearch.randomizedtesting.RandomizedRunner$7.evaluate(RandomizedRunner.java:902)
at com.carrotsearch.randomizedtesting.rules.StatementAdapter.evaluate(StatementAdapter.java:36)
at com.carrotsearch.randomizedtesting.rules.StatementAdapter.evaluate(StatementAdapter.java:36)
at org.apache.lucene.tests.util.AbstractBeforeAfterRule$1.evaluate(AbstractBeforeAfterRule.java:43)
at com.carrotsearch.randomizedtesting.rules.SystemPropertiesRestoreRule$1.evaluate(SystemPropertiesRestoreRule.java:80)
at org.junit.rules.RunRules.evaluate(RunRules.java:20)
at org.apache.lucene.tests.util.AbstractBeforeAfterRule$1.evaluate(AbstractBeforeAfterRule.java:43)
at com.carrotsearch.randomizedtesting.rules.StatementAdapter.evaluate(StatementAdapter.java:36)
at org.apache.lucene.tests.util.TestRuleStoreClassName$1.evaluate(TestRuleStoreClassName.java:38)
at com.carrotsearch.randomizedtesting.rules.NoShadowingOrOverridesOnMethodsRule$1.evaluate(NoShadowingOrOverridesOnMethodsRule.java:40)
at com.carrotsearch.randomizedtesting.rules.NoShadowingOrOverridesOnMethodsRule$1.evaluate(NoShadowingOrOverridesOnMethodsRule.java:40)
at com.carrotsearch.randomizedtesting.rules.StatementAdapter.evaluate(StatementAdapter.java:36)
at com.carrotsearch.randomizedtesting.rules.StatementAdapter.evaluate(StatementAdapter.java:36)
at org.apache.lucene.tests.util.TestRuleAssertionsRequired$1.evaluate(TestRuleAssertionsRequired.java:53)
at org.apache.lucene.tests.util.AbstractBeforeAfterRule$1.evaluate(AbstractBeforeAfterRule.java:43)
at org.apache.lucene.tests.util.TestRuleMarkFailure$1.evaluate(TestRuleMarkFailure.java:44)
at org.apache.lucene.tests.util.TestRuleIgnoreAfterMaxFailures$1.evaluate(TestRuleIgnoreAfterMaxFailures.java:60)
at org.apache.lucene.tests.util.TestRuleIgnoreTestSuites$1.evaluate(TestRuleIgnoreTestSuites.java:47)
at org.junit.rules.RunRules.evaluate(RunRules.java:20)
at com.carrotsearch.randomizedtesting.rules.StatementAdapter.evaluate(StatementAdapter.java:36)
at com.carrotsearch.randomizedtesting.ThreadLeakControl$StatementRunner.run(ThreadLeakControl.java:390)
at com.carrotsearch.randomizedtesting.ThreadLeakControl.lambda$forkTimeoutingTask$0(ThreadLeakControl.java:850)
... 1 more
>
at __randomizedtesting.SeedInfo.seed([7B507CA96BB8EFB6]:0)
at org.junit.Assert.fail(Assert.java:89)
at org.junit.Assert.failNotNull(Assert.java:756)
at org.junit.Assert.assertNull(Assert.java:738)
at org.apache.solr.SolrTestCase$1.afterIfSuccessful(SolrTestCase.java:104)
at com.carrotsearch.randomizedtesting.rules.TestRuleAdapter$1.afterIfSuccessful(TestRuleAdapter.java:36)
at com.carrotsearch.randomizedtesting.rules.StatementAdapter.evaluate(StatementAdapter.java:37)
at com.carrotsearch.randomizedtesting.rules.StatementAdapter.evaluate(StatementAdapter.java:36)
at org.apache.lucene.tests.util.AbstractBeforeAfterRule$1.evaluate(AbstractBeforeAfterRule.java:43)
at com.carrotsearch.randomizedtesting.rules.SystemPropertiesRestoreRule$1.evaluate(SystemPropertiesRestoreRule.java:80)
at org.junit.rules.RunRules.evaluate(RunRules.java:20)
at org.apache.lucene.tests.util.AbstractBeforeAfterRule$1.evaluate(AbstractBeforeAfterRule.java:43)
at com.carrotsearch.randomizedtesting.rules.StatementAdapter.evaluate(StatementAdapter.java:36)
at org.apache.lucene.tests.util.TestRuleStoreClassName$1.evaluate(TestRuleStoreClassName.java:38)
at com.carrotsearch.randomizedtesting.rules.NoShadowingOrOverridesOnMethodsRule$1.evaluate(NoShadowingOrOverridesOnMethodsRule.java:40)
at com.carrotsearch.randomizedtesting.rules.NoShadowingOrOverridesOnMethodsRule$1.evaluate(NoShadowingOrOverridesOnMethodsRule.java:40)
at com.carrotsearch.randomizedtesting.rules.StatementAdapter.evaluate(StatementAdapter.java:36)
at com.carrotsearch.randomizedtesting.rules.StatementAdapter.evaluate(StatementAdapter.java:36)
at org.apache.lucene.tests.util.TestRuleAssertionsRequired$1.evaluate(TestRuleAssertionsRequired.java:53)
at org.apache.lucene.tests.util.AbstractBeforeAfterRule$1.evaluate(AbstractBeforeAfterRule.java:43)
at org.apache.lucene.tests.util.TestRuleMarkFailure$1.evaluate(TestRuleMarkFailure.java:44)
at org.apache.lucene.tests.util.TestRuleIgnoreAfterMaxFailures$1.evaluate(TestRuleIgnoreAfterMaxFailures.java:60)
at org.apache.lucene.tests.util.TestRuleIgnoreTestSuites$1.evaluate(TestRuleIgnoreTestSuites.java:47)
at org.junit.rules.RunRules.evaluate(RunRules.java:20)
at com.carrotsearch.randomizedtesting.rules.StatementAdapter.evaluate(StatementAdapter.java:36)
at com.carrotsearch.randomizedtesting.ThreadLeakControl$StatementRunner.run(ThreadLeakControl.java:390)
at com.carrotsearch.randomizedtesting.ThreadLeakControl.lambda$forkTimeoutingTask$0(ThreadLeakControl.java:850)
at java.base/java.lang.Thread.run(Thread.java:1447)
[JENKINS] Solr-main-Windows (64bit/hotspot/jdk-25-rc+35) - Build # 7073 - Still Unstable!
Posted by Policeman Jenkins Server <je...@thetaphi.de>.
Build: https://jenkins.thetaphi.de/job/Solr-main-Windows/7073/
Java: 64bit/hotspot/jdk-25-rc+35 -XX:-UseCompressedOops -XX:+UseParallelGC
2 tests failed.
FAILED: org.apache.solr.cloud.api.collections.TestReplicaProperties.classMethod
Error Message:
com.carrotsearch.randomizedtesting.ThreadLeakError: 1 thread leaked from SUITE scope at org.apache.solr.cloud.api.collections.TestReplicaProperties:
1) Thread[id=14085, name=aliveCheckExecutor-8004-thread-1, state=TIMED_WAITING, group=TGRP-TestReplicaProperties]
at java.base/jdk.internal.misc.Unsafe.park(Native Method)
at java.base/java.util.concurrent.locks.LockSupport.parkNanos(LockSupport.java:271)
at java.base/java.util.concurrent.locks.AbstractQueuedSynchronizer$ConditionObject.awaitNanos(AbstractQueuedSynchronizer.java:1803)
at java.base/java.util.concurrent.ScheduledThreadPoolExecutor$DelayedWorkQueue.take(ScheduledThreadPoolExecutor.java:1166)
at java.base/java.util.concurrent.ScheduledThreadPoolExecutor$DelayedWorkQueue.take(ScheduledThreadPoolExecutor.java:883)
at java.base/java.util.concurrent.ThreadPoolExecutor.getTask(ThreadPoolExecutor.java:1016)
at java.base/java.util.concurrent.ThreadPoolExecutor.runWorker(ThreadPoolExecutor.java:1076)
at java.base/java.util.concurrent.ThreadPoolExecutor$Worker.run(ThreadPoolExecutor.java:614)
at java.base/java.lang.Thread.run(Thread.java:1474)
Stack Trace:
com.carrotsearch.randomizedtesting.ThreadLeakError: 1 thread leaked from SUITE scope at org.apache.solr.cloud.api.collections.TestReplicaProperties:
1) Thread[id=14085, name=aliveCheckExecutor-8004-thread-1, state=TIMED_WAITING, group=TGRP-TestReplicaProperties]
at java.base/jdk.internal.misc.Unsafe.park(Native Method)
at java.base/java.util.concurrent.locks.LockSupport.parkNanos(LockSupport.java:271)
at java.base/java.util.concurrent.locks.AbstractQueuedSynchronizer$ConditionObject.awaitNanos(AbstractQueuedSynchronizer.java:1803)
at java.base/java.util.concurrent.ScheduledThreadPoolExecutor$DelayedWorkQueue.take(ScheduledThreadPoolExecutor.java:1166)
at java.base/java.util.concurrent.ScheduledThreadPoolExecutor$DelayedWorkQueue.take(ScheduledThreadPoolExecutor.java:883)
at java.base/java.util.concurrent.ThreadPoolExecutor.getTask(ThreadPoolExecutor.java:1016)
at java.base/java.util.concurrent.ThreadPoolExecutor.runWorker(ThreadPoolExecutor.java:1076)
at java.base/java.util.concurrent.ThreadPoolExecutor$Worker.run(ThreadPoolExecutor.java:614)
at java.base/java.lang.Thread.run(Thread.java:1474)
at __randomizedtesting.SeedInfo.seed([E85355963D93C727]:0)
FAILED: org.apache.solr.cloud.api.collections.TestReplicaProperties.classMethod
Error Message:
com.carrotsearch.randomizedtesting.ThreadLeakError: There are still zombie threads that couldn't be terminated:
1) Thread[id=14085, name=aliveCheckExecutor-8004-thread-1, state=TIMED_WAITING, group=TGRP-TestReplicaProperties]
at java.base/jdk.internal.misc.Unsafe.park(Native Method)
at java.base/java.util.concurrent.locks.LockSupport.parkNanos(LockSupport.java:271)
at java.base/java.util.concurrent.locks.AbstractQueuedSynchronizer$ConditionObject.awaitNanos(AbstractQueuedSynchronizer.java:1803)
at java.base/java.util.concurrent.ScheduledThreadPoolExecutor$DelayedWorkQueue.take(ScheduledThreadPoolExecutor.java:1166)
at java.base/java.util.concurrent.ScheduledThreadPoolExecutor$DelayedWorkQueue.take(ScheduledThreadPoolExecutor.java:883)
at java.base/java.util.concurrent.ThreadPoolExecutor.getTask(ThreadPoolExecutor.java:1016)
at java.base/java.util.concurrent.ThreadPoolExecutor.runWorker(ThreadPoolExecutor.java:1076)
at java.base/java.util.concurrent.ThreadPoolExecutor$Worker.run(ThreadPoolExecutor.java:614)
at java.base/java.lang.Thread.run(Thread.java:1474)
Stack Trace:
com.carrotsearch.randomizedtesting.ThreadLeakError: There are still zombie threads that couldn't be terminated:
1) Thread[id=14085, name=aliveCheckExecutor-8004-thread-1, state=TIMED_WAITING, group=TGRP-TestReplicaProperties]
at java.base/jdk.internal.misc.Unsafe.park(Native Method)
at java.base/java.util.concurrent.locks.LockSupport.parkNanos(LockSupport.java:271)
at java.base/java.util.concurrent.locks.AbstractQueuedSynchronizer$ConditionObject.awaitNanos(AbstractQueuedSynchronizer.java:1803)
at java.base/java.util.concurrent.ScheduledThreadPoolExecutor$DelayedWorkQueue.take(ScheduledThreadPoolExecutor.java:1166)
at java.base/java.util.concurrent.ScheduledThreadPoolExecutor$DelayedWorkQueue.take(ScheduledThreadPoolExecutor.java:883)
at java.base/java.util.concurrent.ThreadPoolExecutor.getTask(ThreadPoolExecutor.java:1016)
at java.base/java.util.concurrent.ThreadPoolExecutor.runWorker(ThreadPoolExecutor.java:1076)
at java.base/java.util.concurrent.ThreadPoolExecutor$Worker.run(ThreadPoolExecutor.java:614)
at java.base/java.lang.Thread.run(Thread.java:1474)
at __randomizedtesting.SeedInfo.seed([E85355963D93C727]:0)