You are viewing a plain text version of this content. The canonical link for it is here.
Posted to builds@solr.apache.org by Apache Jenkins Server <je...@builds.apache.org> on 2026/04/26 08:38:14 UTC
[JENKINS] Solr » Solr-Test-main - Build # 13852 - Still Unstable!
Build: https://ci-builds.apache.org/job/Solr/job/Solr-Test-main/13852/
1 tests failed.
FAILED: org.apache.solr.cloud.LeaderTragicEventTest.classMethod
Error Message:
java.lang.Exception: Suite timeout exceeded (>= 7200000 msec).
Stack Trace:
java.lang.Exception: Suite timeout exceeded (>= 7200000 msec).
at __randomizedtesting.SeedInfo.seed([24B357579494118]:0)
Build Log:
[...truncated 3367 lines...]
ERROR: The following test(s) have failed:
- org.apache.solr.cloud.LeaderTragicEventTest (:solr:core)
Test history: https://develocity.apache.org/scans/tests?search.rootProjectNames=solr-root&tests.container=org.apache.solr.cloud.LeaderTragicEventTest
Test output: /home/jenkins/jenkins-agent/workspace/Solr/Solr-Test-main/solr/core/build/test-results/test/outputs/OUTPUT-org.apache.solr.cloud.LeaderTragicEventTest.txt
Reproduce with: ./gradlew :solr:core:test --tests "org.apache.solr.cloud.LeaderTragicEventTest" -Ptests.haltonfailure=false "-Ptests.jvmargs=-XX:TieredStopAtLevel=1 -XX:+UseParallelGC -XX:ActiveProcessorCount=1 -XX:ReservedCodeCacheSize=120m" -Ptests.seed=24B357579494118 -Ptests.multiplier=2 -Ptests.useSecurityManager=true -Ptests.badapples=false -Ptests.file.encoding=ISO-8859-1
Deprecated Gradle features were used in this build, making it incompatible with Gradle 9.0.
You can use '--warning-mode all' to show the individual deprecation warnings and determine if they come from your own scripts or plugins.
For more on this, please refer to https://docs.gradle.org/8.10/userguide/command_line_interface.html#sec:command_line_warnings in the Gradle documentation.
BUILD SUCCESSFUL in 2h 18m 7s
153 actionable tasks: 153 executed
Publishing Build Scan to Develocity...
https://develocity.apache.org/s/4amlgzysxmtwo
Build step 'Invoke Gradle script' changed build result to SUCCESS
Archiving artifacts
‘**/*.events’ doesn’t match anything: ‘**’ exists but not ‘**/*.events’
No artifacts found that match the file pattern "**/*.events,heapdumps/**,**/hs_err_pid*". Configuration error?
Recording test results
[Checks API] No suitable checks publisher found.
Build step 'Publish JUnit test result report' changed build result to UNSTABLE
Email was triggered for: Unstable (Test Failures)
Sending email for trigger: Unstable (Test Failures)