You are viewing a plain text version of this content. The canonical link for it is here.
Posted to dev@lucene.apache.org by Apache Jenkins Server <je...@builds.apache.org> on 2018/09/08 00:36:48 UTC

[JENKINS] Lucene-Solr-Tests-7.x - Build # 861 - Unstable

Build: https://builds.apache.org/job/Lucene-Solr-Tests-7.x/861/

2 tests failed.
FAILED:  junit.framework.TestSuite.org.apache.solr.search.SignificantTermsQParserPluginTest

Error Message:
1 thread leaked from SUITE scope at org.apache.solr.search.SignificantTermsQParserPluginTest:     1) Thread[id=13, name=Log4j2-TF-1-AsyncLoggerConfig--1, state=TIMED_WAITING, group=TGRP-SignificantTermsQParserPluginTest]         at sun.misc.Unsafe.park(Native Method)         at java.util.concurrent.locks.LockSupport.parkNanos(LockSupport.java:215)         at java.util.concurrent.locks.AbstractQueuedSynchronizer$ConditionObject.awaitNanos(AbstractQueuedSynchronizer.java:2078)         at com.lmax.disruptor.TimeoutBlockingWaitStrategy.waitFor(TimeoutBlockingWaitStrategy.java:38)         at com.lmax.disruptor.ProcessingSequenceBarrier.waitFor(ProcessingSequenceBarrier.java:56)         at com.lmax.disruptor.BatchEventProcessor.run(BatchEventProcessor.java:128)         at java.lang.Thread.run(Thread.java:748)

Stack Trace:
com.carrotsearch.randomizedtesting.ThreadLeakError: 1 thread leaked from SUITE scope at org.apache.solr.search.SignificantTermsQParserPluginTest: 
   1) Thread[id=13, name=Log4j2-TF-1-AsyncLoggerConfig--1, state=TIMED_WAITING, group=TGRP-SignificantTermsQParserPluginTest]
        at sun.misc.Unsafe.park(Native Method)
        at java.util.concurrent.locks.LockSupport.parkNanos(LockSupport.java:215)
        at java.util.concurrent.locks.AbstractQueuedSynchronizer$ConditionObject.awaitNanos(AbstractQueuedSynchronizer.java:2078)
        at com.lmax.disruptor.TimeoutBlockingWaitStrategy.waitFor(TimeoutBlockingWaitStrategy.java:38)
        at com.lmax.disruptor.ProcessingSequenceBarrier.waitFor(ProcessingSequenceBarrier.java:56)
        at com.lmax.disruptor.BatchEventProcessor.run(BatchEventProcessor.java:128)
        at java.lang.Thread.run(Thread.java:748)
	at __randomizedtesting.SeedInfo.seed([67235911D81C7B38]:0)


FAILED:  junit.framework.TestSuite.org.apache.solr.search.SignificantTermsQParserPluginTest

Error Message:
There are still zombie threads that couldn't be terminated:    1) Thread[id=13, name=Log4j2-TF-1-AsyncLoggerConfig--1, state=TIMED_WAITING, group=TGRP-SignificantTermsQParserPluginTest]         at sun.misc.Unsafe.park(Native Method)         at java.util.concurrent.locks.LockSupport.parkNanos(LockSupport.java:215)         at java.util.concurrent.locks.AbstractQueuedSynchronizer$ConditionObject.awaitNanos(AbstractQueuedSynchronizer.java:2078)         at com.lmax.disruptor.TimeoutBlockingWaitStrategy.waitFor(TimeoutBlockingWaitStrategy.java:38)         at com.lmax.disruptor.ProcessingSequenceBarrier.waitFor(ProcessingSequenceBarrier.java:56)         at com.lmax.disruptor.BatchEventProcessor.run(BatchEventProcessor.java:128)         at java.lang.Thread.run(Thread.java:748)

Stack Trace:
com.carrotsearch.randomizedtesting.ThreadLeakError: There are still zombie threads that couldn't be terminated:
   1) Thread[id=13, name=Log4j2-TF-1-AsyncLoggerConfig--1, state=TIMED_WAITING, group=TGRP-SignificantTermsQParserPluginTest]
        at sun.misc.Unsafe.park(Native Method)
        at java.util.concurrent.locks.LockSupport.parkNanos(LockSupport.java:215)
        at java.util.concurrent.locks.AbstractQueuedSynchronizer$ConditionObject.awaitNanos(AbstractQueuedSynchronizer.java:2078)
        at com.lmax.disruptor.TimeoutBlockingWaitStrategy.waitFor(TimeoutBlockingWaitStrategy.java:38)
        at com.lmax.disruptor.ProcessingSequenceBarrier.waitFor(ProcessingSequenceBarrier.java:56)
        at com.lmax.disruptor.BatchEventProcessor.run(BatchEventProcessor.java:128)
        at java.lang.Thread.run(Thread.java:748)
	at __randomizedtesting.SeedInfo.seed([67235911D81C7B38]:0)




Build Log:
[...truncated 12395 lines...]
   [junit4] Suite: org.apache.solr.search.SignificantTermsQParserPluginTest
   [junit4]   2> Sep 07, 2018 11:16:25 PM com.carrotsearch.randomizedtesting.ThreadLeakControl checkThreadLeaks
   [junit4]   2> WARNING: Will linger awaiting termination of 1 leaked thread(s).
   [junit4]   2> Sep 07, 2018 11:16:45 PM com.carrotsearch.randomizedtesting.ThreadLeakControl checkThreadLeaks
   [junit4]   2> SEVERE: 1 thread leaked from SUITE scope at org.apache.solr.search.SignificantTermsQParserPluginTest: 
   [junit4]   2>    1) Thread[id=13, name=Log4j2-TF-1-AsyncLoggerConfig--1, state=TIMED_WAITING, group=TGRP-SignificantTermsQParserPluginTest]
   [junit4]   2>         at sun.misc.Unsafe.park(Native Method)
   [junit4]   2>         at java.util.concurrent.locks.LockSupport.parkNanos(LockSupport.java:215)
   [junit4]   2>         at java.util.concurrent.locks.AbstractQueuedSynchronizer$ConditionObject.awaitNanos(AbstractQueuedSynchronizer.java:2078)
   [junit4]   2>         at com.lmax.disruptor.TimeoutBlockingWaitStrategy.waitFor(TimeoutBlockingWaitStrategy.java:38)
   [junit4]   2>         at com.lmax.disruptor.ProcessingSequenceBarrier.waitFor(ProcessingSequenceBarrier.java:56)
   [junit4]   2>         at com.lmax.disruptor.BatchEventProcessor.run(BatchEventProcessor.java:128)
   [junit4]   2>         at java.lang.Thread.run(Thread.java:748)
   [junit4]   2> Sep 07, 2018 11:16:45 PM com.carrotsearch.randomizedtesting.ThreadLeakControl tryToInterruptAll
   [junit4]   2> INFO: Starting to interrupt leaked threads:
   [junit4]   2>    1) Thread[id=13, name=Log4j2-TF-1-AsyncLoggerConfig--1, state=TIMED_WAITING, group=TGRP-SignificantTermsQParserPluginTest]
   [junit4]   2> AsyncLogger error handling event seq=0, value='null':
   [junit4]   2> java.lang.InterruptedException
   [junit4]   2> 	at java.util.concurrent.locks.AbstractQueuedSynchronizer$ConditionObject.reportInterruptAfterWait(AbstractQueuedSynchronizer.java:2014)
   [junit4]   2> 	at java.util.concurrent.locks.AbstractQueuedSynchronizer$ConditionObject.awaitNanos(AbstractQueuedSynchronizer.java:2088)
   [junit4]   2> 	at com.lmax.disruptor.TimeoutBlockingWaitStrategy.waitFor(TimeoutBlockingWaitStrategy.java:38)
   [junit4]   2> 	at com.lmax.disruptor.ProcessingSequenceBarrier.waitFor(ProcessingSequenceBarrier.java:56)
   [junit4]   2> 	at com.lmax.disruptor.BatchEventProcessor.run(BatchEventProcessor.java:128)
   [junit4]   2> 	at java.lang.Thread.run(Thread.java:748)
   [junit4]   2> AsyncLogger error handling event seq=1, value='null':
   [junit4]   2> java.lang.InterruptedException
   [junit4]   2> 	at java.util.concurrent.locks.AbstractQueuedSynchronizer$ConditionObject.reportInterruptAfterWait(AbstractQueuedSynchronizer.java:2014)
   [junit4]   2> 	at java.util.concurrent.locks.AbstractQueuedSynchronizer$ConditionObject.awaitNanos(AbstractQueuedSynchronizer.java:2088)
   [junit4]   2> 	at com.lmax.disruptor.TimeoutBlockingWaitStrategy.waitFor(TimeoutBlockingWaitStrategy.java:38)
   [junit4]   2> 	at com.lmax.disruptor.ProcessingSequenceBarrier.waitFor(ProcessingSequenceBarrier.java:56)
   [junit4]   2> 	at com.lmax.disruptor.BatchEventProcessor.run(BatchEventProcessor.java:128)
   [junit4]   2> 	at java.lang.Thread.run(Thread.java:748)
   [junit4]   2> AsyncLogger error handling event seq=2, value='null':
   [junit4]   2> java.lang.InterruptedException
   [junit4]   2> 	at java.util.concurrent.locks.AbstractQueuedSynchronizer$ConditionObject.reportInterruptAfterWait(AbstractQueuedSynchronizer.java:2014)
   [junit4]   2> 	at java.util.concurrent.locks.AbstractQueuedSynchronizer$ConditionObject.awaitNanos(AbstractQueuedSynchronizer.java:2088)
   [junit4]   2> 	at com.lmax.disruptor.TimeoutBlockingWaitStrategy.waitFor(TimeoutBlockingWaitStrategy.java:38)
   [junit4]   2> 	at com.lmax.disruptor.ProcessingSequenceBarrier.waitFor(ProcessingSequenceBarrier.java:56)
   [junit4]   2> 	at com.lmax.disruptor.BatchEventProcessor.run(BatchEventProcessor.java:128)
   [junit4]   2> 	at java.lang.Thread.run(Thread.java:748)
   [junit4]   2> AsyncLogger error handling event seq=3, value='null':
   [junit4]   2> java.lang.InterruptedException
   [junit4]   2> 	at java.util.concurrent.locks.AbstractQueuedSynchronizer$ConditionObject.awaitNanos(AbstractQueuedSynchronizer.java:2067)
   [junit4]   2> 	at com.lmax.disruptor.TimeoutBlockingWaitStrategy.waitFor(TimeoutBlockingWaitStrategy.java:38)
   [junit4]   2> 	at com.lmax.disruptor.ProcessingSequenceBarrier.waitFor(ProcessingSequenceBarrier.java:56)
   [junit4]   2> 	at com.lmax.disruptor.BatchEventProcessor.run(BatchEventProcessor.java:128)
   [junit4]   2> 	at java.lang.Thread.run(Thread.java:748)
   [junit4]   2> AsyncLogger error handling event seq=4, value='null':
   [junit4]   2> java.lang.InterruptedException
   [junit4]   2> 	at java.util.concurrent.locks.AbstractQueuedSynchronizer$ConditionObject.reportInterruptAfterWait(AbstractQueuedSynchronizer.java:2014)
   [junit4]   2> 	at java.util.concurrent.locks.AbstractQueuedSynchronizer$ConditionObject.awaitNanos(AbstractQueuedSynchronizer.java:2088)
   [junit4]   2> 	at com.lmax.disruptor.TimeoutBlockingWaitStrategy.waitFor(TimeoutBlockingWaitStrategy.java:38)
   [junit4]   2> 	at com.lmax.disruptor.ProcessingSequenceBarrier.waitFor(ProcessingSequenceBarrier.java:56)
   [junit4]   2> 	at com.lmax.disruptor.BatchEventProcessor.run(BatchEventProcessor.java:128)
   [junit4]   2> 	at java.lang.Thread.run(Thread.java:748)
   [junit4]   2> AsyncLogger error handling event seq=5, value='null':
   [junit4]   2> java.lang.InterruptedException
   [junit4]   2> 	at java.util.concurrent.locks.AbstractQueuedSynchronizer$ConditionObject.reportInterruptAfterWait(AbstractQueuedSynchronizer.java:2014)
   [junit4]   2> 	at java.util.concurrent.locks.AbstractQueuedSynchronizer$ConditionObject.awaitNanos(AbstractQueuedSynchronizer.java:2088)
   [junit4]   2> 	at com.lmax.disruptor.TimeoutBlockingWaitStrategy.waitFor(TimeoutBlockingWaitStrategy.java:38)
   [junit4]   2> 	at com.lmax.disruptor.ProcessingSequenceBarrier.waitFor(ProcessingSequenceBarrier.java:56)
   [junit4]   2> 	at com.lmax.disruptor.BatchEventProcessor.run(BatchEventProcessor.java:128)
   [junit4]   2> 	at java.lang.Thread.run(Thread.java:748)
   [junit4]   2> Sep 07, 2018 11:16:48 PM com.carrotsearch.randomizedtesting.ThreadLeakControl tryToInterruptAll
   [junit4]   2> SEVERE: There are still zombie threads that couldn't be terminated:
   [junit4]   2>    1) Thread[id=13, name=Log4j2-TF-1-AsyncLoggerConfig--1, state=TIMED_WAITING, group=TGRP-SignificantTermsQParserPluginTest]
   [junit4]   2>         at sun.misc.Unsafe.park(Native Method)
   [junit4]   2>         at java.util.concurrent.locks.LockSupport.parkNanos(LockSupport.java:215)
   [junit4]   2>         at java.util.concurrent.locks.AbstractQueuedSynchronizer$ConditionObject.awaitNanos(AbstractQueuedSynchronizer.java:2078)
   [junit4]   2>         at com.lmax.disruptor.TimeoutBlockingWaitStrategy.waitFor(TimeoutBlockingWaitStrategy.java:38)
   [junit4]   2>         at com.lmax.disruptor.ProcessingSequenceBarrier.waitFor(ProcessingSequenceBarrier.java:56)
   [junit4]   2>         at com.lmax.disruptor.BatchEventProcessor.run(BatchEventProcessor.java:128)
   [junit4]   2>         at java.lang.Thread.run(Thread.java:748)
   [junit4]   2> NOTE: test params are: codec=Asserting(Lucene70): {}, docValues:{}, maxPointsInLeafNode=1728, maxMBSortInHeap=7.390562331299215, sim=RandomSimilarity(queryNorm=false): {}, locale=pl-PL, timezone=Asia/Jakarta
   [junit4]   2> NOTE: Linux 4.4.0-112-generic amd64/Oracle Corporation 1.8.0_172 (64-bit)/cpus=4,threads=2,free=233423440,total=319291392
   [junit4]   2> NOTE: All tests run in this JVM: [SignificantTermsQParserPluginTest]
   [junit4]   2> NOTE: reproduce with: ant test  -Dtestcase=SignificantTermsQParserPluginTest -Dtests.seed=67235911D81C7B38 -Dtests.multiplier=2 -Dtests.slow=true -Dtests.locale=pl-PL -Dtests.timezone=Asia/Jakarta -Dtests.asserts=true -Dtests.file.encoding=UTF-8
   [junit4] ERROR   0.00s J2 | SignificantTermsQParserPluginTest (suite) <<<
   [junit4]    > Throwable #1: com.carrotsearch.randomizedtesting.ThreadLeakError: 1 thread leaked from SUITE scope at org.apache.solr.search.SignificantTermsQParserPluginTest: 
   [junit4]    >    1) Thread[id=13, name=Log4j2-TF-1-AsyncLoggerConfig--1, state=TIMED_WAITING, group=TGRP-SignificantTermsQParserPluginTest]
   [junit4]    >         at sun.misc.Unsafe.park(Native Method)
   [junit4]    >         at java.util.concurrent.locks.LockSupport.parkNanos(LockSupport.java:215)
   [junit4]    >         at java.util.concurrent.locks.AbstractQueuedSynchronizer$ConditionObject.awaitNanos(AbstractQueuedSynchronizer.java:2078)
   [junit4]    >         at com.lmax.disruptor.TimeoutBlockingWaitStrategy.waitFor(TimeoutBlockingWaitStrategy.java:38)
   [junit4]    >         at com.lmax.disruptor.ProcessingSequenceBarrier.waitFor(ProcessingSequenceBarrier.java:56)
   [junit4]    >         at com.lmax.disruptor.BatchEventProcessor.run(BatchEventProcessor.java:128)
   [junit4]    >         at java.lang.Thread.run(Thread.java:748)
   [junit4]    > 	at __randomizedtesting.SeedInfo.seed([67235911D81C7B38]:0)Throwable #2: com.carrotsearch.randomizedtesting.ThreadLeakError: There are still zombie threads that couldn't be terminated:
   [junit4]    >    1) Thread[id=13, name=Log4j2-TF-1-AsyncLoggerConfig--1, state=TIMED_WAITING, group=TGRP-SignificantTermsQParserPluginTest]
   [junit4]    >         at sun.misc.Unsafe.park(Native Method)
   [junit4]    >         at java.util.concurrent.locks.LockSupport.parkNanos(LockSupport.java:215)
   [junit4]    >         at java.util.concurrent.locks.AbstractQueuedSynchronizer$ConditionObject.awaitNanos(AbstractQueuedSynchronizer.java:2078)
   [junit4]    >         at com.lmax.disruptor.TimeoutBlockingWaitStrategy.waitFor(TimeoutBlockingWaitStrategy.java:38)
   [junit4]    >         at com.lmax.disruptor.ProcessingSequenceBarrier.waitFor(ProcessingSequenceBarrier.java:56)
   [junit4]    >         at com.lmax.disruptor.BatchEventProcessor.run(BatchEventProcessor.java:128)
   [junit4]    >         at java.lang.Thread.run(Thread.java:748)
   [junit4]    > 	at __randomizedtesting.SeedInfo.seed([67235911D81C7B38]:0)
   [junit4] Completed [2/833 (1!)] on J2 in 39.47s, 1 test, 2 errors <<< FAILURES!

[...truncated 51489 lines...]
[asciidoctor:convert] asciidoctor: ERROR: about-this-guide.adoc: line 1: invalid part, must have at least one section (e.g., chapter, appendix, etc.)
[asciidoctor:convert] asciidoctor: WARNING: simulations.adoc: line 25: section title out of sequence: expected level 3, got level 4
[asciidoctor:convert] asciidoctor: WARNING: simulations.adoc: line 92: section title out of sequence: expected level 3, got level 4
[asciidoctor:convert] asciidoctor: ERROR: solr-glossary.adoc: line 1: invalid part, must have at least one section (e.g., chapter, appendix, etc.)
[asciidoctor:convert] asciidoctor: WARNING: simulations.adoc: line 25: section title out of sequence: expected levels 0 or 1, got level 2
[asciidoctor:convert] asciidoctor: WARNING: simulations.adoc: line 92: section title out of sequence: expected levels 0 or 1, got level 2
     [java] Processed 2330 links (1883 relative) to 3142 anchors in 245 files
     [echo] Validated Links & Anchors via: /home/jenkins/jenkins-slave/workspace/Lucene-Solr-Tests-7.x/solr/build/solr-ref-guide/bare-bones-html/

-documentation-lint:
    [jtidy] Checking for broken html (such as invalid tags)...
   [delete] Deleting directory /home/jenkins/jenkins-slave/workspace/Lucene-Solr-Tests-7.x/lucene/build/jtidy_tmp
     [echo] Checking for broken links...
     [exec] 
     [exec] Crawl/parse...
     [exec] 
     [exec] Verify...
     [echo] Checking for malformed docs...

jar-checksums:

resolve:

ivy-availability-check:
[loadresource] Do not set property disallowed.ivy.jars.list as its length is 0.

-ivy-fail-disallowed-ivy-version:

ivy-fail:

ivy-configure:
[ivy:configure] :: loading settings :: file = /home/jenkins/jenkins-slave/workspace/Lucene-Solr-Tests-7.x/lucene/top-level-ivy-settings.xml

resolve:

ivy-availability-check:
[loadresource] Do not set property disallowed.ivy.jars.list as its length is 0.

-ivy-fail-disallowed-ivy-version:

ivy-fail:

ivy-configure:
[ivy:configure] :: loading settings :: file = /home/jenkins/jenkins-slave/workspace/Lucene-Solr-Tests-7.x/lucene/top-level-ivy-settings.xml

resolve:

resolve:

ivy-availability-check:
[loadresource] Do not set property disallowed.ivy.jars.list as its length is 0.

-ivy-fail-disallowed-ivy-version:

ivy-fail:

ivy-configure:
[ivy:configure] :: loading settings :: file = /home/jenkins/jenkins-slave/workspace/Lucene-Solr-Tests-7.x/lucene/top-level-ivy-settings.xml

resolve:

ivy-availability-check:
[loadresource] Do not set property disallowed.ivy.jars.list as its length is 0.

-ivy-fail-disallowed-ivy-version:

ivy-fail:

ivy-configure:
[ivy:configure] :: loading settings :: file = /home/jenkins/jenkins-slave/workspace/Lucene-Solr-Tests-7.x/lucene/top-level-ivy-settings.xml

resolve:

ivy-availability-check:
[loadresource] Do not set property disallowed.ivy.jars.list as its length is 0.

-ivy-fail-disallowed-ivy-version:

ivy-fail:

ivy-configure:
[ivy:configure] :: loading settings :: file = /home/jenkins/jenkins-slave/workspace/Lucene-Solr-Tests-7.x/lucene/top-level-ivy-settings.xml

resolve:

ivy-availability-check:
[loadresource] Do not set property disallowed.ivy.jars.list as its length is 0.

-ivy-fail-disallowed-ivy-version:

ivy-fail:

ivy-configure:
[ivy:configure] :: loading settings :: file = /home/jenkins/jenkins-slave/workspace/Lucene-Solr-Tests-7.x/lucene/top-level-ivy-settings.xml

resolve:

ivy-availability-check:
[loadresource] Do not set property disallowed.ivy.jars.list as its length is 0.

-ivy-fail-disallowed-ivy-version:

ivy-fail:

ivy-configure:
[ivy:configure] :: loading settings :: file = /home/jenkins/jenkins-slave/workspace/Lucene-Solr-Tests-7.x/lucene/top-level-ivy-settings.xml

resolve:

ivy-availability-check:
[loadresource] Do not set property disallowed.ivy.jars.list as its length is 0.

-ivy-fail-disallowed-ivy-version:

ivy-fail:

ivy-configure:
[ivy:configure] :: loading settings :: file = /home/jenkins/jenkins-slave/workspace/Lucene-Solr-Tests-7.x/lucene/top-level-ivy-settings.xml

resolve:

ivy-availability-check:
[loadresource] Do not set property disallowed.ivy.jars.list as its length is 0.

-ivy-fail-disallowed-ivy-version:

ivy-fail:

ivy-configure:
[ivy:configure] :: loading settings :: file = /home/jenkins/jenkins-slave/workspace/Lucene-Solr-Tests-7.x/lucene/top-level-ivy-settings.xml

resolve:

ivy-availability-check:
[loadresource] Do not set property disallowed.ivy.jars.list as its length is 0.

-ivy-fail-disallowed-ivy-version:

ivy-fail:

ivy-configure:
[ivy:configure] :: loading settings :: file = /home/jenkins/jenkins-slave/workspace/Lucene-Solr-Tests-7.x/lucene/top-level-ivy-settings.xml

resolve:

ivy-availability-check:
[loadresource] Do not set property disallowed.ivy.jars.list as its length is 0.

-ivy-fail-disallowed-ivy-version:

ivy-fail:

ivy-configure:
[ivy:configure] :: loading settings :: file = /home/jenkins/jenkins-slave/workspace/Lucene-Solr-Tests-7.x/lucene/top-level-ivy-settings.xml

resolve:

ivy-availability-check:
[loadresource] Do not set property disallowed.ivy.jars.list as its length is 0.

-ivy-fail-disallowed-ivy-version:

ivy-fail:

ivy-configure:
[ivy:configure] :: loading settings :: file = /home/jenkins/jenkins-slave/workspace/Lucene-Solr-Tests-7.x/lucene/top-level-ivy-settings.xml

resolve:

ivy-availability-check:
[loadresource] Do not set property disallowed.ivy.jars.list as its length is 0.

-ivy-fail-disallowed-ivy-version:

ivy-fail:

ivy-configure:
[ivy:configure] :: loading settings :: file = /home/jenkins/jenkins-slave/workspace/Lucene-Solr-Tests-7.x/lucene/top-level-ivy-settings.xml

resolve:

ivy-availability-check:
[loadresource] Do not set property disallowed.ivy.jars.list as its length is 0.

-ivy-fail-disallowed-ivy-version:

ivy-fail:

ivy-configure:
[ivy:configure] :: loading settings :: file = /home/jenkins/jenkins-slave/workspace/Lucene-Solr-Tests-7.x/lucene/top-level-ivy-settings.xml

resolve:

ivy-availability-check:
[loadresource] Do not set property disallowed.ivy.jars.list as its length is 0.

-ivy-fail-disallowed-ivy-version:

ivy-fail:

ivy-configure:
[ivy:configure] :: loading settings :: file = /home/jenkins/jenkins-slave/workspace/Lucene-Solr-Tests-7.x/lucene/top-level-ivy-settings.xml

resolve:

ivy-availability-check:
[loadresource] Do not set property disallowed.ivy.jars.list as its length is 0.

-ivy-fail-disallowed-ivy-version:

ivy-fail:

ivy-configure:
[ivy:configure] :: loading settings :: file = /home/jenkins/jenkins-slave/workspace/Lucene-Solr-Tests-7.x/lucene/top-level-ivy-settings.xml

resolve:

ivy-availability-check:
[loadresource] Do not set property disallowed.ivy.jars.list as its length is 0.

-ivy-fail-disallowed-ivy-version:

ivy-fail:

ivy-configure:
[ivy:configure] :: loading settings :: file = /home/jenkins/jenkins-slave/workspace/Lucene-Solr-Tests-7.x/lucene/top-level-ivy-settings.xml

resolve:

ivy-availability-check:
[loadresource] Do not set property disallowed.ivy.jars.list as its length is 0.

-ivy-fail-disallowed-ivy-version:

ivy-fail:

ivy-configure:
[ivy:configure] :: loading settings :: file = /home/jenkins/jenkins-slave/workspace/Lucene-Solr-Tests-7.x/lucene/top-level-ivy-settings.xml

resolve:

ivy-availability-check:
[loadresource] Do not set property disallowed.ivy.jars.list as its length is 0.

-ivy-fail-disallowed-ivy-version:

ivy-fail:

ivy-configure:
[ivy:configure] :: loading settings :: file = /home/jenkins/jenkins-slave/workspace/Lucene-Solr-Tests-7.x/lucene/top-level-ivy-settings.xml

resolve:

ivy-availability-check:
[loadresource] Do not set property disallowed.ivy.jars.list as its length is 0.

-ivy-fail-disallowed-ivy-version:

ivy-fail:

ivy-configure:
[ivy:configure] :: loading settings :: file = /home/jenkins/jenkins-slave/workspace/Lucene-Solr-Tests-7.x/lucene/top-level-ivy-settings.xml

resolve:

ivy-availability-check:
[loadresource] Do not set property disallowed.ivy.jars.list as its length is 0.

-ivy-fail-disallowed-ivy-version:

ivy-fail:

ivy-configure:
[ivy:configure] :: loading settings :: file = /home/jenkins/jenkins-slave/workspace/Lucene-Solr-Tests-7.x/lucene/top-level-ivy-settings.xml

resolve:

ivy-availability-check:
[loadresource] Do not set property disallowed.ivy.jars.list as its length is 0.

-ivy-fail-disallowed-ivy-version:

ivy-fail:

ivy-configure:
[ivy:configure] :: loading settings :: file = /home/jenkins/jenkins-slave/workspace/Lucene-Solr-Tests-7.x/lucene/top-level-ivy-settings.xml

resolve:

ivy-availability-check:
[loadresource] Do not set property disallowed.ivy.jars.list as its length is 0.

-ivy-fail-disallowed-ivy-version:

ivy-fail:

ivy-configure:
[ivy:configure] :: loading settings :: file = /home/jenkins/jenkins-slave/workspace/Lucene-Solr-Tests-7.x/lucene/top-level-ivy-settings.xml

resolve:

ivy-availability-check:
[loadresource] Do not set property disallowed.ivy.jars.list as its length is 0.

-ivy-fail-disallowed-ivy-version:

ivy-fail:

ivy-configure:
[ivy:configure] :: loading settings :: file = /home/jenkins/jenkins-slave/workspace/Lucene-Solr-Tests-7.x/lucene/top-level-ivy-settings.xml

resolve:

ivy-availability-check:
[loadresource] Do not set property disallowed.ivy.jars.list as its length is 0.

-ivy-fail-disallowed-ivy-version:

ivy-fail:

ivy-configure:
[ivy:configure] :: loading settings :: file = /home/jenkins/jenkins-slave/workspace/Lucene-Solr-Tests-7.x/lucene/top-level-ivy-settings.xml

resolve:

ivy-availability-check:
[loadresource] Do not set property disallowed.ivy.jars.list as its length is 0.

-ivy-fail-disallowed-ivy-version:

ivy-fail:

ivy-configure:
[ivy:configure] :: loading settings :: file = /home/jenkins/jenkins-slave/workspace/Lucene-Solr-Tests-7.x/lucene/top-level-ivy-settings.xml

common.resolve:

resolve:

ivy-availability-check:
[loadresource] Do not set property disallowed.ivy.jars.list as its length is 0.

-ivy-fail-disallowed-ivy-version:

ivy-fail:

ivy-configure:
[ivy:configure] :: loading settings :: file = /home/jenkins/jenkins-slave/workspace/Lucene-Solr-Tests-7.x/lucene/top-level-ivy-settings.xml

resolve:

ivy-availability-check:
[loadresource] Do not set property disallowed.ivy.jars.list as its length is 0.

-ivy-fail-disallowed-ivy-version:

ivy-fail:

ivy-configure:
[ivy:configure] :: loading settings :: file = /home/jenkins/jenkins-slave/workspace/Lucene-Solr-Tests-7.x/lucene/top-level-ivy-settings.xml

resolve:

ivy-availability-check:
[loadresource] Do not set property disallowed.ivy.jars.list as its length is 0.

-ivy-fail-disallowed-ivy-version:

ivy-fail:

ivy-configure:
[ivy:configure] :: loading settings :: file = /home/jenkins/jenkins-slave/workspace/Lucene-Solr-Tests-7.x/lucene/top-level-ivy-settings.xml

resolve:

ivy-availability-check:
[loadresource] Do not set property disallowed.ivy.jars.list as its length is 0.

-ivy-fail-disallowed-ivy-version:

ivy-fail:

ivy-configure:
[ivy:configure] :: loading settings :: file = /home/jenkins/jenkins-slave/workspace/Lucene-Solr-Tests-7.x/lucene/top-level-ivy-settings.xml

resolve:

ivy-availability-check:
[loadresource] Do not set property disallowed.ivy.jars.list as its length is 0.

-ivy-fail-disallowed-ivy-version:

ivy-fail:

ivy-configure:
[ivy:configure] :: loading settings :: file = /home/jenkins/jenkins-slave/workspace/Lucene-Solr-Tests-7.x/lucene/top-level-ivy-settings.xml

resolve:

jar-checksums:
    [mkdir] Created dir: /home/jenkins/jenkins-slave/workspace/Lucene-Solr-Tests-7.x/lucene/null55000463
     [copy] Copying 35 files to /home/jenkins/jenkins-slave/workspace/Lucene-Solr-Tests-7.x/lucene/null55000463
   [delete] Deleting directory /home/jenkins/jenkins-slave/workspace/Lucene-Solr-Tests-7.x/lucene/null55000463

resolve-example:

ivy-availability-check:
[loadresource] Do not set property disallowed.ivy.jars.list as its length is 0.

-ivy-fail-disallowed-ivy-version:

ivy-fail:

ivy-configure:
[ivy:configure] :: loading settings :: file = /home/jenkins/jenkins-slave/workspace/Lucene-Solr-Tests-7.x/lucene/top-level-ivy-settings.xml

resolve:

resolve-server:

ivy-availability-check:
[loadresource] Do not set property disallowed.ivy.jars.list as its length is 0.

-ivy-fail-disallowed-ivy-version:

ivy-fail:

ivy-fail:

ivy-configure:
[ivy:configure] :: loading settings :: file = /home/jenkins/jenkins-slave/workspace/Lucene-Solr-Tests-7.x/lucene/top-level-ivy-settings.xml

resolve:

resolve:

ivy-availability-check:
[loadresource] Do not set property disallowed.ivy.jars.list as its length is 0.

-ivy-fail-disallowed-ivy-version:

ivy-fail:

ivy-fail:

ivy-configure:
[ivy:configure] :: loading settings :: file = /home/jenkins/jenkins-slave/workspace/Lucene-Solr-Tests-7.x/lucene/top-level-ivy-settings.xml

resolve:

ivy-availability-check:
[loadresource] Do not set property disallowed.ivy.jars.list as its length is 0.

-ivy-fail-disallowed-ivy-version:

ivy-fail:

ivy-fail:

ivy-configure:
[ivy:configure] :: loading settings :: file = /home/jenkins/jenkins-slave/workspace/Lucene-Solr-Tests-7.x/lucene/top-level-ivy-settings.xml

resolve:

ivy-availability-check:
[loadresource] Do not set property disallowed.ivy.jars.list as its length is 0.

-ivy-fail-disallowed-ivy-version:

ivy-fail:

ivy-configure:
[ivy:configure] :: loading settings :: file = /home/jenkins/jenkins-slave/workspace/Lucene-Solr-Tests-7.x/lucene/top-level-ivy-settings.xml

resolve:

ivy-availability-check:
[loadresource] Do not set property disallowed.ivy.jars.list as its length is 0.

-ivy-fail-disallowed-ivy-version:

ivy-fail:

ivy-fail:

ivy-configure:
[ivy:configure] :: loading settings :: file = /home/jenkins/jenkins-slave/workspace/Lucene-Solr-Tests-7.x/lucene/top-level-ivy-settings.xml

resolve:

ivy-availability-check:
[loadresource] Do not set property disallowed.ivy.jars.list as its length is 0.

-ivy-fail-disallowed-ivy-version:

ivy-fail:

ivy-configure:
[ivy:configure] :: loading settings :: file = /home/jenkins/jenkins-slave/workspace/Lucene-Solr-Tests-7.x/lucene/top-level-ivy-settings.xml

resolve:

ivy-availability-check:
[loadresource] Do not set property disallowed.ivy.jars.list as its length is 0.

-ivy-fail-disallowed-ivy-version:

ivy-fail:

ivy-fail:

ivy-configure:
[ivy:configure] :: loading settings :: file = /home/jenkins/jenkins-slave/workspace/Lucene-Solr-Tests-7.x/lucene/top-level-ivy-settings.xml

resolve:

ivy-availability-check:
[loadresource] Do not set property disallowed.ivy.jars.list as its length is 0.

-ivy-fail-disallowed-ivy-version:

ivy-fail:

ivy-fail:

ivy-configure:
[ivy:configure] :: loading settings :: file = /home/jenkins/jenkins-slave/workspace/Lucene-Solr-Tests-7.x/lucene/top-level-ivy-settings.xml

resolve:

ivy-availability-check:
[loadresource] Do not set property disallowed.ivy.jars.list as its length is 0.

-ivy-fail-disallowed-ivy-version:

ivy-fail:

ivy-fail:

ivy-configure:
[ivy:configure] :: loading settings :: file = /home/jenkins/jenkins-slave/workspace/Lucene-Solr-Tests-7.x/lucene/top-level-ivy-settings.xml

resolve:

ivy-availability-check:
[loadresource] Do not set property disallowed.ivy.jars.list as its length is 0.

-ivy-fail-disallowed-ivy-version:

ivy-fail:

ivy-fail:

ivy-configure:
[ivy:configure] :: loading settings :: file = /home/jenkins/jenkins-slave/workspace/Lucene-Solr-Tests-7.x/lucene/top-level-ivy-settings.xml

resolve:

ivy-availability-check:
[loadresource] Do not set property disallowed.ivy.jars.list as its length is 0.

-ivy-fail-disallowed-ivy-version:

ivy-fail:

ivy-fail:

ivy-configure:
[ivy:configure] :: loading settings :: file = /home/jenkins/jenkins-slave/workspace/Lucene-Solr-Tests-7.x/lucene/top-level-ivy-settings.xml

resolve:

ivy-availability-check:
[loadresource] Do not set property disallowed.ivy.jars.list as its length is 0.

-ivy-fail-disallowed-ivy-version:

ivy-fail:

ivy-fail:

ivy-configure:
[ivy:configure] :: loading settings :: file = /home/jenkins/jenkins-slave/workspace/Lucene-Solr-Tests-7.x/lucene/top-level-ivy-settings.xml

resolve:

ivy-availability-check:
[loadresource] Do not set property disallowed.ivy.jars.list as its length is 0.

-ivy-fail-disallowed-ivy-version:

ivy-fail:

ivy-fail:

ivy-configure:
[ivy:configure] :: loading settings :: file = /home/jenkins/jenkins-slave/workspace/Lucene-Solr-Tests-7.x/lucene/top-level-ivy-settings.xml

resolve:

ivy-availability-check:
[loadresource] Do not set property disallowed.ivy.jars.list as its length is 0.

-ivy-fail-disallowed-ivy-version:

ivy-fail:

ivy-fail:

ivy-configure:
[ivy:configure] :: loading settings :: file = /home/jenkins/jenkins-slave/workspace/Lucene-Solr-Tests-7.x/lucene/top-level-ivy-settings.xml

resolve:

ivy-availability-check:
[loadresource] Do not set property disallowed.ivy.jars.list as its length is 0.

-ivy-fail-disallowed-ivy-version:

ivy-fail:

ivy-fail:

ivy-configure:
[ivy:configure] :: loading settings :: file = /home/jenkins/jenkins-slave/workspace/Lucene-Solr-Tests-7.x/lucene/top-level-ivy-settings.xml

resolve:

ivy-availability-check:
[loadresource] Do not set property disallowed.ivy.jars.list as its length is 0.

-ivy-fail-disallowed-ivy-version:

ivy-fail:

ivy-fail:

ivy-configure:
[ivy:configure] :: loading settings :: file = /home/jenkins/jenkins-slave/workspace/Lucene-Solr-Tests-7.x/lucene/top-level-ivy-settings.xml

resolve:

jar-checksums:
    [mkdir] Created dir: /home/jenkins/jenkins-slave/workspace/Lucene-Solr-Tests-7.x/solr/null2070123946
     [copy] Copying 239 files to /home/jenkins/jenkins-slave/workspace/Lucene-Solr-Tests-7.x/solr/null2070123946
   [delete] Deleting directory /home/jenkins/jenkins-slave/workspace/Lucene-Solr-Tests-7.x/solr/null2070123946

check-working-copy:
[ivy:cachepath] :: resolving dependencies :: org.eclipse.jgit#org.eclipse.jgit-caller;working
[ivy:cachepath] 	confs: [default]
[ivy:cachepath] 	found org.eclipse.jgit#org.eclipse.jgit;4.6.0.201612231935-r in public
[ivy:cachepath] 	found com.jcraft#jsch;0.1.53 in public
[ivy:cachepath] 	found com.googlecode.javaewah#JavaEWAH;1.1.6 in public
[ivy:cachepath] 	found org.apache.httpcomponents#httpclient;4.3.6 in public
[ivy:cachepath] 	found org.apache.httpcomponents#httpcore;4.3.3 in public
[ivy:cachepath] 	found commons-logging#commons-logging;1.1.3 in public
[ivy:cachepath] 	found commons-codec#commons-codec;1.6 in public
[ivy:cachepath] 	found org.slf4j#slf4j-api;1.7.2 in public
[ivy:cachepath] :: resolution report :: resolve 117ms :: artifacts dl 1ms
	---------------------------------------------------------------------
	|                  |            modules            ||   artifacts   |
	|       conf       | number| search|dwnlded|evicted|| number|dwnlded|
	---------------------------------------------------------------------
	|      default     |   8   |   0   |   0   |   0   ||   8   |   0   |
	---------------------------------------------------------------------
[wc-checker] Initializing working copy...
[wc-checker] SLF4J: Failed to load class "org.slf4j.impl.StaticLoggerBinder".
[wc-checker] SLF4J: Defaulting to no-operation (NOP) logger implementation
[wc-checker] SLF4J: See http://www.slf4j.org/codes.html#StaticLoggerBinder for further details.
[wc-checker] Checking working copy status...

-jenkins-base:

BUILD SUCCESSFUL
Total time: 157 minutes 28 seconds
Archiving artifacts
java.lang.InterruptedException: no matches found within 10000
	at hudson.FilePath$34.hasMatch(FilePath.java:2678)
	at hudson.FilePath$34.invoke(FilePath.java:2557)
	at hudson.FilePath$34.invoke(FilePath.java:2547)
	at hudson.FilePath$FileCallableWrapper.call(FilePath.java:2918)
Also:   hudson.remoting.Channel$CallSiteStackTrace: Remote call to lucene2
		at hudson.remoting.Channel.attachCallSiteStackTrace(Channel.java:1741)
		at hudson.remoting.UserRequest$ExceptionResponse.retrieve(UserRequest.java:357)
		at hudson.remoting.Channel.call(Channel.java:955)
		at hudson.FilePath.act(FilePath.java:1036)
		at hudson.FilePath.act(FilePath.java:1025)
		at hudson.FilePath.validateAntFileMask(FilePath.java:2547)
		at hudson.tasks.ArtifactArchiver.perform(ArtifactArchiver.java:243)
		at hudson.tasks.BuildStepCompatibilityLayer.perform(BuildStepCompatibilityLayer.java:81)
		at hudson.tasks.BuildStepMonitor$1.perform(BuildStepMonitor.java:20)
		at hudson.model.AbstractBuild$AbstractBuildExecution.perform(AbstractBuild.java:744)
		at hudson.model.AbstractBuild$AbstractBuildExecution.performAllBuildSteps(AbstractBuild.java:690)
		at hudson.model.Build$BuildExecution.post2(Build.java:186)
		at hudson.model.AbstractBuild$AbstractBuildExecution.post(AbstractBuild.java:635)
		at hudson.model.Run.execute(Run.java:1819)
		at hudson.model.FreeStyleBuild.run(FreeStyleBuild.java:43)
		at hudson.model.ResourceController.execute(ResourceController.java:97)
		at hudson.model.Executor.run(Executor.java:429)
Caused: hudson.FilePath$TunneledInterruptedException
	at hudson.FilePath$FileCallableWrapper.call(FilePath.java:2920)
	at hudson.remoting.UserRequest.perform(UserRequest.java:212)
	at hudson.remoting.UserRequest.perform(UserRequest.java:54)
	at hudson.remoting.Request$2.run(Request.java:369)
	at hudson.remoting.InterceptingExecutorService$1.call(InterceptingExecutorService.java:72)
	at java.util.concurrent.FutureTask.run(FutureTask.java:266)
	at java.util.concurrent.ThreadPoolExecutor.runWorker(ThreadPoolExecutor.java:1142)
	at java.util.concurrent.ThreadPoolExecutor$Worker.run(ThreadPoolExecutor.java:617)
	at java.lang.Thread.run(Thread.java:748)
Caused: java.lang.InterruptedException: java.lang.InterruptedException: no matches found within 10000
	at hudson.FilePath.act(FilePath.java:1038)
	at hudson.FilePath.act(FilePath.java:1025)
	at hudson.FilePath.validateAntFileMask(FilePath.java:2547)
	at hudson.tasks.ArtifactArchiver.perform(ArtifactArchiver.java:243)
	at hudson.tasks.BuildStepCompatibilityLayer.perform(BuildStepCompatibilityLayer.java:81)
	at hudson.tasks.BuildStepMonitor$1.perform(BuildStepMonitor.java:20)
	at hudson.model.AbstractBuild$AbstractBuildExecution.perform(AbstractBuild.java:744)
	at hudson.model.AbstractBuild$AbstractBuildExecution.performAllBuildSteps(AbstractBuild.java:690)
	at hudson.model.Build$BuildExecution.post2(Build.java:186)
	at hudson.model.AbstractBuild$AbstractBuildExecution.post(AbstractBuild.java:635)
	at hudson.model.Run.execute(Run.java:1819)
	at hudson.model.FreeStyleBuild.run(FreeStyleBuild.java:43)
	at hudson.model.ResourceController.execute(ResourceController.java:97)
	at hudson.model.Executor.run(Executor.java:429)
No artifacts found that match the file pattern "**/*.events,heapdumps/**,**/hs_err_pid*". Configuration error?
Recording test results
Build step 'Publish JUnit test result report' changed build result to UNSTABLE
Email was triggered for: Unstable (Test Failures)
Sending email for trigger: Unstable (Test Failures)

[JENKINS] Lucene-Solr-Tests-7.x - Build # 862 - Still Unstable

Posted by Apache Jenkins Server <je...@builds.apache.org>.
Build: https://builds.apache.org/job/Lucene-Solr-Tests-7.x/862/

1 tests failed.
FAILED:  org.apache.solr.cloud.DeleteReplicaTest.deleteReplicaFromClusterState

Error Message:
Collection not found: deleteFromClusterState_false

Stack Trace:
org.apache.solr.common.SolrException: Collection not found: deleteFromClusterState_false
	at __randomizedtesting.SeedInfo.seed([F5C9B1F3ED68ADBB:1B501A9ED256D60C]:0)
	at org.apache.solr.client.solrj.impl.CloudSolrClient.requestWithRetryOnStaleState(CloudSolrClient.java:851)
	at org.apache.solr.client.solrj.impl.CloudSolrClient.request(CloudSolrClient.java:817)
	at org.apache.solr.client.solrj.SolrRequest.process(SolrRequest.java:194)
	at org.apache.solr.client.solrj.SolrClient.add(SolrClient.java:173)
	at org.apache.solr.client.solrj.SolrClient.add(SolrClient.java:138)
	at org.apache.solr.cloud.DeleteReplicaTest.deleteReplicaFromClusterState(DeleteReplicaTest.java:188)
	at org.apache.solr.cloud.DeleteReplicaTest.deleteReplicaFromClusterState(DeleteReplicaTest.java:179)
	at sun.reflect.NativeMethodAccessorImpl.invoke0(Native Method)
	at sun.reflect.NativeMethodAccessorImpl.invoke(NativeMethodAccessorImpl.java:62)
	at sun.reflect.DelegatingMethodAccessorImpl.invoke(DelegatingMethodAccessorImpl.java:43)
	at java.lang.reflect.Method.invoke(Method.java:498)
	at com.carrotsearch.randomizedtesting.RandomizedRunner.invoke(RandomizedRunner.java:1742)
	at com.carrotsearch.randomizedtesting.RandomizedRunner$8.evaluate(RandomizedRunner.java:935)
	at com.carrotsearch.randomizedtesting.RandomizedRunner$9.evaluate(RandomizedRunner.java:971)
	at com.carrotsearch.randomizedtesting.RandomizedRunner$10.evaluate(RandomizedRunner.java:985)
	at com.carrotsearch.randomizedtesting.rules.SystemPropertiesRestoreRule$1.evaluate(SystemPropertiesRestoreRule.java:57)
	at org.apache.lucene.util.TestRuleSetupTeardownChained$1.evaluate(TestRuleSetupTeardownChained.java:49)
	at org.apache.lucene.util.AbstractBeforeAfterRule$1.evaluate(AbstractBeforeAfterRule.java:45)
	at org.apache.lucene.util.TestRuleThreadAndTestName$1.evaluate(TestRuleThreadAndTestName.java:48)
	at org.apache.lucene.util.TestRuleIgnoreAfterMaxFailures$1.evaluate(TestRuleIgnoreAfterMaxFailures.java:64)
	at org.apache.lucene.util.TestRuleMarkFailure$1.evaluate(TestRuleMarkFailure.java:47)
	at com.carrotsearch.randomizedtesting.rules.StatementAdapter.evaluate(StatementAdapter.java:36)
	at com.carrotsearch.randomizedtesting.ThreadLeakControl$StatementRunner.run(ThreadLeakControl.java:368)
	at com.carrotsearch.randomizedtesting.ThreadLeakControl.forkTimeoutingTask(ThreadLeakControl.java:817)
	at com.carrotsearch.randomizedtesting.ThreadLeakControl$3.evaluate(ThreadLeakControl.java:468)
	at com.carrotsearch.randomizedtesting.RandomizedRunner.runSingleTest(RandomizedRunner.java:944)
	at com.carrotsearch.randomizedtesting.RandomizedRunner$5.evaluate(RandomizedRunner.java:830)
	at com.carrotsearch.randomizedtesting.RandomizedRunner$6.evaluate(RandomizedRunner.java:880)
	at com.carrotsearch.randomizedtesting.RandomizedRunner$7.evaluate(RandomizedRunner.java:891)
	at com.carrotsearch.randomizedtesting.rules.StatementAdapter.evaluate(StatementAdapter.java:36)
	at com.carrotsearch.randomizedtesting.rules.SystemPropertiesRestoreRule$1.evaluate(SystemPropertiesRestoreRule.java:57)
	at org.apache.lucene.util.AbstractBeforeAfterRule$1.evaluate(AbstractBeforeAfterRule.java:45)
	at com.carrotsearch.randomizedtesting.rules.StatementAdapter.evaluate(StatementAdapter.java:36)
	at org.apache.lucene.util.TestRuleStoreClassName$1.evaluate(TestRuleStoreClassName.java:41)
	at com.carrotsearch.randomizedtesting.rules.NoShadowingOrOverridesOnMethodsRule$1.evaluate(NoShadowingOrOverridesOnMethodsRule.java:40)
	at com.carrotsearch.randomizedtesting.rules.NoShadowingOrOverridesOnMethodsRule$1.evaluate(NoShadowingOrOverridesOnMethodsRule.java:40)
	at com.carrotsearch.randomizedtesting.rules.StatementAdapter.evaluate(StatementAdapter.java:36)
	at com.carrotsearch.randomizedtesting.rules.StatementAdapter.evaluate(StatementAdapter.java:36)
	at com.carrotsearch.randomizedtesting.rules.StatementAdapter.evaluate(StatementAdapter.java:36)
	at org.apache.lucene.util.TestRuleAssertionsRequired$1.evaluate(TestRuleAssertionsRequired.java:53)
	at org.apache.lucene.util.TestRuleMarkFailure$1.evaluate(TestRuleMarkFailure.java:47)
	at org.apache.lucene.util.TestRuleIgnoreAfterMaxFailures$1.evaluate(TestRuleIgnoreAfterMaxFailures.java:64)
	at org.apache.lucene.util.TestRuleIgnoreTestSuites$1.evaluate(TestRuleIgnoreTestSuites.java:54)
	at com.carrotsearch.randomizedtesting.rules.StatementAdapter.evaluate(StatementAdapter.java:36)
	at com.carrotsearch.randomizedtesting.ThreadLeakControl$StatementRunner.run(ThreadLeakControl.java:368)
	at java.lang.Thread.run(Thread.java:748)




Build Log:
[...truncated 13574 lines...]
   [junit4] Suite: org.apache.solr.cloud.DeleteReplicaTest
   [junit4]   2> Creating dataDir: /x1/jenkins/jenkins-slave/workspace/Lucene-Solr-Tests-7.x/solr/build/solr-core/test/J2/temp/solr.cloud.DeleteReplicaTest_F5C9B1F3ED68ADBB-001/init-core-data-001
   [junit4]   2> 1249114 WARN  (SUITE-DeleteReplicaTest-seed#[F5C9B1F3ED68ADBB]-worker) [    ] o.a.s.SolrTestCaseJ4 startTrackingSearchers: numOpens=10 numCloses=10
   [junit4]   2> 1249114 INFO  (SUITE-DeleteReplicaTest-seed#[F5C9B1F3ED68ADBB]-worker) [    ] o.a.s.SolrTestCaseJ4 Using TrieFields (NUMERIC_POINTS_SYSPROP=false) w/NUMERIC_DOCVALUES_SYSPROP=false
   [junit4]   2> 1249115 INFO  (SUITE-DeleteReplicaTest-seed#[F5C9B1F3ED68ADBB]-worker) [    ] o.a.s.SolrTestCaseJ4 Randomized ssl (true) and clientAuth (true) via: @org.apache.solr.util.RandomizeSSL(reason=, ssl=NaN, value=NaN, clientAuth=NaN)
   [junit4]   2> 1249116 INFO  (SUITE-DeleteReplicaTest-seed#[F5C9B1F3ED68ADBB]-worker) [    ] o.a.s.SolrTestCaseJ4 SecureRandom sanity checks: test.solr.allowed.securerandom=null & java.security.egd=file:/dev/./urandom
   [junit4]   2> 1249116 INFO  (SUITE-DeleteReplicaTest-seed#[F5C9B1F3ED68ADBB]-worker) [    ] o.a.s.c.MiniSolrCloudCluster Starting cluster of 4 servers in /x1/jenkins/jenkins-slave/workspace/Lucene-Solr-Tests-7.x/solr/build/solr-core/test/J2/temp/solr.cloud.DeleteReplicaTest_F5C9B1F3ED68ADBB-001/tempDir-001
   [junit4]   2> 1249117 INFO  (SUITE-DeleteReplicaTest-seed#[F5C9B1F3ED68ADBB]-worker) [    ] o.a.s.c.ZkTestServer STARTING ZK TEST SERVER
   [junit4]   2> 1249117 INFO  (Thread-4482) [    ] o.a.s.c.ZkTestServer client port:0.0.0.0/0.0.0.0:0
   [junit4]   2> 1249117 INFO  (Thread-4482) [    ] o.a.s.c.ZkTestServer Starting server
   [junit4]   2> 1249119 ERROR (Thread-4482) [    ] o.a.z.s.ZooKeeperServer ZKShutdownHandler is not registered, so ZooKeeper server won't take any action on ERROR or SHUTDOWN server state changes
   [junit4]   2> 1249217 INFO  (SUITE-DeleteReplicaTest-seed#[F5C9B1F3ED68ADBB]-worker) [    ] o.a.s.c.ZkTestServer start zk server on port:44237
   [junit4]   2> 1249221 INFO  (zkConnectionManagerCallback-3166-thread-1) [    ] o.a.s.c.c.ConnectionManager zkClient has connected
   [junit4]   2> 1249225 INFO  (jetty-launcher-3163-thread-2) [    ] o.e.j.s.Server jetty-9.4.11.v20180605; built: 2018-06-05T18:24:03.829Z; git: d5fc0523cfa96bfebfbda19606cad384d772f04c; jvm 1.8.0_172-b11
   [junit4]   2> 1249225 INFO  (jetty-launcher-3163-thread-1) [    ] o.e.j.s.Server jetty-9.4.11.v20180605; built: 2018-06-05T18:24:03.829Z; git: d5fc0523cfa96bfebfbda19606cad384d772f04c; jvm 1.8.0_172-b11
   [junit4]   2> 1249225 INFO  (jetty-launcher-3163-thread-3) [    ] o.e.j.s.Server jetty-9.4.11.v20180605; built: 2018-06-05T18:24:03.829Z; git: d5fc0523cfa96bfebfbda19606cad384d772f04c; jvm 1.8.0_172-b11
   [junit4]   2> 1249226 INFO  (jetty-launcher-3163-thread-4) [    ] o.e.j.s.Server jetty-9.4.11.v20180605; built: 2018-06-05T18:24:03.829Z; git: d5fc0523cfa96bfebfbda19606cad384d772f04c; jvm 1.8.0_172-b11
   [junit4]   2> 1249227 INFO  (jetty-launcher-3163-thread-2) [    ] o.e.j.s.session DefaultSessionIdManager workerName=node0
   [junit4]   2> 1249227 INFO  (jetty-launcher-3163-thread-2) [    ] o.e.j.s.session No SessionScavenger set, using defaults
   [junit4]   2> 1249227 INFO  (jetty-launcher-3163-thread-2) [    ] o.e.j.s.session node0 Scavenging every 660000ms
   [junit4]   2> 1249227 INFO  (jetty-launcher-3163-thread-4) [    ] o.e.j.s.session DefaultSessionIdManager workerName=node0
   [junit4]   2> 1249227 INFO  (jetty-launcher-3163-thread-4) [    ] o.e.j.s.session No SessionScavenger set, using defaults
   [junit4]   2> 1249227 INFO  (jetty-launcher-3163-thread-4) [    ] o.e.j.s.session node0 Scavenging every 660000ms
   [junit4]   2> 1249228 INFO  (jetty-launcher-3163-thread-4) [    ] o.e.j.s.h.ContextHandler Started o.e.j.s.ServletContextHandler@13e39afe{/solr,null,AVAILABLE}
   [junit4]   2> 1249228 INFO  (jetty-launcher-3163-thread-3) [    ] o.e.j.s.session DefaultSessionIdManager workerName=node0
   [junit4]   2> 1249228 INFO  (jetty-launcher-3163-thread-3) [    ] o.e.j.s.session No SessionScavenger set, using defaults
   [junit4]   2> 1249228 INFO  (jetty-launcher-3163-thread-3) [    ] o.e.j.s.session node0 Scavenging every 600000ms
   [junit4]   2> 1249228 INFO  (jetty-launcher-3163-thread-3) [    ] o.e.j.s.h.ContextHandler Started o.e.j.s.ServletContextHandler@1d1a3353{/solr,null,AVAILABLE}
   [junit4]   2> 1249229 INFO  (jetty-launcher-3163-thread-1) [    ] o.e.j.s.session DefaultSessionIdManager workerName=node0
   [junit4]   2> 1249229 INFO  (jetty-launcher-3163-thread-1) [    ] o.e.j.s.session No SessionScavenger set, using defaults
   [junit4]   2> 1249229 INFO  (jetty-launcher-3163-thread-1) [    ] o.e.j.s.session node0 Scavenging every 660000ms
   [junit4]   2> 1249229 INFO  (jetty-launcher-3163-thread-4) [    ] o.e.j.s.AbstractConnector Started ServerConnector@2b472db8{SSL,[ssl, http/1.1]}{127.0.0.1:45959}
   [junit4]   2> 1249229 INFO  (jetty-launcher-3163-thread-4) [    ] o.e.j.s.Server Started @1249272ms
   [junit4]   2> 1249229 INFO  (jetty-launcher-3163-thread-4) [    ] o.a.s.c.s.e.JettySolrRunner Jetty properties: {hostContext=/solr, hostPort=45959}
   [junit4]   2> 1249229 INFO  (jetty-launcher-3163-thread-1) [    ] o.e.j.s.h.ContextHandler Started o.e.j.s.ServletContextHandler@52223d29{/solr,null,AVAILABLE}
   [junit4]   2> 1249229 ERROR (jetty-launcher-3163-thread-4) [    ] o.a.s.u.StartupLoggingUtils Missing Java Option solr.log.dir. Logging may be missing or incomplete.
   [junit4]   2> 1249229 INFO  (jetty-launcher-3163-thread-4) [    ] o.a.s.s.SolrDispatchFilter Using logger factory org.apache.logging.slf4j.Log4jLoggerFactory
   [junit4]   2> 1249229 INFO  (jetty-launcher-3163-thread-4) [    ] o.a.s.s.SolrDispatchFilter  ___      _       Welcome to Apache Solr? version 7.5.0
   [junit4]   2> 1249229 INFO  (jetty-launcher-3163-thread-4) [    ] o.a.s.s.SolrDispatchFilter / __| ___| |_ _   Starting in cloud mode on port null
   [junit4]   2> 1249229 INFO  (jetty-launcher-3163-thread-4) [    ] o.a.s.s.SolrDispatchFilter \__ \/ _ \ | '_|  Install dir: null
   [junit4]   2> 1249229 INFO  (jetty-launcher-3163-thread-4) [    ] o.a.s.s.SolrDispatchFilter |___/\___/_|_|    Start time: 2018-09-08T08:55:49.420Z
   [junit4]   2> 1249229 INFO  (jetty-launcher-3163-thread-1) [    ] o.e.j.s.AbstractConnector Started ServerConnector@59c576c{SSL,[ssl, http/1.1]}{127.0.0.1:41199}
   [junit4]   2> 1249230 INFO  (jetty-launcher-3163-thread-1) [    ] o.e.j.s.Server Started @1249273ms
   [junit4]   2> 1249230 INFO  (jetty-launcher-3163-thread-1) [    ] o.a.s.c.s.e.JettySolrRunner Jetty properties: {hostContext=/solr, hostPort=41199}
   [junit4]   2> 1249230 ERROR (jetty-launcher-3163-thread-1) [    ] o.a.s.u.StartupLoggingUtils Missing Java Option solr.log.dir. Logging may be missing or incomplete.
   [junit4]   2> 1249230 INFO  (jetty-launcher-3163-thread-1) [    ] o.a.s.s.SolrDispatchFilter Using logger factory org.apache.logging.slf4j.Log4jLoggerFactory
   [junit4]   2> 1249230 INFO  (jetty-launcher-3163-thread-1) [    ] o.a.s.s.SolrDispatchFilter  ___      _       Welcome to Apache Solr? version 7.5.0
   [junit4]   2> 1249230 INFO  (jetty-launcher-3163-thread-3) [    ] o.e.j.s.AbstractConnector Started ServerConnector@2ead93ae{SSL,[ssl, http/1.1]}{127.0.0.1:34665}
   [junit4]   2> 1249230 INFO  (jetty-launcher-3163-thread-1) [    ] o.a.s.s.SolrDispatchFilter / __| ___| |_ _   Starting in cloud mode on port null
   [junit4]   2> 1249230 INFO  (jetty-launcher-3163-thread-3) [    ] o.e.j.s.Server Started @1249273ms
   [junit4]   2> 1249230 INFO  (jetty-launcher-3163-thread-1) [    ] o.a.s.s.SolrDispatchFilter \__ \/ _ \ | '_|  Install dir: null
   [junit4]   2> 1249230 INFO  (jetty-launcher-3163-thread-3) [    ] o.a.s.c.s.e.JettySolrRunner Jetty properties: {hostContext=/solr, hostPort=34665}
   [junit4]   2> 1249230 INFO  (jetty-launcher-3163-thread-1) [    ] o.a.s.s.SolrDispatchFilter |___/\___/_|_|    Start time: 2018-09-08T08:55:49.421Z
   [junit4]   2> 1249230 ERROR (jetty-launcher-3163-thread-3) [    ] o.a.s.u.StartupLoggingUtils Missing Java Option solr.log.dir. Logging may be missing or incomplete.
   [junit4]   2> 1249230 INFO  (jetty-launcher-3163-thread-3) [    ] o.a.s.s.SolrDispatchFilter Using logger factory org.apache.logging.slf4j.Log4jLoggerFactory
   [junit4]   2> 1249230 INFO  (jetty-launcher-3163-thread-3) [    ] o.a.s.s.SolrDispatchFilter  ___      _       Welcome to Apache Solr? version 7.5.0
   [junit4]   2> 1249230 INFO  (jetty-launcher-3163-thread-3) [    ] o.a.s.s.SolrDispatchFilter / __| ___| |_ _   Starting in cloud mode on port null
   [junit4]   2> 1249230 INFO  (jetty-launcher-3163-thread-3) [    ] o.a.s.s.SolrDispatchFilter \__ \/ _ \ | '_|  Install dir: null
   [junit4]   2> 1249230 INFO  (jetty-launcher-3163-thread-3) [    ] o.a.s.s.SolrDispatchFilter |___/\___/_|_|    Start time: 2018-09-08T08:55:49.421Z
   [junit4]   2> 1249231 INFO  (jetty-launcher-3163-thread-2) [    ] o.e.j.s.h.ContextHandler Started o.e.j.s.ServletContextHandler@69d60954{/solr,null,AVAILABLE}
   [junit4]   2> 1249231 INFO  (jetty-launcher-3163-thread-2) [    ] o.e.j.s.AbstractConnector Started ServerConnector@3a10e1c9{SSL,[ssl, http/1.1]}{127.0.0.1:34193}
   [junit4]   2> 1249231 INFO  (jetty-launcher-3163-thread-2) [    ] o.e.j.s.Server Started @1249275ms
   [junit4]   2> 1249231 INFO  (jetty-launcher-3163-thread-2) [    ] o.a.s.c.s.e.JettySolrRunner Jetty properties: {hostContext=/solr, hostPort=34193}
   [junit4]   2> 1249231 ERROR (jetty-launcher-3163-thread-2) [    ] o.a.s.u.StartupLoggingUtils Missing Java Option solr.log.dir. Logging may be missing or incomplete.
   [junit4]   2> 1249231 INFO  (jetty-launcher-3163-thread-2) [    ] o.a.s.s.SolrDispatchFilter Using logger factory org.apache.logging.slf4j.Log4jLoggerFactory
   [junit4]   2> 1249231 INFO  (jetty-launcher-3163-thread-2) [    ] o.a.s.s.SolrDispatchFilter  ___      _       Welcome to Apache Solr? version 7.5.0
   [junit4]   2> 1249231 INFO  (jetty-launcher-3163-thread-2) [    ] o.a.s.s.SolrDispatchFilter / __| ___| |_ _   Starting in cloud mode on port null
   [junit4]   2> 1249231 INFO  (jetty-launcher-3163-thread-2) [    ] o.a.s.s.SolrDispatchFilter \__ \/ _ \ | '_|  Install dir: null
   [junit4]   2> 1249231 INFO  (jetty-launcher-3163-thread-2) [    ] o.a.s.s.SolrDispatchFilter |___/\___/_|_|    Start time: 2018-09-08T08:55:49.422Z
   [junit4]   2> 1249237 INFO  (zkConnectionManagerCallback-3168-thread-1) [    ] o.a.s.c.c.ConnectionManager zkClient has connected
   [junit4]   2> 1249238 INFO  (zkConnectionManagerCallback-3170-thread-1) [    ] o.a.s.c.c.ConnectionManager zkClient has connected
   [junit4]   2> 1249238 INFO  (jetty-launcher-3163-thread-4) [    ] o.a.s.s.SolrDispatchFilter solr.xml found in ZooKeeper. Loading...
   [junit4]   2> 1249238 INFO  (jetty-launcher-3163-thread-1) [    ] o.a.s.s.SolrDispatchFilter solr.xml found in ZooKeeper. Loading...
   [junit4]   2> 1249241 INFO  (zkConnectionManagerCallback-3174-thread-1) [    ] o.a.s.c.c.ConnectionManager zkClient has connected
   [junit4]   2> 1249241 INFO  (zkConnectionManagerCallback-3172-thread-1) [    ] o.a.s.c.c.ConnectionManager zkClient has connected
   [junit4]   2> 1249241 INFO  (jetty-launcher-3163-thread-3) [    ] o.a.s.s.SolrDispatchFilter solr.xml found in ZooKeeper. Loading...
   [junit4]   2> 1249241 INFO  (jetty-launcher-3163-thread-2) [    ] o.a.s.s.SolrDispatchFilter solr.xml found in ZooKeeper. Loading...
   [junit4]   2> 1249245 WARN  (NIOServerCxn.Factory:0.0.0.0/0.0.0.0:0) [    ] o.a.z.s.NIOServerCnxn Unable to read additional data from client sessionid 0x100dbaf6e750002, likely client has closed socket
   [junit4]   2> 1249334 INFO  (jetty-launcher-3163-thread-2) [    ] o.a.s.c.ZkContainer Zookeeper client=127.0.0.1:44237/solr
   [junit4]   2> 1249335 INFO  (zkConnectionManagerCallback-3178-thread-1) [    ] o.a.s.c.c.ConnectionManager zkClient has connected
   [junit4]   2> 1249337 INFO  (zkConnectionManagerCallback-3180-thread-1) [    ] o.a.s.c.c.ConnectionManager zkClient has connected
   [junit4]   2> 1249368 INFO  (jetty-launcher-3163-thread-4) [    ] o.a.s.c.ZkContainer Zookeeper client=127.0.0.1:44237/solr
   [junit4]   2> 1249369 INFO  (zkConnectionManagerCallback-3186-thread-1) [    ] o.a.s.c.c.ConnectionManager zkClient has connected
   [junit4]   2> 1249373 INFO  (zkConnectionManagerCallback-3188-thread-1) [    ] o.a.s.c.c.ConnectionManager zkClient has connected
   [junit4]   2> 1249385 INFO  (jetty-launcher-3163-thread-4) [n:127.0.0.1:45959_solr    ] o.a.s.c.OverseerElectionContext I am going to be the leader 127.0.0.1:45959_solr
   [junit4]   2> 1249386 INFO  (jetty-launcher-3163-thread-4) [n:127.0.0.1:45959_solr    ] o.a.s.c.Overseer Overseer (id=72299140556849160-127.0.0.1:45959_solr-n_0000000000) starting
   [junit4]   2> 1249406 INFO  (zkConnectionManagerCallback-3195-thread-1) [    ] o.a.s.c.c.ConnectionManager zkClient has connected
   [junit4]   2> 1249407 INFO  (jetty-launcher-3163-thread-2) [n:127.0.0.1:34193_solr    ] o.a.s.c.ZkController Register node as live in ZooKeeper:/live_nodes/127.0.0.1:34193_solr
   [junit4]   2> 1249407 INFO  (jetty-launcher-3163-thread-4) [n:127.0.0.1:45959_solr    ] o.a.s.c.s.i.ZkClientClusterStateProvider Cluster at 127.0.0.1:44237/solr ready
   [junit4]   2> 1249408 INFO  (OverseerStateUpdate-72299140556849160-127.0.0.1:45959_solr-n_0000000000) [n:127.0.0.1:45959_solr    ] o.a.s.c.Overseer Starting to work on the main queue : 127.0.0.1:45959_solr
   [junit4]   2> 1249417 INFO  (OverseerStateUpdate-72299140556849160-127.0.0.1:45959_solr-n_0000000000) [n:127.0.0.1:45959_solr    ] o.a.s.c.c.ZkStateReader Updated live nodes from ZooKeeper... (0) -> (1)
   [junit4]   2> 1249422 INFO  (jetty-launcher-3163-thread-4) [n:127.0.0.1:45959_solr    ] o.a.s.c.TransientSolrCoreCacheDefault Allocating transient cache for 2147483647 transient cores
   [junit4]   2> 1249423 INFO  (jetty-launcher-3163-thread-4) [n:127.0.0.1:45959_solr    ] o.a.s.c.ZkController Register node as live in ZooKeeper:/live_nodes/127.0.0.1:45959_solr
   [junit4]   2> 1249434 INFO  (zkCallback-3179-thread-1) [    ] o.a.s.c.c.ZkStateReader Updated live nodes from ZooKeeper... (0) -> (1)
   [junit4]   2> 1249434 INFO  (zkCallback-3194-thread-1) [    ] o.a.s.c.c.ZkStateReader Updated live nodes from ZooKeeper... (0) -> (1)
   [junit4]   2> 1249435 INFO  (zkCallback-3194-thread-2) [    ] o.a.s.c.c.ZkStateReader Updated live nodes from ZooKeeper... (1) -> (2)
   [junit4]   2> 1249435 INFO  (zkCallback-3179-thread-2) [    ] o.a.s.c.c.ZkStateReader Updated live nodes from ZooKeeper... (1) -> (2)
   [junit4]   2> 1249435 INFO  (zkCallback-3187-thread-2) [    ] o.a.s.c.c.ZkStateReader Updated live nodes from ZooKeeper... (1) -> (2)
   [junit4]   2> 1249435 INFO  (jetty-launcher-3163-thread-4) [n:127.0.0.1:45959_solr    ] o.a.s.h.a.MetricsHistoryHandler No .system collection, keeping metrics history in memory.
   [junit4]   2> 1249441 INFO  (zkConnectionManagerCallback-3201-thread-1) [    ] o.a.s.c.c.ConnectionManager zkClient has connected
   [junit4]   2> 1249442 INFO  (jetty-launcher-3163-thread-2) [n:127.0.0.1:34193_solr    ] o.a.s.c.c.ZkStateReader Updated live nodes from ZooKeeper... (0) -> (2)
   [junit4]   2> 1249442 INFO  (jetty-launcher-3163-thread-2) [n:127.0.0.1:34193_solr    ] o.a.s.c.s.i.ZkClientClusterStateProvider Cluster at 127.0.0.1:44237/solr ready
   [junit4]   2> 1249443 INFO  (jetty-launcher-3163-thread-2) [n:127.0.0.1:34193_solr    ] o.a.s.h.a.MetricsHistoryHandler No .system collection, keeping metrics history in memory.
   [junit4]   2> 1249471 INFO  (jetty-launcher-3163-thread-3) [    ] o.a.s.c.ZkContainer Zookeeper client=127.0.0.1:44237/solr
   [junit4]   2> 1249474 INFO  (jetty-launcher-3163-thread-1) [    ] o.a.s.c.ZkContainer Zookeeper client=127.0.0.1:44237/solr
   [junit4]   2> 1249482 INFO  (zkConnectionManagerCallback-3206-thread-1) [    ] o.a.s.c.c.ConnectionManager zkClient has connected
   [junit4]   2> 1249482 INFO  (zkConnectionManagerCallback-3210-thread-1) [    ] o.a.s.c.c.ConnectionManager zkClient has connected
   [junit4]   2> 1249517 INFO  (jetty-launcher-3163-thread-4) [n:127.0.0.1:45959_solr    ] o.a.s.m.r.SolrJmxReporter JMX monitoring for 'solr_45959.solr.node' (registry 'solr.node') enabled at server: com.sun.jmx.mbeanserver.JmxMBeanServer@4a46e7c7
   [junit4]   2> 1249542 INFO  (jetty-launcher-3163-thread-4) [n:127.0.0.1:45959_solr    ] o.a.s.m.r.SolrJmxReporter JMX monitoring for 'solr_45959.solr.jvm' (registry 'solr.jvm') enabled at server: com.sun.jmx.mbeanserver.JmxMBeanServer@4a46e7c7
   [junit4]   2> 1249565 INFO  (jetty-launcher-3163-thread-2) [n:127.0.0.1:34193_solr    ] o.a.s.m.r.SolrJmxReporter JMX monitoring for 'solr_34193.solr.node' (registry 'solr.node') enabled at server: com.sun.jmx.mbeanserver.JmxMBeanServer@4a46e7c7
   [junit4]   2> 1249569 INFO  (zkConnectionManagerCallback-3212-thread-1) [    ] o.a.s.c.c.ConnectionManager zkClient has connected
   [junit4]   2> 1249569 INFO  (zkConnectionManagerCallback-3214-thread-1) [    ] o.a.s.c.c.ConnectionManager zkClient has connected
   [junit4]   2> 1249578 INFO  (jetty-launcher-3163-thread-4) [n:127.0.0.1:45959_solr    ] o.a.s.m.r.SolrJmxReporter JMX monitoring for 'solr_45959.solr.jetty' (registry 'solr.jetty') enabled at server: com.sun.jmx.mbeanserver.JmxMBeanServer@4a46e7c7
   [junit4]   2> 1249588 INFO  (jetty-launcher-3163-thread-4) [n:127.0.0.1:45959_solr    ] o.a.s.c.CorePropertiesLocator Found 0 core definitions underneath /x1/jenkins/jenkins-slave/workspace/Lucene-Solr-Tests-7.x/solr/build/solr-core/test/J2/temp/solr.cloud.DeleteReplicaTest_F5C9B1F3ED68ADBB-001/tempDir-001/node4/.
   [junit4]   2> 1249592 INFO  (jetty-launcher-3163-thread-2) [n:127.0.0.1:34193_solr    ] o.a.s.m.r.SolrJmxReporter JMX monitoring for 'solr_34193.solr.jvm' (registry 'solr.jvm') enabled at server: com.sun.jmx.mbeanserver.JmxMBeanServer@4a46e7c7
   [junit4]   2> 1249592 INFO  (jetty-launcher-3163-thread-2) [n:127.0.0.1:34193_solr    ] o.a.s.m.r.SolrJmxReporter JMX monitoring for 'solr_34193.solr.jetty' (registry 'solr.jetty') enabled at server: com.sun.jmx.mbeanserver.JmxMBeanServer@4a46e7c7
   [junit4]   2> 1249598 INFO  (jetty-launcher-3163-thread-3) [n:127.0.0.1:34665_solr    ] o.a.s.c.c.ZkStateReader Updated live nodes from ZooKeeper... (0) -> (2)
   [junit4]   2> 1249599 INFO  (jetty-launcher-3163-thread-1) [n:127.0.0.1:41199_solr    ] o.a.s.c.c.ZkStateReader Updated live nodes from ZooKeeper... (0) -> (2)
   [junit4]   2> 1249602 INFO  (jetty-launcher-3163-thread-3) [n:127.0.0.1:34665_solr    ] o.a.s.c.TransientSolrCoreCacheDefault Allocating transient cache for 2147483647 transient cores
   [junit4]   2> 1249602 INFO  (jetty-launcher-3163-thread-3) [n:127.0.0.1:34665_solr    ] o.a.s.c.ZkController Register node as live in ZooKeeper:/live_nodes/127.0.0.1:34665_solr
   [junit4]   2> 1249607 INFO  (zkCallback-3179-thread-2) [    ] o.a.s.c.c.ZkStateReader Updated live nodes from ZooKeeper... (2) -> (3)
   [junit4]   2> 1249607 INFO  (zkCallback-3194-thread-2) [    ] o.a.s.c.c.ZkStateReader Updated live nodes from ZooKeeper... (2) -> (3)
   [junit4]   2> 1249609 INFO  (zkCallback-3187-thread-1) [    ] o.a.s.c.c.ZkStateReader Updated live nodes from ZooKeeper... (2) -> (3)
   [junit4]   2> 1249618 INFO  (zkCallback-3200-thread-1) [    ] o.a.s.c.c.ZkStateReader Updated live nodes from ZooKeeper... (2) -> (3)
   [junit4]   2> 1249619 INFO  (jetty-launcher-3163-thread-2) [n:127.0.0.1:34193_solr    ] o.a.s.c.CorePropertiesLocator Found 0 core definitions underneath /x1/jenkins/jenkins-slave/workspace/Lucene-Solr-Tests-7.x/solr/build/solr-core/test/J2/temp/solr.cloud.DeleteReplicaTest_F5C9B1F3ED68ADBB-001/tempDir-001/node2/.
   [junit4]   2> 1249621 INFO  (zkCallback-3213-thread-1) [    ] o.a.s.c.c.ZkStateReader Updated live nodes from ZooKeeper... (2) -> (3)
   [junit4]   2> 1249625 INFO  (jetty-launcher-3163-thread-1) [n:127.0.0.1:41199_solr    ] o.a.s.c.TransientSolrCoreCacheDefault Allocating transient cache for 2147483647 transient cores
   [junit4]   2> 1249625 INFO  (jetty-launcher-3163-thread-1) [n:127.0.0.1:41199_solr    ] o.a.s.c.ZkController Register node as live in ZooKeeper:/live_nodes/127.0.0.1:41199_solr
   [junit4]   2> 1249630 INFO  (zkCallback-3211-thread-1) [    ] o.a.s.c.c.ZkStateReader Updated live nodes from ZooKeeper... (2) -> (3)
   [junit4]   2> 1249637 INFO  (zkCallback-3213-thread-1) [    ] o.a.s.c.c.ZkStateReader Updated live nodes from ZooKeeper... (3) -> (4)
   [junit4]   2> 1249637 INFO  (zkCallback-3194-thread-2) [    ] o.a.s.c.c.ZkStateReader Updated live nodes from ZooKeeper... (3) -> (4)
   [junit4]   2> 1249637 INFO  (zkCallback-3179-thread-2) [    ] o.a.s.c.c.ZkStateReader Updated live nodes from ZooKeeper... (3) -> (4)
   [junit4]   2> 1249637 INFO  (zkCallback-3200-thread-1) [    ] o.a.s.c.c.ZkStateReader Updated live nodes from ZooKeeper... (3) -> (4)
   [junit4]   2> 1249637 INFO  (zkCallback-3187-thread-1) [    ] o.a.s.c.c.ZkStateReader Updated live nodes from ZooKeeper... (3) -> (4)
   [junit4]   2> 1249638 INFO  (zkCallback-3211-thread-1) [    ] o.a.s.c.c.ZkStateReader Updated live nodes from ZooKeeper... (3) -> (4)
   [junit4]   2> 1249644 INFO  (zkConnectionManagerCallback-3223-thread-1) [    ] o.a.s.c.c.ConnectionManager zkClient has connected
   [junit4]   2> 1249649 INFO  (jetty-launcher-3163-thread-3) [n:127.0.0.1:34665_solr    ] o.a.s.c.c.ZkStateReader Updated live nodes from ZooKeeper... (0) -> (4)
   [junit4]   2> 1249650 INFO  (jetty-launcher-3163-thread-3) [n:127.0.0.1:34665_solr    ] o.a.s.c.s.i.ZkClientClusterStateProvider Cluster at 127.0.0.1:44237/solr ready
   [junit4]   2> 1249673 INFO  (jetty-launcher-3163-thread-3) [n:127.0.0.1:34665_solr    ] o.a.s.h.a.MetricsHistoryHandler No .system collection, keeping metrics history in memory.
   [junit4]   2> 1249681 INFO  (zkConnectionManagerCallback-3229-thread-1) [    ] o.a.s.c.c.ConnectionManager zkClient has connected
   [junit4]   2> 1249682 INFO  (jetty-launcher-3163-thread-1) [n:127.0.0.1:41199_solr    ] o.a.s.c.c.ZkStateReader Updated live nodes from ZooKeeper... (0) -> (4)
   [junit4]   2> 1249683 INFO  (jetty-launcher-3163-thread-1) [n:127.0.0.1:41199_solr    ] o.a.s.c.s.i.ZkClientClusterStateProvider Cluster at 127.0.0.1:44237/solr ready
   [junit4]   2> 1249683 INFO  (jetty-launcher-3163-thread-1) [n:127.0.0.1:41199_solr    ] o.a.s.h.a.MetricsHistoryHandler No .system collection, keeping metrics history in memory.
   [junit4]   2> 1249688 INFO  (jetty-launcher-3163-thread-3) [n:127.0.0.1:34665_solr    ] o.a.s.m.r.SolrJmxReporter JMX monitoring for 'solr_34665.solr.node' (registry 'solr.node') enabled at server: com.sun.jmx.mbeanserver.JmxMBeanServer@4a46e7c7
   [junit4]   2> 1249701 INFO  (jetty-launcher-3163-thread-3) [n:127.0.0.1:34665_solr    ] o.a.s.m.r.SolrJmxReporter JMX monitoring for 'solr_34665.solr.jvm' (registry 'solr.jvm') enabled at server: com.sun.jmx.mbeanserver.JmxMBeanServer@4a46e7c7
   [junit4]   2> 1249701 INFO  (jetty-launcher-3163-thread-3) [n:127.0.0.1:34665_solr    ] o.a.s.m.r.SolrJmxReporter JMX monitoring for 'solr_34665.solr.jetty' (registry 'solr.jetty') enabled at server: com.sun.jmx.mbeanserver.JmxMBeanServer@4a46e7c7
   [junit4]   2> 1249702 INFO  (jetty-launcher-3163-thread-3) [n:127.0.0.1:34665_solr    ] o.a.s.c.CorePropertiesLocator Found 0 core definitions underneath /x1/jenkins/jenkins-slave/workspace/Lucene-Solr-Tests-7.x/solr/build/solr-core/test/J2/temp/solr.cloud.DeleteReplicaTest_F5C9B1F3ED68ADBB-001/tempDir-001/node3/.
   [junit4]   2> 1249703 INFO  (jetty-launcher-3163-thread-1) [n:127.0.0.1:41199_solr    ] o.a.s.m.r.SolrJmxReporter JMX monitoring for 'solr_41199.solr.node' (registry 'solr.node') enabled at server: com.sun.jmx.mbeanserver.JmxMBeanServer@4a46e7c7
   [junit4]   2> 1249709 INFO  (jetty-launcher-3163-thread-1) [n:127.0.0.1:41199_solr    ] o.a.s.m.r.SolrJmxReporter JMX monitoring for 'solr_41199.solr.jvm' (registry 'solr.jvm') enabled at server: com.sun.jmx.mbeanserver.JmxMBeanServer@4a46e7c7
   [junit4]   2> 1249709 INFO  (jetty-launcher-3163-thread-1) [n:127.0.0.1:41199_solr    ] o.a.s.m.r.SolrJmxReporter JMX monitoring for 'solr_41199.solr.jetty' (registry 'solr.jetty') enabled at server: com.sun.jmx.mbeanserver.JmxMBeanServer@4a46e7c7
   [junit4]   2> 1249710 INFO  (jetty-launcher-3163-thread-1) [n:127.0.0.1:41199_solr    ] o.a.s.c.CorePropertiesLocator Found 0 core definitions underneath /x1/jenkins/jenkins-slave/workspace/Lucene-Solr-Tests-7.x/solr/build/solr-core/test/J2/temp/solr.cloud.DeleteReplicaTest_F5C9B1F3ED68ADBB-001/tempDir-001/node1/.
   [junit4]   2> 1249801 INFO  (zkConnectionManagerCallback-3232-thread-1) [    ] o.a.s.c.c.ConnectionManager zkClient has connected
   [junit4]   2> 1249807 INFO  (zkConnectionManagerCallback-3237-thread-1) [    ] o.a.s.c.c.ConnectionManager zkClient has connected
   [junit4]   2> 1249808 INFO  (SUITE-DeleteReplicaTest-seed#[F5C9B1F3ED68ADBB]-worker) [    ] o.a.s.c.c.ZkStateReader Updated live nodes from ZooKeeper... (0) -> (4)
   [junit4]   2> 1249809 INFO  (SUITE-DeleteReplicaTest-seed#[F5C9B1F3ED68ADBB]-worker) [    ] o.a.s.c.s.i.ZkClientClusterStateProvider Cluster at 127.0.0.1:44237/solr ready
   [junit4]   2> 1249873 INFO  (TEST-DeleteReplicaTest.deleteReplicaOnIndexing-seed#[F5C9B1F3ED68ADBB]) [    ] o.a.s.SolrTestCaseJ4 ###Starting deleteReplicaOnIndexing
   [junit4]   2> 1249897 INFO  (qtp934869582-14133) [n:127.0.0.1:34193_solr    ] o.a.s.h.a.CollectionsHandler Invoked Collection Action :create with params collection.configName=conf&name=deleteReplicaOnIndexing&nrtReplicas=2&action=CREATE&numShards=1&wt=javabin&version=2 and sendToOCPQueue=true
   [junit4]   2> 1249899 INFO  (OverseerThreadFactory-5844-thread-1-processing-n:127.0.0.1:45959_solr) [n:127.0.0.1:45959_solr    ] o.a.s.c.a.c.CreateCollectionCmd Create collection deleteReplicaOnIndexing
   [junit4]   2> 1250012 INFO  (OverseerStateUpdate-72299140556849160-127.0.0.1:45959_solr-n_0000000000) [n:127.0.0.1:45959_solr    ] o.a.s.c.o.SliceMutator createReplica() {
   [junit4]   2>   "operation":"ADDREPLICA",
   [junit4]   2>   "collection":"deleteReplicaOnIndexing",
   [junit4]   2>   "shard":"shard1",
   [junit4]   2>   "core":"deleteReplicaOnIndexing_shard1_replica_n1",
   [junit4]   2>   "state":"down",
   [junit4]   2>   "base_url":"https://127.0.0.1:45959/solr",
   [junit4]   2>   "type":"NRT",
   [junit4]   2>   "waitForFinalState":"false"} 
   [junit4]   2> 1250014 INFO  (OverseerStateUpdate-72299140556849160-127.0.0.1:45959_solr-n_0000000000) [n:127.0.0.1:45959_solr    ] o.a.s.c.o.SliceMutator createReplica() {
   [junit4]   2>   "operation":"ADDREPLICA",
   [junit4]   2>   "collection":"deleteReplicaOnIndexing",
   [junit4]   2>   "shard":"shard1",
   [junit4]   2>   "core":"deleteReplicaOnIndexing_shard1_replica_n2",
   [junit4]   2>   "state":"down",
   [junit4]   2>   "base_url":"https://127.0.0.1:34193/solr",
   [junit4]   2>   "type":"NRT",
   [junit4]   2>   "waitForFinalState":"false"} 
   [junit4]   2> 1250224 INFO  (qtp934869582-14144) [n:127.0.0.1:34193_solr    x:deleteReplicaOnIndexing_shard1_replica_n2] o.a.s.h.a.CoreAdminOperation core create command qt=/admin/cores&coreNodeName=core_node4&collection.configName=conf&newCollection=true&name=deleteReplicaOnIndexing_shard1_replica_n2&action=CREATE&numShards=1&collection=deleteReplicaOnIndexing&shard=shard1&wt=javabin&version=2&replicaType=NRT
   [junit4]   2> 1250225 INFO  (qtp934869582-14144) [n:127.0.0.1:34193_solr    x:deleteReplicaOnIndexing_shard1_replica_n2] o.a.s.c.TransientSolrCoreCacheDefault Allocating transient cache for 2147483647 transient cores
   [junit4]   2> 1250237 INFO  (qtp1427666743-14145) [n:127.0.0.1:45959_solr    x:deleteReplicaOnIndexing_shard1_replica_n1] o.a.s.h.a.CoreAdminOperation core create command qt=/admin/cores&coreNodeName=core_node3&collection.configName=conf&newCollection=true&name=deleteReplicaOnIndexing_shard1_replica_n1&action=CREATE&numShards=1&collection=deleteReplicaOnIndexing&shard=shard1&wt=javabin&version=2&replicaType=NRT
   [junit4]   2> 1251236 INFO  (qtp934869582-14144) [n:127.0.0.1:34193_solr c:deleteReplicaOnIndexing s:shard1 r:core_node4 x:deleteReplicaOnIndexing_shard1_replica_n2] o.a.s.c.SolrConfig Using Lucene MatchVersion: 7.5.0
   [junit4]   2> 1251243 INFO  (qtp934869582-14144) [n:127.0.0.1:34193_solr c:deleteReplicaOnIndexing s:shard1 r:core_node4 x:deleteReplicaOnIndexing_shard1_replica_n2] o.a.s.s.IndexSchema [deleteReplicaOnIndexing_shard1_replica_n2] Schema name=minimal
   [junit4]   2> 1251245 INFO  (qtp934869582-14144) [n:127.0.0.1:34193_solr c:deleteReplicaOnIndexing s:shard1 r:core_node4 x:deleteReplicaOnIndexing_shard1_replica_n2] o.a.s.s.IndexSchema Loaded schema minimal/1.1 with uniqueid field id
   [junit4]   2> 1251245 INFO  (qtp934869582-14144) [n:127.0.0.1:34193_solr c:deleteReplicaOnIndexing s:shard1 r:core_node4 x:deleteReplicaOnIndexing_shard1_replica_n2] o.a.s.c.CoreContainer Creating SolrCore 'deleteReplicaOnIndexing_shard1_replica_n2' using configuration from collection deleteReplicaOnIndexing, trusted=true
   [junit4]   2> 1251246 INFO  (qtp934869582-14144) [n:127.0.0.1:34193_solr c:deleteReplicaOnIndexing s:shard1 r:core_node4 x:deleteReplicaOnIndexing_shard1_replica_n2] o.a.s.m.r.SolrJmxReporter JMX monitoring for 'solr_34193.solr.core.deleteReplicaOnIndexing.shard1.replica_n2' (registry 'solr.core.deleteReplicaOnIndexing.shard1.replica_n2') enabled at server: com.sun.jmx.mbeanserver.JmxMBeanServer@4a46e7c7
   [junit4]   2> 1251246 INFO  (qtp934869582-14144) [n:127.0.0.1:34193_solr c:deleteReplicaOnIndexing s:shard1 r:core_node4 x:deleteReplicaOnIndexing_shard1_replica_n2] o.a.s.c.SolrCore [[deleteReplicaOnIndexing_shard1_replica_n2] ] Opening new SolrCore at [/x1/jenkins/jenkins-slave/workspace/Lucene-Solr-Tests-7.x/solr/build/solr-core/test/J2/temp/solr.cloud.DeleteReplicaTest_F5C9B1F3ED68ADBB-001/tempDir-001/node2/deleteReplicaOnIndexing_shard1_replica_n2], dataDir=[/x1/jenkins/jenkins-slave/workspace/Lucene-Solr-Tests-7.x/solr/build/solr-core/test/J2/temp/solr.cloud.DeleteReplicaTest_F5C9B1F3ED68ADBB-001/tempDir-001/node2/./deleteReplicaOnIndexing_shard1_replica_n2/data/]
   [junit4]   2> 1251246 INFO  (qtp1427666743-14145) [n:127.0.0.1:45959_solr c:deleteReplicaOnIndexing s:shard1 r:core_node3 x:deleteReplicaOnIndexing_shard1_replica_n1] o.a.s.c.SolrConfig Using Lucene MatchVersion: 7.5.0
   [junit4]   2> 1251267 INFO  (qtp1427666743-14145) [n:127.0.0.1:45959_solr c:deleteReplicaOnIndexing s:shard1 r:core_node3 x:deleteReplicaOnIndexing_shard1_replica_n1] o.a.s.s.IndexSchema [deleteReplicaOnIndexing_shard1_replica_n1] Schema name=minimal
   [junit4]   2> 1251268 INFO  (qtp1427666743-14145) [n:127.0.0.1:45959_solr c:deleteReplicaOnIndexing s:shard1 r:core_node3 x:deleteReplicaOnIndexing_shard1_replica_n1] o.a.s.s.IndexSchema Loaded schema minimal/1.1 with uniqueid field id
   [junit4]   2> 1251269 INFO  (qtp1427666743-14145) [n:127.0.0.1:45959_solr c:deleteReplicaOnIndexing s:shard1 r:core_node3 x:deleteReplicaOnIndexing_shard1_replica_n1] o.a.s.c.CoreContainer Creating SolrCore 'deleteReplicaOnIndexing_shard1_replica_n1' using configuration from collection deleteReplicaOnIndexing, trusted=true
   [junit4]   2> 1251269 INFO  (qtp1427666743-14145) [n:127.0.0.1:45959_solr c:deleteReplicaOnIndexing s:shard1 r:core_node3 x:deleteReplicaOnIndexing_shard1_replica_n1] o.a.s.m.r.SolrJmxReporter JMX monitoring for 'solr_45959.solr.core.deleteReplicaOnIndexing.shard1.replica_n1' (registry 'solr.core.deleteReplicaOnIndexing.shard1.replica_n1') enabled at server: com.sun.jmx.mbeanserver.JmxMBeanServer@4a46e7c7
   [junit4]   2> 1251269 INFO  (qtp1427666743-14145) [n:127.0.0.1:45959_solr c:deleteReplicaOnIndexing s:shard1 r:core_node3 x:deleteReplicaOnIndexing_shard1_replica_n1] o.a.s.c.SolrCore [[deleteReplicaOnIndexing_shard1_replica_n1] ] Opening new SolrCore at [/x1/jenkins/jenkins-slave/workspace/Lucene-Solr-Tests-7.x/solr/build/solr-core/test/J2/temp/solr.cloud.DeleteReplicaTest_F5C9B1F3ED68ADBB-001/tempDir-001/node4/deleteReplicaOnIndexing_shard1_replica_n1], dataDir=[/x1/jenkins/jenkins-slave/workspace/Lucene-Solr-Tests-7.x/solr/build/solr-core/test/J2/temp/solr.cloud.DeleteReplicaTest_F5C9B1F3ED68ADBB-001/tempDir-001/node4/./deleteReplicaOnIndexing_shard1_replica_n1/data/]
   [junit4]   2> 1251307 INFO  (qtp934869582-14144) [n:127.0.0.1:34193_solr c:deleteReplicaOnIndexing s:shard1 r:core_node4 x:deleteReplicaOnIndexing_shard1_replica_n2] o.a.s.u.UpdateHandler Using UpdateLog implementation: org.apache.solr.update.UpdateLog
   [junit4]   2> 1251307 INFO  (qtp934869582-14144) [n:127.0.0.1:34193_solr c:deleteReplicaOnIndexing s:shard1 r:core_node4 x:deleteReplicaOnIndexing_shard1_replica_n2] o.a.s.u.UpdateLog Initializing UpdateLog: dataDir=null defaultSyncLevel=FLUSH numRecordsToKeep=100 maxNumLogsToKeep=10 numVersionBuckets=65536
   [junit4]   2> 1251309 INFO  (qtp934869582-14144) [n:127.0.0.1:34193_solr c:deleteReplicaOnIndexing s:shard1 r:core_node4 x:deleteReplicaOnIndexing_shard1_replica_n2] o.a.s.u.CommitTracker Hard AutoCommit: disabled
   [junit4]   2> 1251309 INFO  (qtp934869582-14144) [n:127.0.0.1:34193_solr c:deleteReplicaOnIndexing s:shard1 r:core_node4 x:deleteReplicaOnIndexing_shard1_replica_n2] o.a.s.u.CommitTracker Soft AutoCommit: disabled
   [junit4]   2> 1251310 INFO  (qtp934869582-14144) [n:127.0.0.1:34193_solr c:deleteReplicaOnIndexing s:shard1 r:core_node4 x:deleteReplicaOnIndexing_shard1_replica_n2] o.a.s.s.SolrIndexSearcher Opening [Searcher@6b189088[deleteReplicaOnIndexing_shard1_replica_n2] main]
   [junit4]   2> 1251311 INFO  (qtp934869582-14144) [n:127.0.0.1:34193_solr c:deleteReplicaOnIndexing s:shard1 r:core_node4 x:deleteReplicaOnIndexing_shard1_replica_n2] o.a.s.r.ManagedResourceStorage Configured ZooKeeperStorageIO with znodeBase: /configs/conf
   [junit4]   2> 1251311 INFO  (qtp934869582-14144) [n:127.0.0.1:34193_solr c:deleteReplicaOnIndexing s:shard1 r:core_node4 x:deleteReplicaOnIndexing_shard1_replica_n2] o.a.s.r.ManagedResourceStorage Loaded null at path _rest_managed.json using ZooKeeperStorageIO:path=/configs/conf
   [junit4]   2> 1251312 INFO  (qtp934869582-14144) [n:127.0.0.1:34193_solr c:deleteReplicaOnIndexing s:shard1 r:core_node4 x:deleteReplicaOnIndexing_shard1_replica_n2] o.a.s.h.ReplicationHandler Commits will be reserved for 10000ms.
   [junit4]   2> 1251312 INFO  (qtp934869582-14144) [n:127.0.0.1:34193_solr c:deleteReplicaOnIndexing s:shard1 r:core_node4 x:deleteReplicaOnIndexing_shard1_replica_n2] o.a.s.u.UpdateLog Could not find max version in index or recent updates, using new clock 1611028969819209728
   [junit4]   2> 1251312 INFO  (qtp1427666743-14145) [n:127.0.0.1:45959_solr c:deleteReplicaOnIndexing s:shard1 r:core_node3 x:deleteReplicaOnIndexing_shard1_replica_n1] o.a.s.u.UpdateHandler Using UpdateLog implementation: org.apache.solr.update.UpdateLog
   [junit4]   2> 1251312 INFO  (qtp1427666743-14145) [n:127.0.0.1:45959_solr c:deleteReplicaOnIndexing s:shard1 r:core_node3 x:deleteReplicaOnIndexing_shard1_replica_n1] o.a.s.u.UpdateLog Initializing UpdateLog: dataDir=null defaultSyncLevel=FLUSH numRecordsToKeep=100 maxNumLogsToKeep=10 numVersionBuckets=65536
   [junit4]   2> 1251312 INFO  (searcherExecutor-5867-thread-1-processing-n:127.0.0.1:34193_solr x:deleteReplicaOnIndexing_shard1_replica_n2 c:deleteReplicaOnIndexing s:shard1 r:core_node4) [n:127.0.0.1:34193_solr c:deleteReplicaOnIndexing s:shard1 r:core_node4 x:deleteReplicaOnIndexing_shard1_replica_n2] o.a.s.c.SolrCore [deleteReplicaOnIndexing_shard1_replica_n2] Registered new searcher Searcher@6b189088[deleteReplicaOnIndexing_shard1_replica_n2] main{ExitableDirectoryReader(UninvertingDirectoryReader())}
   [junit4]   2> 1251313 INFO  (qtp1427666743-14145) [n:127.0.0.1:45959_solr c:deleteReplicaOnIndexing s:shard1 r:core_node3 x:deleteReplicaOnIndexing_shard1_replica_n1] o.a.s.u.CommitTracker Hard AutoCommit: disabled
   [junit4]   2> 1251313 INFO  (qtp1427666743-14145) [n:127.0.0.1:45959_solr c:deleteReplicaOnIndexing s:shard1 r:core_node3 x:deleteReplicaOnIndexing_shard1_replica_n1] o.a.s.u.CommitTracker Soft AutoCommit: disabled
   [junit4]   2> 1251314 INFO  (qtp1427666743-14145) [n:127.0.0.1:45959_solr c:deleteReplicaOnIndexing s:shard1 r:core_node3 x:deleteReplicaOnIndexing_shard1_replica_n1] o.a.s.s.SolrIndexSearcher Opening [Searcher@53e8587c[deleteReplicaOnIndexing_shard1_replica_n1] main]
   [junit4]   2> 1251315 INFO  (qtp1427666743-14145) [n:127.0.0.1:45959_solr c:deleteReplicaOnIndexing s:shard1 r:core_node3 x:deleteReplicaOnIndexing_shard1_replica_n1] o.a.s.r.ManagedResourceStorage Configured ZooKeeperStorageIO with znodeBase: /configs/conf
   [junit4]   2> 1251315 INFO  (qtp1427666743-14145) [n:127.0.0.1:45959_solr c:deleteReplicaOnIndexing s:shard1 r:core_node3 x:deleteReplicaOnIndexing_shard1_replica_n1] o.a.s.r.ManagedResourceStorage Loaded null at path _rest_managed.json using ZooKeeperStorageIO:path=/configs/conf
   [junit4]   2> 1251316 INFO  (qtp1427666743-14145) [n:127.0.0.1:45959_solr c:deleteReplicaOnIndexing s:shard1 r:core_node3 x:deleteReplicaOnIndexing_shard1_replica_n1] o.a.s.h.ReplicationHandler Commits will be reserved for 10000ms.
   [junit4]   2> 1251316 INFO  (qtp1427666743-14145) [n:127.0.0.1:45959_solr c:deleteReplicaOnIndexing s:shard1 r:core_node3 x:deleteReplicaOnIndexing_shard1_replica_n1] o.a.s.u.UpdateLog Could not find max version in index or recent updates, using new clock 1611028969823404032
   [junit4]   2> 1251317 INFO  (searcherExecutor-5868-thread-1-processing-n:127.0.0.1:45959_solr x:deleteReplicaOnIndexing_shard1_replica_n1 c:deleteReplicaOnIndexing s:shard1 r:core_node3) [n:127.0.0.1:45959_solr c:deleteReplicaOnIndexing s:shard1 r:core_node3 x:deleteReplicaOnIndexing_shard1_replica_n1] o.a.s.c.SolrCore [deleteReplicaOnIndexing_shard1_replica_n1] Registered new searcher Searcher@53e8587c[deleteReplicaOnIndexing_shard1_replica_n1] main{ExitableDirectoryReader(UninvertingDirectoryReader())}
   [junit4]   2> 1251318 INFO  (qtp934869582-14144) [n:127.0.0.1:34193_solr c:deleteReplicaOnIndexing s:shard1 r:core_node4 x:deleteReplicaOnIndexing_shard1_replica_n2] o.a.s.c.ZkShardTerms Successful update of terms at /collections/deleteReplicaOnIndexing/terms/shard1 to Terms{values={core_node4=0}, version=0}
   [junit4]   2> 1251320 INFO  (qtp1427666743-14145) [n:127.0.0.1:45959_solr c:deleteReplicaOnIndexing s:shard1 r:core_node3 x:deleteReplicaOnIndexing_shard1_replica_n1] o.a.s.c.ZkShardTerms Successful update of terms at /collections/deleteReplicaOnIndexing/terms/shard1 to Terms{values={core_node3=0, core_node4=0}, version=1}
   [junit4]   2> 1251322 INFO  (qtp934869582-14144) [n:127.0.0.1:34193_solr c:deleteReplicaOnIndexing s:shard1 r:core_node4 x:deleteReplicaOnIndexing_shard1_replica_n2] o.a.s.c.ShardLeaderElectionContext Enough replicas found to continue.
   [junit4]   2> 1251322 INFO  (qtp934869582-14144) [n:127.0.0.1:34193_solr c:deleteReplicaOnIndexing s:shard1 r:core_node4 x:deleteReplicaOnIndexing_shard1_replica_n2] o.a.s.c.ShardLeaderElectionContext I may be the new leader - try and sync
   [junit4]   2> 1251322 INFO  (qtp934869582-14144) [n:127.0.0.1:34193_solr c:deleteReplicaOnIndexing s:shard1 r:core_node4 x:deleteReplicaOnIndexing_shard1_replica_n2] o.a.s.c.SyncStrategy Sync replicas to https://127.0.0.1:34193/solr/deleteReplicaOnIndexing_shard1_replica_n2/
   [junit4]   2> 1251322 INFO  (qtp934869582-14144) [n:127.0.0.1:34193_solr c:deleteReplicaOnIndexing s:shard1 r:core_node4 x:deleteReplicaOnIndexing_shard1_replica_n2] o.a.s.u.PeerSync PeerSync: core=deleteReplicaOnIndexing_shard1_replica_n2 url=https://127.0.0.1:34193/solr START replicas=[https://127.0.0.1:45959/solr/deleteReplicaOnIndexing_shard1_replica_n1/] nUpdates=100
   [junit4]   2> 1251323 INFO  (qtp934869582-14144) [n:127.0.0.1:34193_solr c:deleteReplicaOnIndexing s:shard1 r:core_node4 x:deleteReplicaOnIndexing_shard1_replica_n2] o.a.s.u.PeerSync PeerSync: core=deleteReplicaOnIndexing_shard1_replica_n2 url=https://127.0.0.1:34193/solr DONE.  We have no versions.  sync failed.
   [junit4]   2> 1251327 INFO  (qtp1427666743-14148) [n:127.0.0.1:45959_solr c:deleteReplicaOnIndexing s:shard1 r:core_node3 x:deleteReplicaOnIndexing_shard1_replica_n1] o.a.s.c.S.Request [deleteReplicaOnIndexing_shard1_replica_n1]  webapp=/solr path=/get params={distrib=false&qt=/get&fingerprint=false&getVersions=100&wt=javabin&version=2} status=0 QTime=0
   [junit4]   2> 1251327 INFO  (qtp934869582-14144) [n:127.0.0.1:34193_solr c:deleteReplicaOnIndexing s:shard1 r:core_node4 x:deleteReplicaOnIndexing_shard1_replica_n2] o.a.s.c.SyncStrategy Leader's attempt to sync with shard failed, moving to the next candidate
   [junit4]   2> 1251327 INFO  (qtp934869582-14144) [n:127.0.0.1:34193_solr c:deleteReplicaOnIndexing s:shard1 r:core_node4 x:deleteReplicaOnIndexing_shard1_replica_n2] o.a.s.c.ShardLeaderElectionContext We failed sync, but we have no versions - we can't sync in that case - we were active before, so become leader anyway
   [junit4]   2> 1251327 INFO  (qtp934869582-14144) [n:127.0.0.1:34193_solr c:deleteReplicaOnIndexing s:shard1 r:core_node4 x:deleteReplicaOnIndexing_shard1_replica_n2] o.a.s.c.ShardLeaderElectionContext Found all replicas participating in election, clear LIR
   [junit4]   2> 1251330 INFO  (qtp934869582-14144) [n:127.0.0.1:34193_solr c:deleteReplicaOnIndexing s:shard1 r:core_node4 x:deleteReplicaOnIndexing_shard1_replica_n2] o.a.s.c.ShardLeaderElectionContext I am the new leader: https://127.0.0.1:34193/solr/deleteReplicaOnIndexing_shard1_replica_n2/ shard1
   [junit4]   2> 1251432 INFO  (qtp934869582-14144) [n:127.0.0.1:34193_solr c:deleteReplicaOnIndexing s:shard1 r:core_node4 x:deleteReplicaOnIndexing_shard1_replica_n2] o.a.s.c.ZkController I am the leader, no recovery necessary
   [junit4]   2> 1251435 INFO  (qtp934869582-14144) [n:127.0.0.1:34193_solr c:deleteReplicaOnIndexing s:shard1 r:core_node4 x:deleteReplicaOnIndexing_shard1_replica_n2] o.a.s.s.HttpSolrCall [admin] webapp=null path=/admin/cores params={qt=/admin/cores&coreNodeName=core_node4&collection.configName=conf&newCollection=true&name=deleteReplicaOnIndexing_shard1_replica_n2&action=CREATE&numShards=1&collection=deleteReplicaOnIndexing&shard=shard1&wt=javabin&version=2&replicaType=NRT} status=0 QTime=1211
   [junit4]   2> 1251534 INFO  (zkCallback-3179-thread-2) [    ] o.a.s.c.c.ZkStateReader A cluster state change: [WatchedEvent state:SyncConnected type:NodeDataChanged path:/collections/deleteReplicaOnIndexing/state.json] for collection [deleteReplicaOnIndexing] has occurred - updating... (live nodes size: [4])
   [junit4]   2> 1252325 INFO  (qtp1427666743-14145) [n:127.0.0.1:45959_solr c:deleteReplicaOnIndexing s:shard1 r:core_node3 x:deleteReplicaOnIndexing_shard1_replica_n1] o.a.s.s.HttpSolrCall [admin] webapp=null path=/admin/cores params={qt=/admin/cores&coreNodeName=core_node3&collection.configName=conf&newCollection=true&name=deleteReplicaOnIndexing_shard1_replica_n1&action=CREATE&numShards=1&collection=deleteReplicaOnIndexing&shard=shard1&wt=javabin&version=2&replicaType=NRT} status=0 QTime=2088
   [junit4]   2> 1252328 INFO  (qtp934869582-14133) [n:127.0.0.1:34193_solr    ] o.a.s.h.a.CollectionsHandler Wait for new collection to be active for at most 30 seconds. Check all shard replicas
   [junit4]   2> 1252425 INFO  (zkCallback-3187-thread-1) [    ] o.a.s.c.c.ZkStateReader A cluster state change: [WatchedEvent state:SyncConnected type:NodeDataChanged path:/collections/deleteReplicaOnIndexing/state.json] for collection [deleteReplicaOnIndexing] has occurred - updating... (live nodes size: [4])
   [junit4]   2> 1252425 INFO  (zkCallback-3179-thread-2) [    ] o.a.s.c.c.ZkStateReader A cluster state change: [WatchedEvent state:SyncConnected type:NodeDataChanged path:/collections/deleteReplicaOnIndexing/state.json] for collection [deleteReplicaOnIndexing] has occurred - updating... (live nodes size: [4])
   [junit4]   2> 1253328 INFO  (qtp934869582-14133) [n:127.0.0.1:34193_solr    ] o.a.s.s.HttpSolrCall [admin] webapp=null path=/admin/collections params={collection.configName=conf&name=deleteReplicaOnIndexing&nrtReplicas=2&action=CREATE&numShards=1&wt=javabin&version=2} status=0 QTime=3431
   [junit4]   2> 1253349 INFO  (qtp934869582-14143) [n:127.0.0.1:34193_solr c:deleteReplicaOnIndexing s:shard1 r:core_node4 x:deleteReplicaOnIndexing_shard1_replica_n2] o.a.s.c.ZkShardTerms Failed to save terms, version is not a match, retrying
   [junit4]   2> 1253349 INFO  (qtp934869582-14138) [n:127.0.0.1:34193_solr c:deleteReplicaOnIndexing s:shard1 r:core_node4 x:deleteReplicaOnIndexing_shard1_replica_n2] o.a.s.c.ZkShardTerms Successful update of terms at /collections/deleteReplicaOnIndexing/terms/shard1 to Terms{values={core_node3=1, core_node4=1}, version=2}
   [junit4]   2> 1253354 INFO  (qtp1427666743-14146) [n:127.0.0.1:45959_solr c:deleteReplicaOnIndexing s:shard1 r:core_node3 x:deleteReplicaOnIndexing_shard1_replica_n1] o.a.s.u.p.LogUpdateProcessorFactory [deleteReplicaOnIndexing_shard1_replica_n1]  webapp=/solr path=/update params={update.distrib=FROMLEADER&distrib.from=https://127.0.0.1:34193/solr/deleteReplicaOnIndexing_shard1_replica_n2/&wt=javabin&version=2}{add=[20000 (1611028971944673280)]} 0 0
   [junit4]   2> 1253361 INFO  (qtp1427666743-14145) [n:127.0.0.1:45959_solr c:deleteReplicaOnIndexing s:shard1 r:core_node3 x:deleteReplicaOnIndexing_shard1_replica_n1] o.a.s.u.p.LogUpdateProcessorFactory [deleteReplicaOnIndexing_shard1_replica_n1]  webapp=/solr path=/update params={update.distrib=FROMLEADER&distrib.from=https://127.0.0.1:34193/solr/deleteReplicaOnIndexing_shard1_replica_n2/&wt=javabin&version=2}{add=[0 (1611028971937333248)]} 0 8
   [junit4]   2> 1253362 INFO  (qtp934869582-14143) [n:127.0.0.1:34193_solr c:deleteReplicaOnIndexing s:shard1 r:core_node4 x:deleteReplicaOnIndexing_shard1_replica_n2] o.a.s.u.p.LogUpdateProcessorFactory [deleteReplicaOnIndexing_shard1_replica_n2]  webapp=/solr path=/update params={wt=javabin&version=2}{add=[0 (1611028971937333248)]} 0 30
   [junit4]   2> 1253363 INFO  (qtp1427666743-14145) [n:127.0.0.1:45959_solr c:deleteReplicaOnIndexing s:shard1 r:core_node3 x:deleteReplicaOnIndexing_shard1_replica_n1] o.a.s.u.p.LogUpdateProcessorFactory [deleteReplicaOnIndexing_shard1_replica_n1]  webapp=/solr path=/update params={update.distrib=FROMLEADER&distrib.from=https://127.0.0.1:34193/solr/deleteReplicaOnIndexing_shard1_replica_n2/&wt=javabin&version=2}{add=[170000 (1611028971969839104)]} 0 0
   [junit4]   2> 1253364 INFO  (qtp934869582-14143) [n:127.0.0.1:34193_solr c:deleteReplicaOnIndexing s:shard1 r:core_node4 x:deleteReplicaOnIndexing_shard1_replica_n2] o.a.s.u.p.LogUpdateProcessorFactory [deleteReplicaOnIndexing_shard1_replica_n2]  webapp=/solr path=/update params={wt=javabin&version=2}{add=[170000 (1611028971969839104)]} 0 0
   [junit4]   2> 1253367 INFO  (qtp934869582-14138) [n:127.0.0.1:34193_solr c:deleteReplicaOnIndexing s:shard1 r:core_node4 x:deleteReplicaOnIndexing_shard1_replica_n2] o.a.s.u.p.LogUpdateProcessorFactory [deleteReplicaOnIndexing_shard1_replica_n2]  webapp=/solr path=/update params={wt=javabin&version=2}{add=[20000 (1611028971944673280)]} 0 27
   [junit4]   2> 1253369 INFO  (qtp1427666743-14145) [n:127.0.0.1:45959_solr c:deleteReplicaOnIndexing s:shard1 r:core_node3 x:deleteReplicaOnIndexing_shard1_replica_n1] o.a.s.u.p.LogUpdateProcessorFactory [deleteReplicaOnIndexing_shard1_replica_n1]  webapp=/solr path=/update params={update.distrib=FROMLEADER&distrib.from=https://127.0.0.1:34193/solr/deleteReplicaOnIndexing_shard1_replica_n2/&wt=javabin&version=2}{add=[150000 (1611028971952013312)]} 0 0
   [junit4]   2> 1253370 INFO  (qtp934869582-14126) [n:127.0.0.1:34193_solr c:deleteReplicaOnIndexing s:shard1 r:core_node4 x:deleteReplicaOnIndexing_shard1_replica_n2] o.a.s.u.p.LogUpdateProcessorFactory [deleteReplicaOnIndexing_shard1_replica_n2]  webapp=/solr path=/update params={wt=javabin&version=2}{add=[150000 (1611028971952013312)]} 0 23
   [junit4]   2> 1253372 INFO  (qtp1427666743-14132) [n:127.0.0.1:45959_solr c:deleteReplicaOnIndexing s:shard1 r:core_node3 x:deleteReplicaOnIndexing_shard1_replica_n1] o.a.s.u.p.LogUpdateProcessorFactory [deleteReplicaOnIndexing_shard1_replica_n1]  webapp=/solr path=/update params={update.distrib=FROMLEADER&distrib.from=https://127.0.0.1:34193/solr/deleteReplicaOnIndexing_shard1_replica_n2/&wt=javabin&version=2}{add=[210000 (1611028971970887680)]} 0 0
   [junit4]   2> 1253372 INFO  (qtp934869582-14143) [n:127.0.0.1:34193_solr c:deleteReplicaOnIndexing s:shard1 r:core_node4 x:deleteReplicaOnIndexing_shard1_replica_n2] o.a.s.u.p.LogUpdateProcessorFactory [deleteReplicaOnIndexing_shard1_replica_n2]  webapp=/solr path=/update params={wt=javabin&version=2}{add=[210000 (1611028971970887680)]} 0 8
   [junit4]   2> 1253373 INFO  (qtp1427666743-14132) [n:127.0.0.1:45959_solr c:deleteReplicaOnIndexing s:shard1 r:core_node3 x:deleteReplicaOnIndexing_shard1_replica_n1] o.a.s.u.p.LogUpdateProcessorFactory [deleteReplicaOnIndexing_shard1_replica_n1]  webapp=/solr path=/update params={update.distrib=FROMLEADER&distrib.from=https://127.0.0.1:34193/solr/deleteReplicaOnIndexing_shard1_replica_n2/&wt=javabin&version=2}{add=[280000 (1611028971979276288)]} 0 0
   [junit4]   2> 1253373 INFO  (qtp934869582-14138) [n:127.0.0.1:34193_solr c:deleteReplicaOnIndexing s:shard1 r:core_node4 x:deleteReplicaOnIndexing_shard1_replica_n2] o.a.s.u.p.LogUpdateProcessorFactory [deleteReplicaOnIndexing_shard1_replica_n2]  webapp=/solr path=/update params={wt=javabin&version=2}{add=[280000 (1611028971979276288)]} 0 1
   [junit4]   2> 1253373 INFO  (qtp1427666743-14132) [n:127.0.0.1:45959_solr c:deleteReplicaOnIndexing s:shard1 r:core_node3 x:deleteReplicaOnIndexing_shard1_replica_n1] o.a.s.u.p.LogUpdateProcessorFactory [deleteReplicaOnIndexing_shard1_replica_n1]  webapp=/solr path=/update params={update.distrib=FROMLEADER&distrib.from=https://127.0.0.1:34193/solr/deleteReplicaOnIndexing_shard1_replica_n2/&wt=javabin&version=2}{add=[20001 (1611028971975081984)]} 0 0
   [junit4]   2> 1253373 INFO  (qtp1427666743-14148) [n:127.0.0.1:45959_solr c:deleteReplicaOnIndexing s:shard1 r:core_node3 x:deleteReplicaOnIndexing_shard1_replica_n1] o.a.s.u.p.LogUpdateProcessorFactory [deleteReplicaOnIndexing_shard1_replica_n1]  webapp=/solr path=/update params={update.distrib=FROMLEADER&distrib.from=https://127.0.0.1:34193/solr/deleteReplicaOnIndexing_shard1_replica_n2/&wt=javabin&version=2}{add=[190000 (1611028971963547648)]} 0 0
   [junit4]   2> 1253373 INFO  (qtp934869582-14125) [n:127.0.0.1:34193_solr c:deleteReplicaOnIndexing s:shard1 r:core_node4 x:deleteReplicaOnIndexing_shard1_replica_n2] o.a.s.u.p.LogUpdateProcessorFactory [deleteReplicaOnIndexing_shard1_replica_n2]  webapp=/solr path=/update params={wt=javabin&version=2}{add=[20001 (1611028971975081984)]} 0 5
   [junit4]   2> 1253373 INFO  (qtp934869582-14133) [n:127.0.0.1:34193_solr c:deleteReplicaOnIndexing s:shard1 r:core_node4 x:deleteReplicaOnIndexing_shard1_replica_n2] o.a.s.u.p.LogUpdateProcessorFactory [deleteReplicaOnIndexing_shard1_replica_n2]  webapp=/solr path=/update params={wt=javabin&version=2}{add=[190000 (1611028971963547648)]} 0 15
   [junit4]   2> 1253374 INFO  (qtp1427666743-14145) [n:127.0.0.1:45959_solr c:deleteReplicaOnIndexing s:shard1 r:core_node3 x:deleteReplicaOnIndexing_shard1_replica_n1] o.a.s.u.p.LogUpdateProcessorFactory [deleteReplicaOnIndexing_shard1_replica_n1]  webapp=/solr path=/update params={update.distrib=FROMLEADER&distrib.from=https://127.0.0.1:34193/solr/deleteReplicaOnIndexing_shard1_replica_n2/&wt=javabin&version=2}{add=[10000 (1611028971960401920)]} 0 0
   [junit4]   2> 1253374 INFO  (qtp934869582-14311) [n:127.0.0.1:34193_solr c:deleteReplicaOnIndexing s:shard1 r:core_node4 x:deleteReplicaOnIndexing_shard1_replica_n2] o.a.s.u.p.LogUpdateProcessorFactory [deleteReplicaOnIndexing_shard1_replica_n2]  webapp=/solr path=/update params={wt=javabin&version=2}{add=[10000 (1611028971960401920)]} 0 20
   [junit4]   2> 1253378 INFO  (qtp1427666743-14132) [n:127.0.0.1:45959_solr c:deleteReplicaOnIndexing s:shard1 r:core_node3 x:deleteReplicaOnIndexing_shard1_replica_n1] o.a.s.u.p.LogUpdateProcessorFactory [deleteReplicaOnIndexing_shard1_replica_n1]  webapp=/solr path=/update params={update.distrib=FROMLEADER&distrib.from=https://127.0.0.1:34193/solr/deleteReplicaOnIndexing_shard1_replica_n2/&wt=javabin&version=2}{add=[50000 (1611028971982422016)]} 0 0
   [junit4]   2> 1253378 INFO  (qtp934869582-14133) [n:127.0.0.1:34193_solr c:deleteReplicaOnIndexing s:shard1 r:core_node4 x:deleteReplicaOnIndexing_shard1_replica_n2] o.a.s.u.p.LogUpdateProcessorFactory [deleteReplicaOnIndexing_shard1_replica_n2]  webapp=/solr path=/update params={wt=javabin&version=2}{add=[50000 (1611028971982422016)]} 0 3
   [junit4]   2> 1253380 INFO  (qtp1427666743-14148) [n:127.0.0.1:45959_solr c:deleteReplicaOnIndexing s:shard1 r:core_node3 x:deleteReplicaOnIndexing_shard1_replica_n1] o.a.s.u.p.LogUpdateProcessorFactory [deleteReplicaOnIndexing_shard1_replica_n1]  webapp=/solr path=/update params={update.distrib=FROMLEADER&distrib.from=https://127.0.0.1:34193/solr/deleteReplicaOnIndexing_shard1_replica_n2/&wt=javabin&version=2}{add=[60000 (1611028971953061888)]} 0 0
   [junit4]   2> 1253380 INFO  (qtp934869582-14144) [n:127.0.0.1:34193_solr c:deleteReplicaOnIndexing s:shard1 r:core_node4 x:deleteReplicaOnIndexing_shard1_replica_n2] o.a.s.u.p.LogUpdateProcessorFactory [deleteReplicaOnIndexing_shard1_replica_n2]  webapp=/solr path=/update params={wt=javabin&version=2}{add=[60000 (1611028971953061888)]} 0 32
   [junit4]   2> 1253387 INFO  (qtp1427666743-14148) [n:127.0.0.1:45959_solr c:deleteReplicaOnIndexing s:shard1 r:core_node3 x:deleteReplicaOnIndexing_shard1_replica_n1] o.a.s.u.p.LogUpdateProcessorFactory [deleteReplicaOnIndexing_shard1_replica_n1]  webapp=/solr path=/update params={update.distrib=FROMLEADER&distrib.from=https://127.0.0.1:34193/solr/deleteReplicaOnIndexing_shard1_replica_n2/&wt=javabin&version=2}{add=[70000 (1611028971982422017)]} 0 0
   [junit4]   2> 1253387 INFO  (qtp934869582-14331) [n:127.0.0.1:34193_solr c:deleteReplicaOnIndexing s:shard1 r:core_node4 x:deleteReplicaOnIndexing_shard1_replica_n2] o.a.s.u.p.LogUpdateProcessorFactory [deleteReplicaOnIndexing_shard1_replica_n2]  webapp=/solr path=/update params={wt=javabin&version=2}{add=[70000 (1611028971982422017)]} 0 11
   [junit4]   2> 1253389 INFO  (qtp1427666743-14147) [n:127.0.0.1:45959_solr c:deleteReplicaOnIndexing s:shard1 r:core_node3 x:deleteReplicaOnIndexing_shard1_replica_n1] o.a.s.u.p.LogUpdateProcessorFactory [deleteReplicaOnIndexing_shard1_replica_n1]  webapp=/solr path=/update params={update.distrib=FROMLEADER&distrib.from=https://127.0.0.1:34193/solr/deleteReplicaOnIndexing_shard1_replica_n2/&wt=javabin&version=2}{add=[210001 (1611028971980324864)]} 0 0
   [junit4]   2> 1253389 INFO  (qtp934869582-14334) [n:127.0.0.1:34193_solr c:deleteReplicaOnIndexing s:shard1 r:core_node4 x:deleteReplicaOnIndexing_shard1_replica_n2] o.a.s.u.p.LogUpdateProcessorFactory [deleteReplicaOnIndexing_shard1_replica_n2]  webapp=/solr path=/update params={wt=javabin&version=2}{add=[210001 (1611028971980324864)]} 0 15
   [junit4]   2> 1253394 INFO  (qtp1427666743-14147) [n:127.0.0.1:45959_solr c:deleteReplicaOnIndexing s:shard1 r:core_node3 x:deleteReplicaOnIndexing_shard1_replica_n1] o.a.s.u.p.LogUpdateProcessorFactory [deleteReplicaOnIndexing_shard1_replica_n1]  webapp=/solr path=/update params={update.distrib=FROMLEADER&distrib.from=https://127.0.0.1:34193/solr/deleteReplicaOnIndexing_shard1_replica_n2/&wt=javabin&version=2}{add=[20002 (1611028971981373440)]} 0 0
   [junit4]   2> 1253395 INFO  (qtp1427666743-14148) [n:127.0.0.1:45959_solr c:deleteReplicaOnIndexing s:shard1 r:core_node3 x:deleteReplicaOnIndexing_shard1_replica_n1] o.a.s.u.p.LogUpdateProcessorFactory [deleteReplicaOnIndexing_shard1_replica_n1]  webapp=/solr path=/update params={update.distrib=FROMLEADER&distrib.from=https://127.0.0.1:34193/solr/deleteReplicaOnIndexing_shard1_replica_n2/&wt=javabin&version=2}{add=[310000 (1611028971981373441)]} 0 0
   [junit4]   2> 1253395 INFO  (qtp1427666743-14132) [n:127.0.0.1:45959_solr c:deleteReplicaOnIndexing s:shard1 r:core_node3 x:deleteReplicaOnIndexing_shard1_replica_n1] o.a.s.u.p.LogUpdateProcessorFactory [deleteReplicaOnIndexing_shard1_replica_n1]  webapp=/solr path=/update params={update.distrib=FROMLEADER&distrib.from=https://127.0.0.1:34193/solr/deleteReplicaOnIndexing_shard1_replica_n2/&wt=javabin&version=2}{add=[350000 (1611028971996053504)]} 0 0
   [junit4]   2> 1253395 INFO  (qtp934869582-14125) [n:127.0.0.1:34193_solr c:deleteReplicaOnIndexing s:shard1 r:core_node4 x:deleteReplicaOnIndexing_shard1_replica_n2] o.a.s.u.p.LogUpdateProcessorFactory [deleteReplicaOnIndexing_shard1_replica_n2]  webapp=/solr path=/update params={wt=javabin&version=2}{add=[310000 (1611028971981373441)]} 0 21
   [junit4]   2> 1253396 INFO  (qtp934869582-14143) [n:127.0.0.1:34193_solr c:deleteReplicaOnIndexing s:shard1 r:core_node4 x:deleteReplicaOnIndexing_shard1_replica_n2] o.a.s.u.p.LogUpdateProcessorFactory [deleteReplicaOnIndexing_shard1_replica_n2]  webapp=/solr path=/update params={wt=javabin&version=2}{add=[350000 (1611028971996053504)]} 0 8
   [junit4]   2> 1253414 INFO  (qtp1427666743-14132) [n:127.0.0.1:45959_solr c:deleteReplicaOnIndexing s:shard1 r:core_node3 x:deleteReplicaOnIndexing_shard1_replica_n1] o.a.s.u.p.LogUpdateProcessorFactory [deleteReplicaOnIndexing_shard1_replica_n1]  webapp=/solr path=/update params={update.distrib=FROMLEADER&distrib.from=https://127.0.0.1:34193/solr/deleteReplicaOnIndexing_shard1_replica_n2/&wt=javabin&version=2}{add=[300000 (1611028971987664896)]} 0 0
   [junit4]   2> 1253414 INFO  (qtp1427666743-14148) [n:127.0.0.1:45959_solr c:deleteReplicaOnIndexing s:shard1 r:core_node3 x:deleteReplicaOnIndexing_shard1_replica_n1] o.a.s.u.p.LogUpdateProcessorFactory [deleteReplicaOnIndexing_shard1_replica_n1]  webapp=/solr path=/update params={update.distrib=FROMLEADER&distrib.from=https://127.0.0.1:34193/solr/deleteReplicaOnIndexing_shard1_replica_n2/&wt=javabin&version=2}{add=[850000 (1611028972005490689)]} 0 0
   [junit4]   2> 1253414 INFO  (qtp1427666743-14132) [n:127.0.0.1:45959_solr c:deleteReplicaOnIndexing s:shard1 r:core_node3 x:deleteReplicaOnIndexing_shard1_replica_n1] o.a.s.u.p.LogUpdateProcessorFactory [deleteReplicaOnIndexing_shard1_replica_n1]  webapp=/solr path=/update params={update.distrib=FROMLEADER&distrib.from=https://127.0.0.1:34193/solr/deleteReplicaOnIndexing_shard1_replica_n2/&wt=javabin&version=2}{add=[80000 (1611028971984519169)]} 0 0
   [junit4]   2> 1253414 INFO  (qtp934869582-14348) [n:127.0.0.1:34193_solr c:deleteReplicaOnIndexing s:shard1 r:core_node4 x:deleteReplicaOnIndexing_shard1_replica_n2] o.a.s.u.p.LogUpdateProcessorFactory [deleteReplicaOnIndexing_shard1_replica_n2]  webapp=/solr path=/update params={wt=javabin&version=2}{add=[80000 (1611028971984519169)]} 0 37
   [junit4]   2> 1253415 INFO  (qtp934869582-14126) [n:127.0.0.1:34193_solr c:deleteReplicaOnIndexing s:shard1 r:core_node4 x:deleteReplicaOnIndexing_shard1_replica_n2] o.a.s.u.p.LogUpdateProcessorFactory [deleteReplicaOnIndexing_shard1_replica_n2]  webapp=/solr path=/update params={wt=javabin&version=2}{add=[20002 (1611028971981373440)]} 0 41
   [junit4]   2> 1253416 INFO  (qtp934869582-14133) [n:127.0.0.1:34193_solr c:deleteReplicaOnIndexing s:shard1 r:core_node4 x:deleteReplicaOnIndexing_shard1_replica_n2] o.a.s.u.p.LogUpdateProcessorFactory [deleteReplicaOnIndexing_shard1_replica_n2]  webapp=/solr path=/update params={wt=javabin&version=2}{add=[850000 (1611028972005490689)]} 0 18
   [junit4]   2> 1253416 INFO  (qtp934869582-14129) [n:127.0.0.1:34193_solr c:deleteReplicaOnIndexing s:shard1 r:core_node4 x:deleteReplicaOnIndexing_shard1_replica_n2] o.a.s.u.p.LogUpdateProcessorFactory [deleteReplicaOnIndexing_shard1_replica_n2]  webapp=/solr path=/update params={wt=javabin&version=2}{add=[300000 (1611028971987664896)]} 0 35
   [junit4]   2> 1253416 INFO  (qtp1427666743-14148) [n:127.0.0.1:45959_solr c:deleteReplicaOnIndexing s:shard1 r:core_node3 x:deleteReplicaOnIndexing_shard1_replica_n1] o.a.s.u.p.LogUpdateProcessorFactory [deleteReplicaOnIndexing_shard1_replica_n1]  webapp=/solr path=/update params={update.distrib=FROMLEADER&distrib.from=https://127.0.0.1:34193/solr/deleteReplicaOnIndexing_shard1_replica_n2/&wt=javabin&version=2}{add=[310001 (1611028972024365057)]} 0 0
   [junit4]   2> 1253416 INFO  (qtp1427666743-14148) [n:127.0.0.1:45959_solr c:deleteReplicaOnIndexing s:shard1 r:core_node3 x:deleteReplicaOnIndexing_shard1_replica_n1] o.a.s.u.p.LogUpdateProcessorFactory [deleteReplicaOnIndexing_shard1_replica_n1]  webapp=/solr path=/update params={update.distrib=FROMLEADER&distrib.from=https://127.0.0.1:34193/solr/deleteReplicaOnIndexing_shard1_replica_n2/&wt=javabin&version=2}{add=[860000 (1611028972005490688)]} 0 0
   [junit4]   2> 1253417 INFO  (qtp934869582-14331) [n:127.0.0.1:34193_solr c:deleteReplicaOnIndexing s:shard1 r:core_node4 x:deleteReplicaOnIndexing_shard1_replica_n2] o.a.s.u.p.LogUpdateProcessorFactory [deleteReplicaOnIndexing_shard1_replica_n2]  webapp=/solr path=/update params={wt=javabin&version=2}{add=[860000 (1611028972005490688)]} 0 20
   [junit4]   2> 1253417 INFO  (qtp934869582-14126) [n:127.0.0.1:34193_solr c:deleteReplicaOnIndexing s:shard1 r:core_node4 x:deleteReplicaOnIndexing_shard1_replica_n2] o.a.s.u.p.LogUpdateProcessorFactory [deleteReplicaOnIndexing_shard1_replica_n2]  webapp=/solr path=/update params={wt=javabin&version=2}{add=[310001 (1611028972024365057)]} 0 1
   [junit4]   2> 1253418 INFO  (qtp1427666743-14148) [n:127.0.0.1:45959_solr c:deleteReplicaOnIndexing s:shard1 r:core_node3 x:deleteReplicaOnIndexing_shard1_replica_n1] o.a.s.u.p.LogUpdateProcessorFactory [deleteReplicaOnIndexing_shard1_replica_n1]  webapp=/solr path=/update params={update.distrib=FROMLEADER&distrib.from=https://127.0.0.1:34193/solr/deleteReplicaOnIndexing_shard1_replica_n2/&wt=javabin&version=2}{add=[210002 (1611028971998150656)]} 0 0
   [junit4]   2> 1253419 INFO  (qtp1427666743-14148) [n:127.0.0.1:45959_solr c:deleteReplicaOnIndexing s:shard1 r:core_node3 x:deleteReplicaOnIndexing_shard1_replica_n1] o.a.s.u.p.LogUpdateProcessorFactory [deleteReplicaOnIndexing_shard1_replica_n1]  webapp=/solr path=/update params={update.distrib=FROMLEADER&distrib.from=https://127.0.0.1:34193/solr/deleteReplicaOnIndexing_shard1_replica_n2/&wt=javabin&version=2}{add=[280001 (1611028971998150657)]} 0 0
   [junit4]   2> 1253419 INFO  (qtp934869582-14334) [n:127.0.0.1:34193_solr c:deleteReplicaOnIndexing s:shard1 r:core_node4 x:deleteReplicaOnIndexing_shard1_replica_n2] o.a.s.u.p.LogUpdateProcessorFactory [deleteReplicaOnIndexing_shard1_replica_n2]  webapp=/solr path=/update params={wt=javabin&version=2}{add=[280001 (1611028971998150657)]} 0 29
   [junit4]   2> 1253419 INFO  (qtp934869582-14311) [n:127.0.0.1:34193_solr c:deleteReplicaOnIndexing s:shard1 r:core_node4 x:deleteReplicaOnIndexing_shard1_replica_n2] o.a.s.u.p.LogUpdateProcessorFactory [deleteReplicaOnIndexing_shard1_replica_n2]  webapp=/solr path=/update params={wt=javabin&version=2}{add=[210002 (1611028971998150656)]} 0 29
   [junit4]   2> 1253420 INFO  (qtp1427666743-14148) [n:127.0.0.1:45959_solr c:deleteReplicaOnIndexing s:shard1 r:core_node3 x:deleteReplicaOnIndexing_shard1_replica_n1] o.a.s.u.p.LogUpdateProcessorFactory [deleteReplicaOnIndexing_shard1_replica_n1]  webapp=/solr path=/update params={update.distrib=FROMLEADER&distrib.from=https://127.0.0.1:34193/solr/deleteReplicaOnIndexing_shard1_replica_n2/&wt=javabin&version=2}{add=[1 (1611028972025413632)]} 0 0
   [junit4]   2> 1253421 INFO  (qtp1427666743-14132) [n:127.0.0.1:45959_solr c:deleteReplicaOnIndexing s:shard1 r:core_node3 x:deleteReplicaOnIndexing_shard1_replica_n1] o.a.s.u.p.LogUpdateProcessorFactory [deleteReplicaOnIndexing_shard1_replica_n1]  webapp=/solr path=/update params={update.distrib=FROMLEADER&distrib.from=https://127.0.0.1:34193/solr/deleteReplicaOnIndexing_shard1_replica_n2/&wt=javabin&version=2}{add=[730000 (1611028972026462208)]} 0 0
   [junit4]   2> 1253421 INFO  (qtp1427666743-14148) [n:127.0.0.1:45959_solr c:deleteReplicaOnIndexing s:shard1 r:core_node3 x:deleteReplicaOnIndexing_shard1_replica_n1] o.a.s.u.p.LogUpdateProcessorFactory [deleteReplicaOnIndexing_shard1_replica_n1]  webapp=/solr path=/update params={update.distrib=FROMLEADER&distrib.from=https://127.0.0.1:34193/solr/deleteReplicaOnIndexing_shard1_replica_n2/&wt=javabin&version=2}{add=[310002 (1611028972026462209)]} 0 0
   [junit4]   2> 1253421 INFO  (qtp934869582-14331) [n:127.0.0.1:34193_solr c:deleteReplicaOnIndexing s:shard1 r:core_node4 x:deleteReplicaOnIndexing_shard1_replica_n2] o.a.s.u.p.LogUpdateProcessorFactory [deleteReplicaOnIndexing_shard1_replica_n2]  webapp=/solr path=/update params={wt=javabin&version=2}{add=[730000 (1611028972026462208)]} 0 3
   [junit4]   2> 1253421 INFO  (qtp934869582-14426) [n:127.0.0.1:34193_solr c:deleteReplicaOnIndexing s:shard1 r:core_node4 x:deleteReplicaOnIndexing_shard1_replica_n2] o.a.s.u.p.LogUpdateProcessorFactory [deleteReplicaOnIndexing_shard1_replica_n2]  webapp=/solr path=/update params={wt=javabin&version=2}{add=[1 (1611028972025413632)]} 0 4
   [junit4]   2> 1253421 INFO  (qtp934869582-14129) [n:127.0.0.1:34193_solr c:deleteReplicaOnIndexing s:shard1 r:core_node4 x:deleteReplicaOnIndexing_shard1_replica_n2] o.a.s.u.p.LogUpdateProcessorFactory [deleteReplicaOnIndexing_shard1_replica_n2]  webapp=/solr path=/update params={wt=javabin&version=2}{add=[310002 (1611028972026462209)]} 0 4
   [junit4]   2> 1253422 INFO  (qtp1427666743-14148) [n:127.0.0.1:45959_solr c:deleteReplicaOnIndexing s:shard1 r:core_node3 x:deleteReplicaOnIndexing_shard1_replica_n1] o.a.s.u.p.LogUpdateProcessorFactory [deleteReplicaOnIndexing_shard1_replica_n1]  webapp=/solr path=/update params={update.distrib=FROMLEADER&distrib.from=https://127.0.0.1:34193/solr/deleteReplicaOnIndexing_shard1_replica_n2/&wt=javabin&version=2}{add=[80001 (1611028972024365056)]} 0 0
   [junit4]   2> 1253423 INFO  (qtp1427666743-14148) [n:127.0.0.1:45959_solr c:deleteReplicaOnIndexing s:shard1 r:core_node3 x:deleteReplicaOnIndexing_shard1_replica_n1] o.a.s.u.p.LogUpdateProcessorFactory [deleteReplicaOnIndexing_shard1_replica_n1]  webapp=/solr path=/update params={update.distrib=FROMLEADER&distrib.from=https://127.0.0.1:34193/solr/deleteReplicaOnIndexing_shard1_replica_n2/&wt=javabin&version=2}{add=[300001 (1611028972025413633)]} 0 0
   [junit4]   2> 1253423 INFO  (qtp934869582-14348) [n:127.0.0.1:34193_solr c:deleteReplicaOnIndexing s:shard1 r:core_node4 x:deleteReplicaOnIndexing_shard1_replica_n2] o.a.s.u.p.LogUpdateProcessorFactory [deleteReplicaOnIndexing_shard1_replica_n2]  webapp=/solr path=/update params={wt=javabin&version=2}{add=[300001 (1611028972025413633)]} 0 6
   [junit4]   2> 1253423 INFO  (qtp1427666743-14132) [n:127.0.0.1:45959_solr c:deleteReplicaOnIndexing s:shard1 r:core_node3 x:deleteReplicaOnIndexing_shard1_replica_n1] o.a.s.u.p.LogUpdateProcessorFactory [deleteReplicaOnIndexing_shard1_replica_n1]  webapp=/solr path=/update params={update.distrib=FROMLEADER&distrib.from=https://127.0.0.1:34193/solr/deleteReplicaOnIndexing_shard1_replica_n2/&wt=javabin&version=2}{add=[130000 (1611028971984519168)]} 0 0
   [junit4]   2> 1253423 INFO  (qtp934869582-14138) [n:127.0.0.1:34193_solr c:deleteReplicaOnIndexing s:shard1 r:core_node4 x:deleteReplicaOnIndexing_shard1_replica_n2] o.a.s.u.p.LogUpdateProcessorFactory [deleteReplicaOnIndexing_shard1_replica_n2]  webapp=/solr path=/update params={wt=javabin&version=2}{add=[130000 (1611028971984519168)]} 0 46
   [junit4]   2> 1253423 INFO  (qtp934869582-14125) [n:127.0.0.1:34193_solr c:deleteReplicaOnIndexing s:shard1 r:core_node4 x:deleteReplicaOnIndexing_shard1_replica_n2] o.a.s.u.p.LogUpdateProcessorFactory [deleteReplicaOnIndexing_shard1_replica_n2]  webapp=/solr path=/update params={wt=javabin&version=2}{add=[80001 (1611028972024365056)]} 0 8
   [junit4]   2> 1253424 INFO  (qtp1427666743-14145) [n:127.0.0.1:45959_solr c:deleteReplicaOnIndexing s:shard1 r:core_node3 x:deleteReplicaOnIndexing_shard1_replica_n1] o.a.s.u.p.LogUpdateProcessorFactory [deleteReplicaOnIndexing_shard1_replica_n1]  webapp=/solr path=/update params={update.distrib=FROMLEADER&distrib.from=https://127.0.0.1:34193/solr/deleteReplicaOnIndexing_shard1_replica_n2/&wt=javabin&version=2}{add=[100000 (1611028972030656513)]} 0 0
   [junit4]   2> 1253424 INFO  (qtp934869582-14334) [n:127.0.0.1:34193_solr c:deleteReplicaOnIndexing s:shard1 r:core_node4 x:deleteReplicaOnIndexing_shard1_replica_n2] o.a.s.u.p.LogUpdateProcessorFactory [deleteReplicaOnIndexing_shard1_replica_n2]  webapp=/solr path=/update params={wt=javabin&version=2}{add=[100000 (1611028972030656513)]} 0 3
   [junit4]   2> 1253425 INFO  (qtp1427666743-14132) [n:127.0.0.1:45959_solr c:deleteReplicaOnIndexing s:shard1 r:core_node3 x:deleteReplicaOnIndexing_shard1_replica_n1] o.a.s.u.p.LogUpdateProcessorFactory [deleteReplicaOnIndexing_shard1_replica_n1]  webapp=/solr path=/update params={update.distrib=FROMLEADER&distrib.from=https://127.0.0.1:34193/solr/deleteReplicaOnIndexing_shard1_replica_n2/&wt=javabin&version=2}{add=[340000 (1611028972033802240)]} 0 0
   [junit4]   2> 1253425 INFO  (qtp934869582-14502) [n:127.0.0.1:34193_solr c:deleteReplicaOnIndexing s:shard1 r:core_node4 x:deleteReplicaOnIndexing_shard1_replica_n2] o.a.s.u.p.LogUpdateProcessorFactory [deleteReplicaOnIndexing_shard1_replica_n2]  webapp=/solr path=/update params={wt=javabin&version=2}{add=[340000 (1611028972033802240)]} 0 0
   [junit4]   2> 1253425 INFO  (qtp1427666743-14145) [n:127.0.0.1:45959_solr c:deleteReplicaOnIndexing s:shard1 r:core_node3 x:deleteReplicaOnIndexing_shard1_replica_n1] o.a.s.u.p.LogUpdateProcessorFactory [deleteReplicaOnIndexing_shard1_replica_n1]  webapp=/solr path=/update params={update.distrib=FROMLEADER&distrib.from=https://127.0.0.1:34193/solr/deleteReplicaOnIndexing_shard1_replica_n2/&wt=javabin&version=2}{add=[80002 (1611028972033802241)]} 0 0
   [junit4]   2> 1253425 INFO  (qtp1427666743-14145) [n:127.0.0.1:45959_solr c:deleteReplicaOnIndexing s:shard1 r:core_node3 x:deleteReplicaOnIndexing_shard1_replica_n1] o.a.s.u.p.LogUpdateProcessorFactory [deleteReplicaOnIndexing_shard1_replica_n1]  webapp=/solr path=/update params={update.distrib=FROMLEADER&distrib.from=https://127.0.0.1:34193/solr/deleteReplicaOnIndexing_shard1_replica_n2/&wt=javabin&version=2}{add=[100001 (1611028972034850816)]} 0 0
   [junit4]   2> 1253426 INFO  (qtp934869582-14331) [n:127.0.0.1:34193_solr c:deleteReplicaOnIndexing s:shard1 r:core_node4 x:deleteReplicaOnIndexing_shard1_replica_n2] o.a.s.u.p.LogUpdateProcessorFactory [deleteReplicaOnIndexing_shard1_replica_n2]  webapp=/solr path=/update params={wt=javabin&version=2}{add=[100001 (1611028972034850816)]} 0 0
   [junit4]   2> 1253426 INFO  (qtp934869582-14126) [n:127.0.0.1:34193_solr c:deleteReplicaOnIndexing s:shard1 r:core_node4 x:deleteReplicaOnIndexing_shard1_replica_n2] o.a.s.u.p.LogUpdateProcessorFactory [deleteReplicaOnIndexing_shard1_replica_n2]  webapp=/solr path=/update params={wt=javabin&version=2}{add=[80002 (1611028972033802241)]} 0 1
   [junit4]   2> 1253426 INFO  (qtp1427666743-14145) [n:127.0.0.1:45959_solr c:deleteReplicaOnIndexing s:shard1 r:core_node3 x:deleteReplicaOnIndexing_shard1_replica_n1] o.a.s.u.p.LogUpdateProcessorFactory [deleteReplicaOnIndexing_shard1_replica_n1]  webapp=/solr path=/update params={update.distrib=FROMLEADER&distrib.from=https://127.0.0.1:34193/solr/deleteReplicaOnIndexing_shard1_replica_n2/&wt=javabin&version=2}{add=[170001 (1611028972000247808)]} 0 0
   [junit4]   2> 1253427 INFO  (qtp1427666743-14145) [n:127.0.0.1:45959_solr c:deleteReplicaOnIndexing s:shard1 r:core_node3 x:deleteReplicaOnIndexing_shard1_replica_n1] o.a.s.u.p.LogUpdateProcessorFactory [deleteReplicaOnIndexing_shard1_replica_n1]  webapp=/solr path=/update params={update.distrib=FROMLEADER&distrib.from=https://127.0.0.1:34193/solr/deleteReplicaOnIndexing_shard1_replica_n2/&wt=javabin&version=2}{add=[280002 (1611028972028559360)]} 0 0
   [junit4]   2> 1253427 INFO  (qtp1427666743-14132) [n:127.0.0.1:45959_solr c:deleteReplicaOnIndexing s:shard1 r:core_node3 x:deleteReplicaOnIndexing_shard1_replica_n1] o.a.s.u.p.LogUpdateProcessorFactory [deleteReplicaOnIndexing_shard1_replica_n1]  webapp=/solr path=/update params={update.distrib=FROMLEADER&distrib.from=https://127.0.0.1:34193/solr/deleteReplicaOnIndexing_shard1_replica_n2/&wt=javabin&version=2}{add=[130001 (1611028972034850818)]} 0 0
   [junit4]   2> 1253427 INFO  (qtp934869582-14143) [n:127.0.0.1:34193_solr c:deleteReplicaOnIndexing s:shard1 r:core_node4 x:deleteReplicaOnIndexing_shard1_replica_n2] o.a.s.u.p.LogUpdateProcessorFactory [deleteReplicaOnIndexing_shard1_replica_n2]  webapp=/solr path=/update params={wt=javabin&version=2}{add=[280002 (1611028972028559360)]} 0 7
   [junit4]   2> 1253427 INFO  (qtp1427666743-14132) [n:127.0.0.1:45959_solr c:deleteReplicaOnIndexing s:shard1 r:core_node3 x:deleteReplicaOnIndexing_shard1_replica_n1] o.a.s.u.p.LogUpdateProcessorFactory [deleteReplicaOnIndexing_shard1_replica_n1]  webapp=/solr path=/update params={update.distrib=FROMLEADER&distrib.from=https://127.0.0.1:34193/solr/deleteReplicaOnIndexing_shard1_replica_n2/&wt=javabin&version=2}{add=[210003 (1611028972029607936)]} 0 0
   [junit4]   2> 1253427 INFO  (qtp934869582-14360) [n:127.0.0.1:34193_solr c:deleteReplicaOnIndexing s:shard1 r:core_node4 x:deleteReplicaOnIndexing_shard1_replica_n2] o.a.s.u.p.LogUpdateProcessorFactory [deleteReplicaOnIndexing_shard1_replica_n2]  webapp=/solr path=/update params={wt=javabin&version=2}{add=[170001 (1611028972000247808)]} 0 34
   [junit4]   2> 1253429 INFO  (qtp934869582-14311) [n:127.0.0.1:34193_solr c:deleteReplicaOnIndexing s:shard1 r:core_node4 x:deleteReplicaOnIndexing_shard1_replica_n2] o.a.s.u.p.LogUpdateProcessorFactory [deleteReplicaOnIndexing_shard1_replica_n2]  webapp=/solr path=/update params={wt=javabin&version=2}{add=[210003 (1611028972029607936)]} 0 9
   [junit4]   2> 1253429 INFO  (qtp934869582-14138) [n:127.0.0.1:34193_solr c:deleteReplicaOnIndexing s:shard1 r:core_node4 x:deleteReplicaOnIndexing_shard1_replica_n2] o.a.s.u.p.LogUpdateProcessorFactory [deleteReplicaOnIndexing_shard1_replica_n2]  webapp=/solr path=/update params={wt=javabin&version=2}{add=[130001 (1611028972034850818)]} 0 4
   [junit4]   2> 1253431 INFO  (qtp1427666743-14132) [n:127.0.0.1:45959_solr c:deleteReplicaOnIndexing s:shard1 r:core_node3 x:deleteReplicaOnIndexing_shard1_replica_n1] o.a.s.u.p.LogUpdateProcessorFactory [deleteReplicaOnIndexing_shard1_replica_n1]  webapp=/solr path=/update params={update.distrib=FROMLEADER&distrib.from=https://127.0.0.1:34193/solr/deleteReplicaOnIndexing_shard1_replica_n2/&wt=javabin&version=2}{add=[320000 (1611028971998150658)]} 0 0
   [junit4]   2> 1253431 INFO  (qtp934869582-14144) [n:127.0.0.1:34193_solr c:deleteReplicaOnIndexing s:shard1 r:core_node4 x:deleteReplicaOnIndexing_shard1_replica_n2] o.a.s.u.p.LogUpdateProcessorFactory [deleteReplicaOnIndexing_shard1_replica_n2]  webapp=/solr path=/update params={wt=javabin&version=2}{add=[320000 (1611028971998150658)]} 0 40
   [junit4]   2> 1253431 INFO  (qtp1427666743-14148) [n:127.0.0.1:45959_solr c:deleteReplicaOnIndexing s:shard1 r:core_node3 x:deleteReplicaOnIndexing_shard1_replica_n1] o.a.s.u.p.LogUpdateProcessorFactory [deleteReplicaOnIndexing_shard1_replica_n1]  webapp=/solr path=/update params={update.distrib=FROMLEADER&distrib.from=https://127.0.0.1:34193/solr/deleteReplicaOnIndexing_shard1_replica_n2/&wt=javabin&version=2}{add=[90000 (1611028972027510784)]} 0 0
   [junit4]   2> 1253432 INFO  (qtp934869582-14133) [n:127.0.0.1:34193_solr c:deleteReplicaOnIndexing s:shard1 r:core_node4 x:deleteReplicaOnIndexing_shard1_replica_n2] o.a.s.u.p.LogUpdateProcessorFactory [deleteReplicaOnIndexing_shard1_replica_n2]  webapp=/solr path=/update params={wt=javabin&version=2}{add=[90000 (1611028972027510784)]} 0 14
   [junit4]   2> 1253432 INFO  (qtp1427666743-14132) [n:127.0.0.1:45959_solr c:deleteReplicaOnIndexing s:shard1 r:core_node3 x:deleteReplicaOnIndexing_shard1_replica_n1] o.a.s.u.p.LogUpdateProcessorFactory [deleteReplicaOnIndexing_shard1_replica_n1]  webapp=/solr path=/update params={update.distrib=FROMLEADER&distrib.from=https://127.0.0.1:34193/solr/deleteReplicaOnIndexing_shard1_replica_n2/&wt=javabin&version=2}{add=[30000 (1611028972030656512)]} 0 0
   [junit4]   2> 1253432 INFO  (qtp934869582-14494) [n:127.0.0.1:34193_solr c:deleteReplicaOnIndexing s:shard1 r:core_node4 x:deleteReplicaOnIndexing_shard1_replica_n2] o.a.s.u.p.LogUpdateProcessorFactory [deleteReplicaOnIndexing_shard1_replica_n2]  webapp=/solr path=/update params={wt=javabin&version=2}{add=[30000 (1611028972030656512)]} 0 11
   [junit4]   2> 1253433 INFO  (qtp1427666743-14148) [n:127.0.0.1:45959_solr c:deleteReplicaOnIndexing s:shard1 r:core_node3 x:deleteReplicaOnIndexing_shard1_replica_n1] o.a.s.u.p.LogUpdateProcessorFactory [deleteReplicaOnIndexing_shard1_replica_n1]  webapp=/solr path=/update params={update.distrib=FROMLEADER&distrib.from=https://127.0.0.1:34193/solr/deleteReplicaOnIndexing_shard1_replica_n2/&wt=javabin&version=2}{add=[40000 (1611028972035899392)]} 0 0
   [junit4]   2> 1253433 INFO  (qtp934869582-14503) [n:127.0.0.1:34193_solr c:deleteReplicaOnIndexing s:shard1 r:core_node4 x:deleteReplicaOnIndexing_shard1_replica_n2] o.a.s.u.p.LogUpdateProcessorFactory [deleteReplicaOnIndexing_shard1_replica_n2]  webapp=/solr path=/update params={wt=javabin&version=2}{add=[40000 (1611028972035899392)]} 0 7
   [junit4]   2> 1253434 INFO  (qtp1427666743-14145) [n:127.0.0.1:45959_solr c:deleteReplicaOnIndexing s:shard1 r:core_node3 x:deleteReplicaOnIndexing_shard1_replica_n1] o.a.s.u.p.LogUpdateProcessorFactory [deleteReplicaOnIndexing_shard1_replica_n1]  webapp=/solr path=/update params={update.distrib=FROMLEADER&distrib.from=https://127.0.0.1:34193/solr/deleteReplicaOnIndexing_shard1_replica_n2/&wt=javabin&version=2}{add=[100002 (1611028972035899395)]} 0 0
   [junit4]   2> 1253434 INFO  (qtp1427666743-14145) [n:127.0.0.1:45959_solr c:deleteReplicaOnIndexing s:shard1 r:core_node3 x:deleteReplicaOnIndexing_shard1_replica_n1] o.a.s.u.p.LogUpdateProcessorFactory [deleteReplicaOnIndexing_shard1_replica_n1]  webapp=/solr path=/update params={update.distrib=FROMLEADER&distrib.from=https://127.0.0.1:34193/solr/deleteReplicaOnIndexing_shard1_replica_n2/&wt=javabin&version=2}{add=[210004 (1611028972040093696)]} 0 0
   [junit4]   2> 1253434 INFO  (qtp934869582-14334) [n:127.0.0.1:34193_solr c:deleteReplicaOnIndexing s:shard1 r:core_node4 x:deleteReplicaOnIndexing_shard1_replica_n2] o.a.s.u.p.LogUpdateProcessorFactory [deleteReplicaOnIndexing_shard1_replica_n2]  webapp=/solr path=/update params={wt=javabin&version=2}{add=[100002 (1611028972035899395)]} 0 8
   [junit4]   2> 1253434 INFO  (qtp934869582-14143) [n:127.0.0.1:34193_solr c:deleteReplicaOnIndexing s:shard1 r:core_node4 x:deleteReplicaOnIndexing_shard1_replica_n2] o.a.s.u.p.LogUpdateProcessorFactory [deleteReplicaOnIndexing_shard1_replica_n2]  webapp=/solr path=/update params={wt=javabin&version=2}{add=[210004 (1611028972040093696)]} 0 4
   [junit4]   2> 1253436 INFO  (qtp1427666743-14132) [n:127.0.0.1:45959_solr c:deleteReplicaOnIndexing s:shard1 r:core_node3 x:deleteReplicaOnIndexing_shard1_replica_n1] o.a.s.u.p.LogUpdateProcessorFactory [deleteReplicaOnIndexing_shard1_replica_n1]  webapp=/solr path=/update params={update.distrib=FROMLEADER&distrib.from=https://127.0.0.1:34193/solr/deleteReplicaOnIndexing_shard1_replica_n2/&wt=javabin&version=2}{add=[230000 (1611028972035899394)]} 0 0
   [junit4]   2> 1253436 INFO  (qtp1427666743-14132) [n:127.0.0.1:45959_solr c:deleteReplicaOnIndexing s:shard1 r:core_node3 x:deleteReplicaOnIndexing_shard1_replica_n1] o.a.s.u.p.LogUpdateProcessorFactory [deleteReplicaOnIndexing_shard1_replica_n1]  webapp=/solr path=/update params={update.distrib=FROMLEADER&distrib.from=https://127.0.0.1:34193/solr/deleteReplicaOnIndexing_shard1_replica_n2/&wt=javabin&version=2}{add=[850001 (1611028972034850817)]} 0 0
   [junit4]   2> 1253436 INFO  (qtp1427666743-14132) [n:127.0.0.1:45959_solr c:deleteReplicaOnIndexing s:shard1 r:core_node3 x:deleteReplicaOnIndexing_shard1_replica_n1] o.a.s.u.p.LogUpdateProcessorFactory [deleteReplicaOnIndexing_shard1_replica_n1]  webapp=/solr path=/update params={update.distrib=FROMLEADER&distrib.from=https://127.0.0.1:34193/solr/deleteReplicaOnIndexing_shard1_replica_n2/&wt=javabin&version=2}{add=[160000 (1611028972043239424)]} 0 0
   [junit4]   2> 1253437 INFO  (qtp934869582-14504) [n:127.0.0.1:34193_solr c:deleteReplicaOnIndexing s:shard1 r:core_node4 x:deleteReplicaOnIndexing_shard1_replica_n2] o.a.s.u.p.LogUpdateProcessorFactory [deleteReplicaOnIndexing_shard1_replica_n2]  webapp=/solr path=/update params={wt=javabin&version=2}{add=[230000 (1611028972035899394)]} 0 10
   [junit4]   2> 1253438 INFO  (qtp1427666743-14132) [n:127.0.0.1:45959_solr c:deleteReplicaOnIndexing s:shard1 r:core_node3 x:deleteReplicaOnIndexing_shard1_replica_n1] o.a.s.u.p.LogUpdateProcessorFactory [deleteReplicaOnIndexing_shard1_replica_n1]  webapp=/solr path=/update params={update.distrib=FROMLEADER&distrib.from=https://127.0.0.1:34193/solr/deleteReplicaOnIndexing_shard1_replica_n2/&wt=javabin&version=2}{add=[230001 (1611028972047433728)]} 0 0
   [junit4]   2> 1253438 INFO  (qtp934869582-14143) [n:127.0.0.1:34193_solr c:deleteReplicaOnIndexing s:shard1 r:core_node4 x:deleteReplicaOnIndexing_shard1_replica_n2] o.a.s.u.p.LogUpdateProcessorFactory [deleteReplicaOnIndexing_shard1_replica_n2]  webapp=/solr path=/update params={wt=javabin&version=2}{add=[230001 (1611028972047433728)]} 0 0
   [junit4]   2> 1253439 INFO  (qtp1427666743-14132) [n:127.0.0.1:45959_solr c:deleteReplicaOnIndexing s:shard1 r:core_node3 x:deleteReplicaOnIndexing_shard1_replica_n1] o.a.s.u.p.LogUpdateProcessorFactory [deleteReplicaOnIndexing_shard1_replica_n1]  webapp=/solr path=/update params={update.distrib=FROMLEADER&distrib.from=https://127.0.0.1:34193/solr/deleteReplicaOnIndexing_shard1_replica_n2/&wt=javabin&version=2}{add=[360000 (1611028972037996545)]} 0 0
   [junit4]   2> 1253439 INFO  (qtp934869582-14498) [n:127.0.0.1:34193_solr c:deleteReplicaOnIndexing s:shard1 r:core_node4 x:deleteReplicaOnIndexing_shard1_replica_n2] o.a.s.u.p.LogUpdateProcessorFactory [deleteReplicaOnIndexing_shard1_replica_n2]  webapp=/solr path=/update params={wt=javabin&version=2}{add=[360000 (1611028972037996545)]} 0 11
   [junit4]   2> 1253439 INFO  (qtp934869582-14125) [n:127.0.0.1:34193_solr c:deleteReplicaOnIndexing s:shard1 r:core_node4 x:deleteReplicaOnIndexing_shard1_replica_n2] o.a.s.u.p.LogUpdateProcessorFactory [deleteReplicaOnIndexing_shard1_replica_n2]  webapp=/solr path=/update params={wt=javabin&version=2}{add=[850001 (1611028972034850817)]} 0 14
   [junit4]   2> 1253440 INFO  (qtp1427666743-14132) [n:127.0.0.1:45959_solr c:deleteReplicaOnIndexing s:shard1 r:core_node3 x:deleteReplicaOnIndexing_shard1_replica_n1] o.a.s.u.p.LogUpdateProcessorFactory [deleteReplicaOnIndexing_shard1_replica_n1]  webapp=/solr path=/update params={update.distrib=FROMLEADER&distrib.from=https://127.0.0.1:34193/solr/deleteReplicaOnIndexing_shard1_replica_n2/&wt=javabin&version=2}{add=[940000 (1611028972050579456)]} 0 0
   [junit4]   2> 1253440 INFO  (qtp934869582-14503) [n:127.0.0.1:34193_solr c:deleteReplicaOnIndexing s:shard1 r:core_node4 x:deleteReplicaOnIndexing_shard1_replica_n2] o.a.s.u.p.LogUpdateProcessorFactory [deleteReplicaOnIndexing_shard1_replica_n2]  webapp=/solr path=/update params={wt=javabin&version=2}{add=[160000 (1611028972043239424)]} 0 7
   [junit4]   2> 1253440 INFO  (qtp934869582-14311) [n:127.0.0.1:34193_solr    ] o.a.s.h.a.CollectionsHandler Invoked Collection Action :deletereplica with params replica=core_node3&action=DELETEREPLICA&collection=deleteReplicaOnIndexing&shard=shard1&wt=javabin&version=2 and sendToOCPQueue=true
   [junit4]   2> 1253442 INFO  (qtp1427666743-14147) [n:127.0.0.1:45959_solr c:deleteReplicaOnIndexing s:shard1 r:core_node3 x:deleteReplicaOnIndexing_shard1_replica_n1] o.a.s.u.p.LogUpdateProcessorFactory [deleteReplicaOnIndexing_shard1_replica_n1]  webapp=/solr path=/update params={update.distrib=FROMLEADER&distrib.from=https://127.0.0.1:34193/solr/deleteReplicaOnIndexing_shard1_replica_n2/&wt=javabin&version=2}{add=[850002 (1611028972051628034)]} 0 0
   [junit4]   2> 1253442 INFO  (qtp1427666743-14147) [n:127.0.0.1:45959_solr c:deleteReplicaOnIndexing s:shard1 r:core_node3 x:deleteReplicaOnIndexing_shard1_replica_n1] o.a.s.u.p.LogUpdateProcessorFactory [deleteReplicaOnIndexing_shard1_replica_n1]  webapp=/solr path=/update params={update.distrib=FROMLEADER&distrib.from=https://127.0.0.1:34193/solr/deleteReplicaOnIndexing_shard1_re

[...truncated too long message...]

eck:
[loadresource] Do not set property disallowed.ivy.jars.list as its length is 0.

-ivy-fail-disallowed-ivy-version:

ivy-fail:

ivy-fail:

ivy-configure:
[ivy:configure] :: loading settings :: file = /x1/jenkins/jenkins-slave/workspace/Lucene-Solr-Tests-7.x/lucene/top-level-ivy-settings.xml

resolve:

ivy-availability-check:
[loadresource] Do not set property disallowed.ivy.jars.list as its length is 0.

-ivy-fail-disallowed-ivy-version:

ivy-fail:

ivy-configure:
[ivy:configure] :: loading settings :: file = /x1/jenkins/jenkins-slave/workspace/Lucene-Solr-Tests-7.x/lucene/top-level-ivy-settings.xml

resolve:

ivy-availability-check:
[loadresource] Do not set property disallowed.ivy.jars.list as its length is 0.

-ivy-fail-disallowed-ivy-version:

ivy-fail:

ivy-fail:

ivy-configure:
[ivy:configure] :: loading settings :: file = /x1/jenkins/jenkins-slave/workspace/Lucene-Solr-Tests-7.x/lucene/top-level-ivy-settings.xml

resolve:

ivy-availability-check:
[loadresource] Do not set property disallowed.ivy.jars.list as its length is 0.

-ivy-fail-disallowed-ivy-version:

ivy-fail:

ivy-configure:
[ivy:configure] :: loading settings :: file = /x1/jenkins/jenkins-slave/workspace/Lucene-Solr-Tests-7.x/lucene/top-level-ivy-settings.xml

resolve:

ivy-availability-check:
[loadresource] Do not set property disallowed.ivy.jars.list as its length is 0.

-ivy-fail-disallowed-ivy-version:

ivy-fail:

ivy-fail:

ivy-configure:
[ivy:configure] :: loading settings :: file = /x1/jenkins/jenkins-slave/workspace/Lucene-Solr-Tests-7.x/lucene/top-level-ivy-settings.xml

resolve:

ivy-availability-check:
[loadresource] Do not set property disallowed.ivy.jars.list as its length is 0.

-ivy-fail-disallowed-ivy-version:

ivy-fail:

ivy-fail:

ivy-configure:
[ivy:configure] :: loading settings :: file = /x1/jenkins/jenkins-slave/workspace/Lucene-Solr-Tests-7.x/lucene/top-level-ivy-settings.xml

resolve:

ivy-availability-check:
[loadresource] Do not set property disallowed.ivy.jars.list as its length is 0.

-ivy-fail-disallowed-ivy-version:

ivy-fail:

ivy-fail:

ivy-configure:
[ivy:configure] :: loading settings :: file = /x1/jenkins/jenkins-slave/workspace/Lucene-Solr-Tests-7.x/lucene/top-level-ivy-settings.xml

resolve:

ivy-availability-check:
[loadresource] Do not set property disallowed.ivy.jars.list as its length is 0.

-ivy-fail-disallowed-ivy-version:

ivy-fail:

ivy-fail:

ivy-configure:
[ivy:configure] :: loading settings :: file = /x1/jenkins/jenkins-slave/workspace/Lucene-Solr-Tests-7.x/lucene/top-level-ivy-settings.xml

resolve:

ivy-availability-check:
[loadresource] Do not set property disallowed.ivy.jars.list as its length is 0.

-ivy-fail-disallowed-ivy-version:

ivy-fail:

ivy-fail:

ivy-configure:
[ivy:configure] :: loading settings :: file = /x1/jenkins/jenkins-slave/workspace/Lucene-Solr-Tests-7.x/lucene/top-level-ivy-settings.xml

resolve:

ivy-availability-check:
[loadresource] Do not set property disallowed.ivy.jars.list as its length is 0.

-ivy-fail-disallowed-ivy-version:

ivy-fail:

ivy-fail:

ivy-configure:
[ivy:configure] :: loading settings :: file = /x1/jenkins/jenkins-slave/workspace/Lucene-Solr-Tests-7.x/lucene/top-level-ivy-settings.xml

resolve:

ivy-availability-check:
[loadresource] Do not set property disallowed.ivy.jars.list as its length is 0.

-ivy-fail-disallowed-ivy-version:

ivy-fail:

ivy-fail:

ivy-configure:
[ivy:configure] :: loading settings :: file = /x1/jenkins/jenkins-slave/workspace/Lucene-Solr-Tests-7.x/lucene/top-level-ivy-settings.xml

resolve:

ivy-availability-check:
[loadresource] Do not set property disallowed.ivy.jars.list as its length is 0.

-ivy-fail-disallowed-ivy-version:

ivy-fail:

ivy-fail:

ivy-configure:
[ivy:configure] :: loading settings :: file = /x1/jenkins/jenkins-slave/workspace/Lucene-Solr-Tests-7.x/lucene/top-level-ivy-settings.xml

resolve:

ivy-availability-check:
[loadresource] Do not set property disallowed.ivy.jars.list as its length is 0.

-ivy-fail-disallowed-ivy-version:

ivy-fail:

ivy-fail:

ivy-configure:
[ivy:configure] :: loading settings :: file = /x1/jenkins/jenkins-slave/workspace/Lucene-Solr-Tests-7.x/lucene/top-level-ivy-settings.xml

resolve:

ivy-availability-check:
[loadresource] Do not set property disallowed.ivy.jars.list as its length is 0.

-ivy-fail-disallowed-ivy-version:

ivy-fail:

ivy-fail:

ivy-configure:
[ivy:configure] :: loading settings :: file = /x1/jenkins/jenkins-slave/workspace/Lucene-Solr-Tests-7.x/lucene/top-level-ivy-settings.xml

resolve:

jar-checksums:
    [mkdir] Created dir: /x1/jenkins/jenkins-slave/workspace/Lucene-Solr-Tests-7.x/solr/null1351005217
     [copy] Copying 239 files to /x1/jenkins/jenkins-slave/workspace/Lucene-Solr-Tests-7.x/solr/null1351005217
   [delete] Deleting directory /x1/jenkins/jenkins-slave/workspace/Lucene-Solr-Tests-7.x/solr/null1351005217

check-working-copy:
[ivy:cachepath] :: resolving dependencies :: org.eclipse.jgit#org.eclipse.jgit-caller;working
[ivy:cachepath] 	confs: [default]
[ivy:cachepath] 	found org.eclipse.jgit#org.eclipse.jgit;4.6.0.201612231935-r in public
[ivy:cachepath] 	found com.jcraft#jsch;0.1.53 in public
[ivy:cachepath] 	found com.googlecode.javaewah#JavaEWAH;1.1.6 in public
[ivy:cachepath] 	found org.apache.httpcomponents#httpclient;4.3.6 in public
[ivy:cachepath] 	found org.apache.httpcomponents#httpcore;4.3.3 in public
[ivy:cachepath] 	found commons-logging#commons-logging;1.1.3 in public
[ivy:cachepath] 	found commons-codec#commons-codec;1.6 in public
[ivy:cachepath] 	found org.slf4j#slf4j-api;1.7.2 in public
[ivy:cachepath] :: resolution report :: resolve 19ms :: artifacts dl 2ms
	---------------------------------------------------------------------
	|                  |            modules            ||   artifacts   |
	|       conf       | number| search|dwnlded|evicted|| number|dwnlded|
	---------------------------------------------------------------------
	|      default     |   8   |   0   |   0   |   0   ||   8   |   0   |
	---------------------------------------------------------------------
[wc-checker] Initializing working copy...
[wc-checker] SLF4J: Failed to load class "org.slf4j.impl.StaticLoggerBinder".
[wc-checker] SLF4J: Defaulting to no-operation (NOP) logger implementation
[wc-checker] SLF4J: See http://www.slf4j.org/codes.html#StaticLoggerBinder for further details.
[wc-checker] Checking working copy status...

-jenkins-base:

BUILD SUCCESSFUL
Total time: 92 minutes 59 seconds
Archiving artifacts
java.lang.InterruptedException: no matches found within 10000
	at hudson.FilePath$34.hasMatch(FilePath.java:2678)
	at hudson.FilePath$34.invoke(FilePath.java:2557)
	at hudson.FilePath$34.invoke(FilePath.java:2547)
	at hudson.FilePath$FileCallableWrapper.call(FilePath.java:2918)
Also:   hudson.remoting.Channel$CallSiteStackTrace: Remote call to lucene
		at hudson.remoting.Channel.attachCallSiteStackTrace(Channel.java:1741)
		at hudson.remoting.UserRequest$ExceptionResponse.retrieve(UserRequest.java:357)
		at hudson.remoting.Channel.call(Channel.java:955)
		at hudson.FilePath.act(FilePath.java:1036)
		at hudson.FilePath.act(FilePath.java:1025)
		at hudson.FilePath.validateAntFileMask(FilePath.java:2547)
		at hudson.tasks.ArtifactArchiver.perform(ArtifactArchiver.java:243)
		at hudson.tasks.BuildStepCompatibilityLayer.perform(BuildStepCompatibilityLayer.java:81)
		at hudson.tasks.BuildStepMonitor$1.perform(BuildStepMonitor.java:20)
		at hudson.model.AbstractBuild$AbstractBuildExecution.perform(AbstractBuild.java:744)
		at hudson.model.AbstractBuild$AbstractBuildExecution.performAllBuildSteps(AbstractBuild.java:690)
		at hudson.model.Build$BuildExecution.post2(Build.java:186)
		at hudson.model.AbstractBuild$AbstractBuildExecution.post(AbstractBuild.java:635)
		at hudson.model.Run.execute(Run.java:1819)
		at hudson.model.FreeStyleBuild.run(FreeStyleBuild.java:43)
		at hudson.model.ResourceController.execute(ResourceController.java:97)
		at hudson.model.Executor.run(Executor.java:429)
Caused: hudson.FilePath$TunneledInterruptedException
	at hudson.FilePath$FileCallableWrapper.call(FilePath.java:2920)
	at hudson.remoting.UserRequest.perform(UserRequest.java:212)
	at hudson.remoting.UserRequest.perform(UserRequest.java:54)
	at hudson.remoting.Request$2.run(Request.java:369)
	at hudson.remoting.InterceptingExecutorService$1.call(InterceptingExecutorService.java:72)
	at java.util.concurrent.FutureTask.run(FutureTask.java:266)
	at java.util.concurrent.ThreadPoolExecutor.runWorker(ThreadPoolExecutor.java:1142)
	at java.util.concurrent.ThreadPoolExecutor$Worker.run(ThreadPoolExecutor.java:617)
	at java.lang.Thread.run(Thread.java:748)
Caused: java.lang.InterruptedException: java.lang.InterruptedException: no matches found within 10000
	at hudson.FilePath.act(FilePath.java:1038)
	at hudson.FilePath.act(FilePath.java:1025)
	at hudson.FilePath.validateAntFileMask(FilePath.java:2547)
	at hudson.tasks.ArtifactArchiver.perform(ArtifactArchiver.java:243)
	at hudson.tasks.BuildStepCompatibilityLayer.perform(BuildStepCompatibilityLayer.java:81)
	at hudson.tasks.BuildStepMonitor$1.perform(BuildStepMonitor.java:20)
	at hudson.model.AbstractBuild$AbstractBuildExecution.perform(AbstractBuild.java:744)
	at hudson.model.AbstractBuild$AbstractBuildExecution.performAllBuildSteps(AbstractBuild.java:690)
	at hudson.model.Build$BuildExecution.post2(Build.java:186)
	at hudson.model.AbstractBuild$AbstractBuildExecution.post(AbstractBuild.java:635)
	at hudson.model.Run.execute(Run.java:1819)
	at hudson.model.FreeStyleBuild.run(FreeStyleBuild.java:43)
	at hudson.model.ResourceController.execute(ResourceController.java:97)
	at hudson.model.Executor.run(Executor.java:429)
No artifacts found that match the file pattern "**/*.events,heapdumps/**,**/hs_err_pid*". Configuration error?
Recording test results
Build step 'Publish JUnit test result report' changed build result to UNSTABLE
Email was triggered for: Unstable (Test Failures)
Sending email for trigger: Unstable (Test Failures)