You are viewing a plain text version of this content. The canonical link for it is here.
Posted to dev@airavata.apache.org by Apache Jenkins Server <je...@builds.apache.org> on 2012/03/31 01:37:32 UTC

Build failed in Jenkins: Airavata #437

See <https://builds.apache.org/job/Airavata/437/changes>

Changes:

[samindaw] initial dump of xbaya-web poc

[samindaw] adding temporary scratch dir, to be removed later when the sandbox for airavata is created

[heshan] removing a redundant test case.

[heshan] Adding MPI Test case for Ranger.

------------------------------------------
[...truncated 3929 lines...]
[INFO] airavata-ws-messenger-0.3-incubating-SNAPSHOT/standalone-server/lib/messenger-client-0.3-incubating-SNAPSHOT.jar already added, skipping
[INFO] airavata-ws-messenger-0.3-incubating-SNAPSHOT/standalone-server/lib/messenger-commons-0.3-incubating-SNAPSHOT.jar already added, skipping
[INFO] Building zip: <https://builds.apache.org/job/Airavata/ws/modules/ws-messenger/distribution/target/airavata-ws-messenger-0.3-incubating-SNAPSHOT-bin.zip>
[INFO] airavata-ws-messenger-0.3-incubating-SNAPSHOT/standalone-server/lib/messenger-client-0.3-incubating-SNAPSHOT.jar already added, skipping
[INFO] airavata-ws-messenger-0.3-incubating-SNAPSHOT/standalone-server/lib/messenger-commons-0.3-incubating-SNAPSHOT.jar already added, skipping
[WARNING] Assembly file: <https://builds.apache.org/job/Airavata/ws/modules/ws-messenger/distribution/target/airavata-ws-messenger-0.3-incubating-SNAPSHOT-bin.zip> is not a regular file (it may be a directory). It cannot be attached to the project build for installation or deployment.
[INFO] 
[INFO] --- maven-install-plugin:2.3.1:install (default-install) @ ws-messenger-distribution ---[INFO] Installing <https://builds.apache.org/job/Airavata/ws/modules/ws-messenger/distribution/pom.xml> to /export/home/hudson/hudson-slave/maven-repositories/0/org/apache/airavata/ws-messenger-distribution/0.3-incubating-SNAPSHOT/ws-messenger-distribution-0.3-incubating-SNAPSHOT.pom

[JENKINS] Archiving <https://builds.apache.org/job/Airavata/ws/modules/ws-messenger/distribution/pom.xml> to /home/hudson/hudson/jobs/Airavata/modules/org.apache.airavata$ws-messenger-distribution/builds/2012-03-30_23-20-00/archive/org.apache.airavata/ws-messenger-distribution/0.3-incubating-SNAPSHOT/ws-messenger-distribution-0.3-incubating-SNAPSHOT.pom
[INFO]                                                                         
[INFO] ------------------------------------------------------------------------
[INFO] Building Registry-Migrator 0.3-incubating-SNAPSHOT
[INFO] ------------------------------------------------------------------------Downloading: http://community.ucs.indiana.edu:9090/archiva/repository/ogce.m2.all/gfac/gfac-schema-utils/0.4.4/gfac-schema-utils-0.4.4.pom

Downloading: http://people.apache.org/repo/m2-snapshot-repository/gfac/gfac-schema-utils/0.4.4/gfac-schema-utils-0.4.4.pom
Downloading: http://mirrors.ibiblio.org/pub/mirrors/maven2/gfac/gfac-schema-utils/0.4.4/gfac-schema-utils-0.4.4.pom
Downloading: http://download.java.net/maven/2/gfac/gfac-schema-utils/0.4.4/gfac-schema-utils-0.4.4.pom
Downloading: http://people.apache.org/~lahiru/maven-repo/gfac/gfac-schema-utils/0.4.4/gfac-schema-utils-0.4.4.pom
Downloading: http://maven.ow2.org/maven2/gfac/gfac-schema-utils/0.4.4/gfac-schema-utils-0.4.4.pom
Downloading: http://repo1.maven.org/maven2/gfac/gfac-schema-utils/0.4.4/gfac-schema-utils-0.4.4.pom
[WARNING] The POM for gfac:gfac-schema-utils:jar:0.4.4 is missing, no dependency information available
[INFO] 
[INFO] --- maven-clean-plugin:2.4.1:clean (default-clean) @ registry-migrator ---
[INFO] [debug] execute contextualize

[INFO] --- maven-resources-plugin:2.5:copy-resources (copy-resources) @ registry-migrator ---[INFO] Using 'UTF-8' encoding to copy filtered resources.
[INFO] skip non existing resourceDirectory <https://builds.apache.org/job/Airavata/ws/modules/registry-migrator/src/main/assembly/dist>

[INFO] 
Downloading: http://community.ucs.indiana.edu:9090/archiva/repository/ogce.m2.all/gfac/gfac-schema-utils/0.4.4/gfac-schema-utils-0.4.4.pom
[INFO] --- maven-remote-resources-plugin:1.2.1:process (default) @ registry-migrator ---Downloading: http://people.apache.org/repo/m2-snapshot-repository/gfac/gfac-schema-utils/0.4.4/gfac-schema-utils-0.4.4.pom

Downloading: http://mirrors.ibiblio.org/pub/mirrors/maven2/gfac/gfac-schema-utils/0.4.4/gfac-schema-utils-0.4.4.pom
Downloading: http://download.java.net/maven/2/gfac/gfac-schema-utils/0.4.4/gfac-schema-utils-0.4.4.pom
Downloading: http://people.apache.org/~lahiru/maven-repo/gfac/gfac-schema-utils/0.4.4/gfac-schema-utils-0.4.4.pom
Downloading: http://maven.ow2.org/maven2/gfac/gfac-schema-utils/0.4.4/gfac-schema-utils-0.4.4.pom
Downloading: http://repo1.maven.org/maven2/gfac/gfac-schema-utils/0.4.4/gfac-schema-utils-0.4.4.pom
[WARNING] Missing POM for gfac:gfac-schema-utils:jar:0.4.4
Downloading: http://community.ucs.indiana.edu:9090/archiva/repository/ogce.m2.all/gfac/gfac-schema-utils/0.4.4/gfac-schema-utils-0.4.4.pom
Downloading: http://people.apache.org/repo/m2-snapshot-repository/gfac/gfac-schema-utils/0.4.4/gfac-schema-utils-0.4.4.pom
Downloading: http://mirrors.ibiblio.org/pub/mirrors/maven2/gfac/gfac-schema-utils/0.4.4/gfac-schema-utils-0.4.4.pom
Downloading: http://download.java.net/maven/2/gfac/gfac-schema-utils/0.4.4/gfac-schema-utils-0.4.4.pom
Downloading: http://people.apache.org/~lahiru/maven-repo/gfac/gfac-schema-utils/0.4.4/gfac-schema-utils-0.4.4.pom
Downloading: http://maven.ow2.org/maven2/gfac/gfac-schema-utils/0.4.4/gfac-schema-utils-0.4.4.pom
Downloading: http://repo1.maven.org/maven2/gfac/gfac-schema-utils/0.4.4/gfac-schema-utils-0.4.4.pom
[INFO] 
[INFO] --- maven-resources-plugin:2.5:resources (default-resources) @ registry-migrator ---[debug] execute contextualize
[INFO] Using 'UTF-8' encoding to copy filtered resources.
[INFO] Copying 4 resources
[INFO] Copying 3 resources

[INFO] 
[INFO] --- maven-compiler-plugin:2.0.2:compile (default-compile) @ registry-migrator ---[INFO] Compiling 4 source files to <https://builds.apache.org/job/Airavata/ws/modules/registry-migrator/target/classes>

[INFO] 
[INFO] --- maven-resources-plugin:2.5:testResources (default-testResources) @ registry-migrator ---[debug] execute contextualize
[INFO] Using 'UTF-8' encoding to copy filtered resources.
[INFO] skip non existing resourceDirectory <https://builds.apache.org/job/Airavata/ws/modules/registry-migrator/src/test/resources>
[INFO] Copying 3 resources

[INFO] No sources to compile
[INFO] 
[INFO] --- maven-compiler-plugin:2.0.2:testCompile (default-testCompile) @ registry-migrator ---
[INFO] 
[INFO] --- maven-surefire-plugin:2.9:test (default-test) @ registry-migrator ---[INFO] Surefire report directory: <https://builds.apache.org/job/Airavata/ws/modules/registry-migrator/target/surefire-reports>

-------------------------------------------------------
 T E S T S
-------------------------------------------------------


Results :

Tests run: 0, Failures: 0, Errors: 0, Skipped: 0

[JENKINS] Recording test results
[INFO] 
[INFO] --- maven-jar-plugin:2.3.1:jar (default-jar) @ registry-migrator ---
[INFO] Building jar: <https://builds.apache.org/job/Airavata/ws/modules/registry-migrator/target/registry-migrator-0.3-incubating-SNAPSHOT.jar>
[INFO] 
[INFO] --- maven-site-plugin:3.0:attach-descriptor (attach-descriptor) @ registry-migrator ---
[INFO] 
[INFO] --- maven-install-plugin:2.3.1:install (default-install) @ registry-migrator ---[INFO] Installing <https://builds.apache.org/job/Airavata/ws/modules/registry-migrator/target/registry-migrator-0.3-incubating-SNAPSHOT.jar> to /export/home/hudson/hudson-slave/maven-repositories/0/org/apache/airavata/registry-migrator/0.3-incubating-SNAPSHOT/registry-migrator-0.3-incubating-SNAPSHOT.jar
[INFO] Installing <https://builds.apache.org/job/Airavata/ws/modules/registry-migrator/pom.xml> to /export/home/hudson/hudson-slave/maven-repositories/0/org/apache/airavata/registry-migrator/0.3-incubating-SNAPSHOT/registry-migrator-0.3-incubating-SNAPSHOT.pom

[JENKINS] Archiving <https://builds.apache.org/job/Airavata/ws/modules/registry-migrator/pom.xml> to /home/hudson/hudson/jobs/Airavata/modules/org.apache.airavata$registry-migrator/builds/2012-03-30_23-20-04/archive/org.apache.airavata/registry-migrator/0.3-incubating-SNAPSHOT/registry-migrator-0.3-incubating-SNAPSHOT.pom
[JENKINS] Archiving <https://builds.apache.org/job/Airavata/ws/modules/registry-migrator/target/registry-migrator-0.3-incubating-SNAPSHOT.jar> to /home/hudson/hudson/jobs/Airavata/modules/org.apache.airavata$registry-migrator/builds/2012-03-30_23-20-04/archive/org.apache.airavata/registry-migrator/0.3-incubating-SNAPSHOT/registry-migrator-0.3-incubating-SNAPSHOT.jar
[INFO]                                                                         
[INFO] ------------------------------------------------------------------------
[INFO] Building Airavata XBaya 0.3-incubating-SNAPSHOT
[INFO] ------------------------------------------------------------------------
[WARNING] The POM for lead-security:cryptix32:jar:versionless is invalid, transitive dependencies (if any) will not be available, enable debug logging for more details
[WARNING] The POM for lead-security:cryptix-asn1:jar:versionless is invalid, transitive dependencies (if any) will not be available, enable debug logging for more details
[WARNING] The POM for lead-security:puretls:jar:0.9b4-1 is invalid, transitive dependencies (if any) will not be available, enable debug logging for more details
[WARNING] The POM for lead-security:cog-jglobus:jar:1.4 is invalid, transitive dependencies (if any) will not be available, enable debug logging for more details
[INFO] 
[INFO] --- maven-clean-plugin:2.4.1:clean (default-clean) @ xbaya-gui ---
[INFO] 
[INFO] --- maven-resources-plugin:2.5:copy-resources (copy-resources) @ xbaya-gui ---[debug] execute contextualize
[INFO] Using 'UTF-8' encoding to copy filtered resources.
[INFO] Copying 2 resources

[INFO] 
[INFO] --- maven-remote-resources-plugin:1.2.1:process (default) @ xbaya-gui ---[WARNING] Invalid POM for lead-security:cryptix32:jar:versionless, transitive dependencies (if any) will not be available, enable debug logging for more details
[WARNING] Invalid POM for lead-security:cryptix-asn1:jar:versionless, transitive dependencies (if any) will not be available, enable debug logging for more details
[WARNING] Invalid POM for lead-security:puretls:jar:0.9b4-1, transitive dependencies (if any) will not be available, enable debug logging for more details
[WARNING] Invalid POM for lead-security:cog-jglobus:jar:1.4, transitive dependencies (if any) will not be available, enable debug logging for more details

Downloading: http://community.ucs.indiana.edu:9090/archiva/repository/ogce.m2.all/edu/berkeley/yfilter/1.0/yfilter-1.0.pom
Downloading: http://people.apache.org/repo/m2-snapshot-repository/edu/berkeley/yfilter/1.0/yfilter-1.0.pom
Downloading: http://mirrors.ibiblio.org/pub/mirrors/maven2/edu/berkeley/yfilter/1.0/yfilter-1.0.pom
Downloading: http://download.java.net/maven/2/edu/berkeley/yfilter/1.0/yfilter-1.0.pom
Downloading: http://people.apache.org/~lahiru/maven-repo/edu/berkeley/yfilter/1.0/yfilter-1.0.pom
Downloading: http://maven.ow2.org/maven2/edu/berkeley/yfilter/1.0/yfilter-1.0.pom
Downloading: http://repo1.maven.org/maven2/edu/berkeley/yfilter/1.0/yfilter-1.0.pom
[WARNING] Missing POM for edu.berkeley:yfilter:jar:1.0
Downloading: http://community.ucs.indiana.edu:9090/archiva/repository/ogce.m2.all/gfac/gfac-schema-utils/0.4.4/gfac-schema-utils-0.4.4.pom
Downloading: http://people.apache.org/repo/m2-snapshot-repository/gfac/gfac-schema-utils/0.4.4/gfac-schema-utils-0.4.4.pom
Downloading: http://mirrors.ibiblio.org/pub/mirrors/maven2/gfac/gfac-schema-utils/0.4.4/gfac-schema-utils-0.4.4.pom
Downloading: http://download.java.net/maven/2/gfac/gfac-schema-utils/0.4.4/gfac-schema-utils-0.4.4.pom
Downloading: http://people.apache.org/~lahiru/maven-repo/gfac/gfac-schema-utils/0.4.4/gfac-schema-utils-0.4.4.pom
Downloading: http://maven.ow2.org/maven2/gfac/gfac-schema-utils/0.4.4/gfac-schema-utils-0.4.4.pom
Downloading: http://repo1.maven.org/maven2/gfac/gfac-schema-utils/0.4.4/gfac-schema-utils-0.4.4.pom
[WARNING] Missing POM for gfac:gfac-schema-utils:jar:0.4.4
[WARNING] Invalid project model for artifact [cog-jglobus:lead-security:1.4]. It will be ignored by the remote resources Mojo.
Downloading: http://community.ucs.indiana.edu:9090/archiva/repository/ogce.m2.all/edu/berkeley/yfilter/1.0/yfilter-1.0.pom
Downloading: http://people.apache.org/repo/m2-snapshot-repository/edu/berkeley/yfilter/1.0/yfilter-1.0.pom
Downloading: http://mirrors.ibiblio.org/pub/mirrors/maven2/edu/berkeley/yfilter/1.0/yfilter-1.0.pom
Downloading: http://download.java.net/maven/2/edu/berkeley/yfilter/1.0/yfilter-1.0.pom
Downloading: http://people.apache.org/~lahiru/maven-repo/edu/berkeley/yfilter/1.0/yfilter-1.0.pom
Downloading: http://maven.ow2.org/maven2/edu/berkeley/yfilter/1.0/yfilter-1.0.pom
Downloading: http://repo1.maven.org/maven2/edu/berkeley/yfilter/1.0/yfilter-1.0.pom
[WARNING] Invalid project model for artifact [puretls:lead-security:0.9b4-1]. It will be ignored by the remote resources Mojo.
[WARNING] Invalid project model for artifact [cryptix-asn1:lead-security:versionless]. It will be ignored by the remote resources Mojo.
Downloading: http://community.ucs.indiana.edu:9090/archiva/repository/ogce.m2.all/gfac/gfac-schema-utils/0.4.4/gfac-schema-utils-0.4.4.pom
Downloading: http://people.apache.org/repo/m2-snapshot-repository/gfac/gfac-schema-utils/0.4.4/gfac-schema-utils-0.4.4.pom
Downloading: http://mirrors.ibiblio.org/pub/mirrors/maven2/gfac/gfac-schema-utils/0.4.4/gfac-schema-utils-0.4.4.pom
Downloading: http://download.java.net/maven/2/gfac/gfac-schema-utils/0.4.4/gfac-schema-utils-0.4.4.pom
Downloading: http://people.apache.org/~lahiru/maven-repo/gfac/gfac-schema-utils/0.4.4/gfac-schema-utils-0.4.4.pom
Downloading: http://maven.ow2.org/maven2/gfac/gfac-schema-utils/0.4.4/gfac-schema-utils-0.4.4.pom
Downloading: http://repo1.maven.org/maven2/gfac/gfac-schema-utils/0.4.4/gfac-schema-utils-0.4.4.pom
[JENKINS] Archiving <https://builds.apache.org/job/Airavata/ws/modules/xbaya-gui/pom.xml> to /home/hudson/hudson/jobs/Airavata/modules/org.apache.airavata$xbaya-gui/builds/2012-03-30_23-20-01/archive/org.apache.airavata/xbaya-gui/0.3-incubating-SNAPSHOT/xbaya-gui-0.3-incubating-SNAPSHOT.pom
[INFO] ------------------------------------------------------------------------
[INFO] Reactor Summary:
[INFO] 
[INFO] Airavata .......................................... SUCCESS [2:05.436s]
[INFO] Airavata Commons .................................. SUCCESS [4.627s]
[INFO] Airavata GFac Schema Utilities .................... SUCCESS [1:33.131s]
[INFO] Airavata Common Utilities ......................... SUCCESS [17.498s]
[INFO] Airavata Common Registry API ...................... SUCCESS [22.379s]
[INFO] Airavata Registry API ............................. SUCCESS [1:09.121s]
[INFO] Airavata Workflow Execution Context ............... SUCCESS [28.065s]
[INFO] Airavata-WS-Messenger ............................. SUCCESS [4.776s]
[INFO] Messenger Commons ................................. SUCCESS [19.507s]
[INFO] Messenger Client .................................. SUCCESS [14.772s]
[INFO] Airavata Workflow Tracking ........................ SUCCESS [46.909s]
[INFO] GFac-Core ......................................... SUCCESS [1:05.138s]
[INFO] GFac-Axis2-Interface .............................. SUCCESS [22.444s]
[INFO] MessageBox ........................................ SUCCESS [26.015s]
[INFO] Message Broker .................................... SUCCESS [57.644s]
[INFO] distribution ...................................... SUCCESS [1:07.719s]
[INFO] Registry-Migrator ................................. SUCCESS [31.925s]
[INFO] Airavata XBaya .................................... FAILURE [16.398s]
[INFO] Airavata Registry Web Service ..................... SKIPPED
[INFO] Airavata Client ................................... SKIPPED
[INFO] Simple Math Service ............................... SKIPPED
[INFO] Complex Math Service .............................. SKIPPED
[INFO] Levenshtein Distance Service ...................... SKIPPED
[INFO] distribution ...................................... SKIPPED
[INFO] Test-Suite ........................................ SKIPPED
[INFO] ------------------------------------------------------------------------
[INFO] BUILD FAILURE
[INFO] ------------------------------------------------------------------------
[INFO] Total time: 15:14.896s
[INFO] Finished at: Fri Mar 30 23:37:07 GMT+00:00 2012
[INFO] Final Memory: 29M/457M
[INFO] ------------------------------------------------------------------------
mavenExecutionResult exceptions not empty
message : Failed to execute goal org.apache.maven.plugins:maven-remote-resources-plugin:1.2.1:process (default) on project xbaya-gui: Error resolving project artifact: Could not transfer artifact gfac:gfac-schema-utils:pom:0.4.4 from/to ibiblio (http://mirrors.ibiblio.org/pub/mirrors/maven2): Access denied to: http://mirrors.ibiblio.org/pub/mirrors/maven2/gfac/gfac-schema-utils/0.4.4/gfac-schema-utils-0.4.4.pom for project gfac:gfac-schema-utils:jar:0.4.4
cause : Error resolving project artifact: Could not transfer artifact gfac:gfac-schema-utils:pom:0.4.4 from/to ibiblio (http://mirrors.ibiblio.org/pub/mirrors/maven2): Access denied to: http://mirrors.ibiblio.org/pub/mirrors/maven2/gfac/gfac-schema-utils/0.4.4/gfac-schema-utils-0.4.4.pom for project gfac:gfac-schema-utils:jar:0.4.4
Stack trace : 
org.apache.maven.lifecycle.LifecycleExecutionException: Failed to execute goal org.apache.maven.plugins:maven-remote-resources-plugin:1.2.1:process (default) on project xbaya-gui: Error resolving project artifact: Could not transfer artifact gfac:gfac-schema-utils:pom:0.4.4 from/to ibiblio (http://mirrors.ibiblio.org/pub/mirrors/maven2): Access denied to: http://mirrors.ibiblio.org/pub/mirrors/maven2/gfac/gfac-schema-utils/0.4.4/gfac-schema-utils-0.4.4.pom for project gfac:gfac-schema-utils:jar:0.4.4
	at org.apache.maven.lifecycle.internal.MojoExecutor.execute(MojoExecutor.java:217)
	at org.apache.maven.lifecycle.internal.MojoExecutor.execute(MojoExecutor.java:153)
	at org.apache.maven.lifecycle.internal.MojoExecutor.execute(MojoExecutor.java:145)
	at org.apache.maven.lifecycle.internal.LifecycleModuleBuilder.buildProject(LifecycleModuleBuilder.java:84)
	at org.apache.maven.lifecycle.internal.LifecycleModuleBuilder.buildProject(LifecycleModuleBuilder.java:59)
	at org.apache.maven.lifecycle.internal.LifecycleStarter.singleThreadedBuild(LifecycleStarter.java:183)
	at org.apache.maven.lifecycle.internal.LifecycleStarter.execute(LifecycleStarter.java:161)
	at org.apache.maven.DefaultMaven.doExecute(DefaultMaven.java:319)
	at org.apache.maven.DefaultMaven.execute(DefaultMaven.java:156)
	at org.jvnet.hudson.maven3.launcher.Maven3Launcher.main(Maven3Launcher.java:79)
	at sun.reflect.NativeMethodAccessorImpl.invoke0(Native Method)
	at sun.reflect.NativeMethodAccessorImpl.invoke(NativeMethodAccessorImpl.java:39)
	at sun.reflect.DelegatingMethodAccessorImpl.invoke(DelegatingMethodAccessorImpl.java:25)
	at java.lang.reflect.Method.invoke(Method.java:597)
	at org.codehaus.plexus.classworlds.launcher.Launcher.launchStandard(Launcher.java:329)
	at org.codehaus.plexus.classworlds.launcher.Launcher.launch(Launcher.java:239)
	at org.jvnet.hudson.maven3.agent.Maven3Main.launch(Maven3Main.java:158)
	at hudson.maven.Maven3Builder.call(Maven3Builder.java:104)
	at hudson.maven.Maven3Builder.call(Maven3Builder.java:70)
	at hudson.remoting.UserRequest.perform(UserRequest.java:118)
	at hudson.remoting.UserRequest.perform(UserRequest.java:48)
	at hudson.remoting.Request$2.run(Request.java:287)
	at hudson.remoting.InterceptingExecutorService$1.call(InterceptingExecutorService.java:72)
	at java.util.concurrent.FutureTask$Sync.innerRun(FutureTask.java:303)
	at java.util.concurrent.FutureTask.run(FutureTask.java:138)
	at java.util.concurrent.ThreadPoolExecutor$Worker.runTask(ThreadPoolExecutor.java:886)
	at java.util.concurrent.ThreadPoolExecutor$Worker.run(ThreadPoolExecutor.java:908)
	at java.lang.Thread.run(Thread.java:662)
Caused by: org.apache.maven.plugin.MojoExecutionException: Error resolving project artifact: Could not transfer artifact gfac:gfac-schema-utils:pom:0.4.4 from/to ibiblio (http://mirrors.ibiblio.org/pub/mirrors/maven2): Access denied to: http://mirrors.ibiblio.org/pub/mirrors/maven2/gfac/gfac-schema-utils/0.4.4/gfac-schema-utils-0.4.4.pom for project gfac:gfac-schema-utils:jar:0.4.4
	at org.apache.maven.plugin.resources.remote.ProcessRemoteResourcesMojo.getProjects(ProcessRemoteResourcesMojo.java:696)
	at org.apache.maven.plugin.resources.remote.ProcessRemoteResourcesMojo.configureVelocityContext(ProcessRemoteResourcesMojo.java:988)
	at org.apache.maven.plugin.resources.remote.ProcessRemoteResourcesMojo.execute(ProcessRemoteResourcesMojo.java:511)
	at org.apache.maven.plugin.DefaultBuildPluginManager.executeMojo(DefaultBuildPluginManager.java:101)
	at org.apache.maven.lifecycle.internal.MojoExecutor.execute(MojoExecutor.java:209)
	... 27 more
Caused by: org.apache.maven.project.ProjectBuildingException: Error resolving project artifact: Could not transfer artifact gfac:gfac-schema-utils:pom:0.4.4 from/to ibiblio (http://mirrors.ibiblio.org/pub/mirrors/maven2): Access denied to: http://mirrors.ibiblio.org/pub/mirrors/maven2/gfac/gfac-schema-utils/0.4.4/gfac-schema-utils-0.4.4.pom for project gfac:gfac-schema-utils:jar:0.4.4
	at org.apache.maven.project.DefaultProjectBuilder.build(DefaultProjectBuilder.java:272)
	at org.apache.maven.project.DefaultMavenProjectBuilder.buildFromRepository(DefaultMavenProjectBuilder.java:237)
	at org.apache.maven.project.DefaultMavenProjectBuilder.buildFromRepository(DefaultMavenProjectBuilder.java:252)
	at org.apache.maven.project.DefaultMavenProjectBuilder.buildFromRepository(DefaultMavenProjectBuilder.java:259)
	at org.apache.maven.plugin.resources.remote.ProcessRemoteResourcesMojo.getProjects(ProcessRemoteResourcesMojo.java:666)
	... 31 more
Caused by: org.sonatype.aether.resolution.ArtifactResolutionException: Could not transfer artifact gfac:gfac-schema-utils:pom:0.4.4 from/to ibiblio (http://mirrors.ibiblio.org/pub/mirrors/maven2): Access denied to: http://mirrors.ibiblio.org/pub/mirrors/maven2/gfac/gfac-schema-utils/0.4.4/gfac-schema-utils-0.4.4.pom
	at org.sonatype.aether.impl.internal.DefaultArtifactResolver.resolve(DefaultArtifactResolver.java:541)
	at org.sonatype.aether.impl.internal.DefaultArtifactResolver.resolveArtifacts(DefaultArtifactResolver.java:220)
	at org.sonatype.aether.impl.internal.DefaultArtifactResolver.resolveArtifact(DefaultArtifactResolver.java:197)
	at org.sonatype.aether.impl.internal.DefaultRepositorySystem.resolveArtifact(DefaultRepositorySystem.java:323)
	at org.apache.maven.project.DefaultProjectBuilder.build(DefaultProjectBuilder.java:261)
	... 35 more
Caused by: org.sonatype.aether.transfer.ArtifactTransferException: Could not transfer artifact gfac:gfac-schema-utils:pom:0.4.4 from/to ibiblio (http://mirrors.ibiblio.org/pub/mirrors/maven2): Access denied to: http://mirrors.ibiblio.org/pub/mirrors/maven2/gfac/gfac-schema-utils/0.4.4/gfac-schema-utils-0.4.4.pom
	at org.sonatype.aether.connector.wagon.WagonRepositoryConnector$4.wrap(WagonRepositoryConnector.java:949)
	at org.sonatype.aether.connector.wagon.WagonRepositoryConnector$4.wrap(WagonRepositoryConnector.java:940)
	at org.sonatype.aether.connector.wagon.WagonRepositoryConnector$GetTask.flush(WagonRepositoryConnector.java:695)
	at org.sonatype.aether.connector.wagon.WagonRepositoryConnector$GetTask.flush(WagonRepositoryConnector.java:689)
	at org.sonatype.aether.connector.wagon.WagonRepositoryConnector.get(WagonRepositoryConnector.java:445)
	at org.sonatype.aether.impl.internal.DefaultArtifactResolver.resolve(DefaultArtifactResolver.java:460)
	... 39 more
Caused by: org.apache.maven.wagon.authorization.AuthorizationException: Access denied to: http://mirrors.ibiblio.org/pub/mirrors/maven2/gfac/gfac-schema-utils/0.4.4/gfac-schema-utils-0.4.4.pom
	at org.apache.maven.wagon.providers.http.LightweightHttpWagon.fillInputData(LightweightHttpWagon.java:119)
	at org.apache.maven.wagon.StreamWagon.getInputStream(StreamWagon.java:116)
	at org.apache.maven.wagon.StreamWagon.getIfNewer(StreamWagon.java:88)
	at org.apache.maven.wagon.StreamWagon.get(StreamWagon.java:61)
	at org.sonatype.aether.connector.wagon.WagonRepositoryConnector$GetTask.run(WagonRepositoryConnector.java:608)
	at org.sonatype.aether.util.concurrency.RunnableErrorForwarder$1.run(RunnableErrorForwarder.java:64)
	... 3 more
channel stopped