You are viewing a plain text version of this content. The canonical link for it is here.
Posted to builds@beam.apache.org by Apache Jenkins Server <je...@builds.apache.org> on 2021/06/27 07:18:17 UTC
Build failed in Jenkins: beam_PostCommit_XVR_Dataflow #880
See <https://ci-beam.apache.org/job/beam_PostCommit_XVR_Dataflow/880/display/redirect>
Changes:
------------------------------------------
[...truncated 1.14 MB...]
False if self.not_use_test_runner_api else test_runner_api))
apache_beam/pipeline.py:564: in run
return self.runner.run_pipeline(self, self._options)
apache_beam/runners/dataflow/test_dataflow_runner.py:65: in run_pipeline
self.result.wait_until_finish(duration=wait_duration)
_ _ _ _ _ _ _ _ _ _ _ _ _ _ _ _ _ _ _ _ _ _ _ _ _ _ _ _ _ _ _ _ _ _ _ _ _ _ _ _
self = <DataflowPipelineResult <Job
createTime: '2021-06-27T06:16:55.809026Z'
currentState: CurrentStateValueValuesEnum(JOB...021-06-27T06:16:55.809026Z'
steps: []
tempFiles: []
type: TypeValueValuesEnum(JOB_TYPE_BATCH, 1)> at 0x7f82a083b198>
duration = None
def wait_until_finish(self, duration=None):
if not self.is_in_terminal_state():
if not self.has_job:
raise IOError('Failed to get the Dataflow job id.')
thread = threading.Thread(
target=DataflowRunner.poll_for_job_completion,
args=(self._runner, self, duration))
# Mark the thread as a daemon thread so a keyboard interrupt on the main
# thread will terminate everything. This is also the reason we will not
# use thread.join() to wait for the polling thread.
thread.daemon = True
thread.start()
while thread.is_alive():
time.sleep(5.0)
# TODO: Merge the termination code in poll_for_job_completion and
# is_in_terminal_state.
terminated = self.is_in_terminal_state()
assert duration or terminated, (
'Job did not reach to a terminal state after waiting indefinitely.')
if terminated and self.state != PipelineState.DONE:
# TODO(BEAM-1290): Consider converting this to an error log based on
# theresolution of the issue.
raise DataflowRuntimeException(
'Dataflow pipeline failed. State: %s, Error:\n%s' %
(self.state, getattr(self._runner, 'last_error_msg', None)),
> self)
E apache_beam.runners.dataflow.dataflow_runner.DataflowRuntimeException: Dataflow pipeline failed. State: FAILED, Error:
E The Dataflow job appears to be stuck because no worker activity has been seen in the last 1h. Please check the worker logs in Stackdriver Logging. You can also get help with Cloud Dataflow at https://cloud.google.com/dataflow/support.
apache_beam/runners/dataflow/dataflow_runner.py:1629: DataflowRuntimeException
------------------------------ Captured log call -------------------------------
INFO apache_beam.runners.portability.stager:stager.py:300 Copying Beam SDK "<https://ci-beam.apache.org/job/beam_PostCommit_XVR_Dataflow/ws/src/sdks/python/build/apache-beam.tar.gz"> to staging location.
WARNING root:environments.py:374 Make sure that locally built Python SDK docker image has Python 3.6 interpreter.
INFO root:environments.py:380 Default Python SDK image for environment is apache/beam_python3.6_sdk:2.32.0.dev
INFO root:environments.py:296 Using provided Python SDK container image: gcr.io/cloud-dataflow/v1beta3/python36-fnapi:beam-master-20210622
INFO root:environments.py:304 Python SDK container image set to "gcr.io/cloud-dataflow/v1beta3/python36-fnapi:beam-master-20210622" for Docker environment
INFO apache_beam.runners.portability.fn_api_runner.translations:translations.py:650 ==================== <function pack_combiners at 0x7f82a28f22f0> ====================
INFO apache_beam.runners.portability.fn_api_runner.translations:translations.py:650 ==================== <function sort_stages at 0x7f82a28f2a60> ====================
INFO apache_beam.runners.dataflow.internal.apiclient:apiclient.py:452 Defaulting to the temp_location as staging_location: gs://dataflow-staging-us-central1-77b801c0838aee13391c0d1885860494
INFO apache_beam.runners.dataflow.internal.apiclient:apiclient.py:632 Starting GCS upload to gs://dataflow-staging-us-central1-77b801c0838aee13391c0d1885860494/beamapp-jenkins-0627061646-413857.1624774606.414477/icedtea-sound-Bdoi2wYa757-fzq5vconCy4SSQ22ZaOq7yuC98fKPs8.jar...
INFO apache_beam.runners.dataflow.internal.apiclient:apiclient.py:651 Completed GCS upload to gs://dataflow-staging-us-central1-77b801c0838aee13391c0d1885860494/beamapp-jenkins-0627061646-413857.1624774606.414477/icedtea-sound-Bdoi2wYa757-fzq5vconCy4SSQ22ZaOq7yuC98fKPs8.jar in 0 seconds.
INFO apache_beam.runners.dataflow.internal.apiclient:apiclient.py:632 Starting GCS upload to gs://dataflow-staging-us-central1-77b801c0838aee13391c0d1885860494/beamapp-jenkins-0627061646-413857.1624774606.414477/jaccess-CMbK-IOdQPLKHEqCuDnE-yBk-VpbtVT-hgjbHRUGO78.jar...
INFO apache_beam.runners.dataflow.internal.apiclient:apiclient.py:651 Completed GCS upload to gs://dataflow-staging-us-central1-77b801c0838aee13391c0d1885860494/beamapp-jenkins-0627061646-413857.1624774606.414477/jaccess-CMbK-IOdQPLKHEqCuDnE-yBk-VpbtVT-hgjbHRUGO78.jar in 0 seconds.
INFO apache_beam.runners.dataflow.internal.apiclient:apiclient.py:632 Starting GCS upload to gs://dataflow-staging-us-central1-77b801c0838aee13391c0d1885860494/beamapp-jenkins-0627061646-413857.1624774606.414477/localedata-ae5Z0L6ak4922fztWeWy7ajiWXdG3ubNrwerJRFoFj0.jar...
INFO apache_beam.runners.dataflow.internal.apiclient:apiclient.py:651 Completed GCS upload to gs://dataflow-staging-us-central1-77b801c0838aee13391c0d1885860494/beamapp-jenkins-0627061646-413857.1624774606.414477/localedata-ae5Z0L6ak4922fztWeWy7ajiWXdG3ubNrwerJRFoFj0.jar in 0 seconds.
INFO apache_beam.runners.dataflow.internal.apiclient:apiclient.py:632 Starting GCS upload to gs://dataflow-staging-us-central1-77b801c0838aee13391c0d1885860494/beamapp-jenkins-0627061646-413857.1624774606.414477/nashorn-XHtz_UehGpYcLTOrATrTnMNVUgEVa_ttoWkPxnVfqTo.jar...
INFO apache_beam.runners.dataflow.internal.apiclient:apiclient.py:651 Completed GCS upload to gs://dataflow-staging-us-central1-77b801c0838aee13391c0d1885860494/beamapp-jenkins-0627061646-413857.1624774606.414477/nashorn-XHtz_UehGpYcLTOrATrTnMNVUgEVa_ttoWkPxnVfqTo.jar in 0 seconds.
INFO apache_beam.runners.dataflow.internal.apiclient:apiclient.py:632 Starting GCS upload to gs://dataflow-staging-us-central1-77b801c0838aee13391c0d1885860494/beamapp-jenkins-0627061646-413857.1624774606.414477/cldrdata-k07I6K9W3X5KTQbcDIEsqM0LXyM18f0eR6IaJw-P_xk.jar...
INFO apache_beam.runners.dataflow.internal.apiclient:apiclient.py:651 Completed GCS upload to gs://dataflow-staging-us-central1-77b801c0838aee13391c0d1885860494/beamapp-jenkins-0627061646-413857.1624774606.414477/cldrdata-k07I6K9W3X5KTQbcDIEsqM0LXyM18f0eR6IaJw-P_xk.jar in 0 seconds.
INFO apache_beam.runners.dataflow.internal.apiclient:apiclient.py:632 Starting GCS upload to gs://dataflow-staging-us-central1-77b801c0838aee13391c0d1885860494/beamapp-jenkins-0627061646-413857.1624774606.414477/dnsns-RGhCDg3GVOQVC2r6ka2N0hmI4eqQH6VobuoAnQ74MnE.jar...
INFO apache_beam.runners.dataflow.internal.apiclient:apiclient.py:651 Completed GCS upload to gs://dataflow-staging-us-central1-77b801c0838aee13391c0d1885860494/beamapp-jenkins-0627061646-413857.1624774606.414477/dnsns-RGhCDg3GVOQVC2r6ka2N0hmI4eqQH6VobuoAnQ74MnE.jar in 0 seconds.
INFO apache_beam.runners.dataflow.internal.apiclient:apiclient.py:632 Starting GCS upload to gs://dataflow-staging-us-central1-77b801c0838aee13391c0d1885860494/beamapp-jenkins-0627061646-413857.1624774606.414477/beam-sdks-java-testing-expansion-service-testExpansionService-2.32.0-SNAPSHOT-r2gF5NoKrv2Y2yzSA5y9TNf74qdrZxzSVFwgQYg5t7M.jar...
INFO apache_beam.runners.dataflow.internal.apiclient:apiclient.py:651 Completed GCS upload to gs://dataflow-staging-us-central1-77b801c0838aee13391c0d1885860494/beamapp-jenkins-0627061646-413857.1624774606.414477/beam-sdks-java-testing-expansion-service-testExpansionService-2.32.0-SNAPSHOT-r2gF5NoKrv2Y2yzSA5y9TNf74qdrZxzSVFwgQYg5t7M.jar in 6 seconds.
INFO apache_beam.runners.dataflow.internal.apiclient:apiclient.py:632 Starting GCS upload to gs://dataflow-staging-us-central1-77b801c0838aee13391c0d1885860494/beamapp-jenkins-0627061646-413857.1624774606.414477/dataflow_python_sdk.tar...
INFO apache_beam.runners.dataflow.internal.apiclient:apiclient.py:651 Completed GCS upload to gs://dataflow-staging-us-central1-77b801c0838aee13391c0d1885860494/beamapp-jenkins-0627061646-413857.1624774606.414477/dataflow_python_sdk.tar in 0 seconds.
INFO apache_beam.runners.dataflow.internal.apiclient:apiclient.py:632 Starting GCS upload to gs://dataflow-staging-us-central1-77b801c0838aee13391c0d1885860494/beamapp-jenkins-0627061646-413857.1624774606.414477/pipeline.pb...
INFO apache_beam.runners.dataflow.internal.apiclient:apiclient.py:651 Completed GCS upload to gs://dataflow-staging-us-central1-77b801c0838aee13391c0d1885860494/beamapp-jenkins-0627061646-413857.1624774606.414477/pipeline.pb in 0 seconds.
INFO apache_beam.runners.dataflow.internal.apiclient:apiclient.py:798 Create job: <Job
createTime: '2021-06-27T06:16:55.809026Z'
currentStateTime: '1970-01-01T00:00:00Z'
id: '2021-06-26_23_16_53-17378079845190176977'
location: 'us-central1'
name: 'beamapp-jenkins-0627061646-413857'
projectId: 'apache-beam-testing'
stageStates: []
startTime: '2021-06-27T06:16:55.809026Z'
steps: []
tempFiles: []
type: TypeValueValuesEnum(JOB_TYPE_BATCH, 1)>
INFO apache_beam.runners.dataflow.internal.apiclient:apiclient.py:800 Created job with id: [2021-06-26_23_16_53-17378079845190176977]
INFO apache_beam.runners.dataflow.internal.apiclient:apiclient.py:801 Submitted job: 2021-06-26_23_16_53-17378079845190176977
INFO apache_beam.runners.dataflow.internal.apiclient:apiclient.py:807 To access the Dataflow monitoring console, please navigate to https://console.cloud.google.com/dataflow/jobs/us-central1/2021-06-26_23_16_53-17378079845190176977?project=apache-beam-testing
INFO apache_beam.runners.dataflow.dataflow_runner:dataflow_runner.py:191 Job 2021-06-26_23_16_53-17378079845190176977 is in state JOB_STATE_RUNNING
INFO apache_beam.runners.dataflow.dataflow_runner:dataflow_runner.py:236 2021-06-27T06:16:58.081Z: JOB_MESSAGE_DETAILED: Autoscaling is enabled for job 2021-06-26_23_16_53-17378079845190176977. The number of workers will be between 1 and 1000.
INFO apache_beam.runners.dataflow.dataflow_runner:dataflow_runner.py:236 2021-06-27T06:16:58.291Z: JOB_MESSAGE_DETAILED: Autoscaling was automatically enabled for job 2021-06-26_23_16_53-17378079845190176977.
INFO apache_beam.runners.dataflow.dataflow_runner:dataflow_runner.py:236 2021-06-27T06:16:59.886Z: JOB_MESSAGE_BASIC: Worker configuration: n1-standard-1 in us-central1-f.
INFO apache_beam.runners.dataflow.dataflow_runner:dataflow_runner.py:236 2021-06-27T06:17:00.490Z: JOB_MESSAGE_DETAILED: Expanding SplittableParDo operations into optimizable parts.
INFO apache_beam.runners.dataflow.dataflow_runner:dataflow_runner.py:236 2021-06-27T06:17:00.690Z: JOB_MESSAGE_DETAILED: Expanding CollectionToSingleton operations into optimizable parts.
INFO apache_beam.runners.dataflow.dataflow_runner:dataflow_runner.py:236 2021-06-27T06:17:00.745Z: JOB_MESSAGE_DETAILED: Expanding CoGroupByKey operations into optimizable parts.
INFO apache_beam.runners.dataflow.dataflow_runner:dataflow_runner.py:236 2021-06-27T06:17:00.778Z: JOB_MESSAGE_DEBUG: Combiner lifting skipped for step check_odd/Group/GroupByKey: GroupByKey not followed by a combiner.
INFO apache_beam.runners.dataflow.dataflow_runner:dataflow_runner.py:236 2021-06-27T06:17:00.810Z: JOB_MESSAGE_DEBUG: Combiner lifting skipped for step check_even/Group/GroupByKey: GroupByKey not followed by a combiner.
INFO apache_beam.runners.dataflow.dataflow_runner:dataflow_runner.py:236 2021-06-27T06:17:00.833Z: JOB_MESSAGE_DEBUG: Combiner lifting skipped for step Create/MaybeReshuffle/Reshuffle/ReshufflePerKey/GroupByKey: GroupByKey not followed by a combiner.
INFO apache_beam.runners.dataflow.dataflow_runner:dataflow_runner.py:236 2021-06-27T06:17:00.871Z: JOB_MESSAGE_DETAILED: Expanding GroupByKey operations into optimizable parts.
INFO apache_beam.runners.dataflow.dataflow_runner:dataflow_runner.py:236 2021-06-27T06:17:00.919Z: JOB_MESSAGE_DEBUG: Annotating graph with Autotuner information.
INFO apache_beam.runners.dataflow.dataflow_runner:dataflow_runner.py:236 2021-06-27T06:17:00.956Z: JOB_MESSAGE_DETAILED: Fusing adjacent ParDo, Read, Write, and Flatten operations
INFO apache_beam.runners.dataflow.dataflow_runner:dataflow_runner.py:236 2021-06-27T06:17:00.974Z: JOB_MESSAGE_DEBUG: Inserted coder converter after flatten ref_AppliedPTransform_check_even-Group-Flatten_26
INFO apache_beam.runners.dataflow.dataflow_runner:dataflow_runner.py:236 2021-06-27T06:17:01.006Z: JOB_MESSAGE_DEBUG: Inserted coder converter after flatten ref_AppliedPTransform_check_odd-Group-Flatten_42
INFO apache_beam.runners.dataflow.dataflow_runner:dataflow_runner.py:236 2021-06-27T06:17:01.044Z: JOB_MESSAGE_DETAILED: Unzipping flatten ref_AppliedPTransform_check_even-Group-Flatten_26 for input ref_AppliedPTransform_check_even-Group-pair_with_0_24.None
INFO apache_beam.runners.dataflow.dataflow_runner:dataflow_runner.py:236 2021-06-27T06:17:01.076Z: JOB_MESSAGE_DETAILED: Fusing unzipped copy of check_even/Group/Flatten/OutputIdentity, through flatten check_even/Group/Flatten, into producer check_even/Group/pair_with_0
INFO apache_beam.runners.dataflow.dataflow_runner:dataflow_runner.py:236 2021-06-27T06:17:01.101Z: JOB_MESSAGE_DETAILED: Fusing consumer check_even/Group/Map(_merge_tagged_vals_under_key) into check_even/Group/GroupByKey/Read
INFO apache_beam.runners.dataflow.dataflow_runner:dataflow_runner.py:236 2021-06-27T06:17:01.136Z: JOB_MESSAGE_DETAILED: Fusing consumer check_even/Unkey into check_even/Group/Map(_merge_tagged_vals_under_key)
INFO apache_beam.runners.dataflow.dataflow_runner:dataflow_runner.py:236 2021-06-27T06:17:01.157Z: JOB_MESSAGE_DETAILED: Fusing consumer check_even/Match into check_even/Unkey
INFO apache_beam.runners.dataflow.dataflow_runner:dataflow_runner.py:236 2021-06-27T06:17:01.188Z: JOB_MESSAGE_DETAILED: Unzipping flatten ref_AppliedPTransform_check_odd-Group-Flatten_42 for input ref_AppliedPTransform_check_odd-Group-pair_with_0_40.None
INFO apache_beam.runners.dataflow.dataflow_runner:dataflow_runner.py:236 2021-06-27T06:17:01.212Z: JOB_MESSAGE_DETAILED: Fusing unzipped copy of check_odd/Group/Flatten/OutputIdentity, through flatten check_odd/Group/Flatten, into producer check_odd/Group/pair_with_0
INFO apache_beam.runners.dataflow.dataflow_runner:dataflow_runner.py:236 2021-06-27T06:17:01.239Z: JOB_MESSAGE_DETAILED: Fusing consumer check_odd/Group/Map(_merge_tagged_vals_under_key) into check_odd/Group/GroupByKey/Read
INFO apache_beam.runners.dataflow.dataflow_runner:dataflow_runner.py:236 2021-06-27T06:17:01.261Z: JOB_MESSAGE_DETAILED: Fusing consumer check_odd/Unkey into check_odd/Group/Map(_merge_tagged_vals_under_key)
INFO apache_beam.runners.dataflow.dataflow_runner:dataflow_runner.py:236 2021-06-27T06:17:01.295Z: JOB_MESSAGE_DETAILED: Fusing consumer check_odd/Match into check_odd/Unkey
INFO apache_beam.runners.dataflow.dataflow_runner:dataflow_runner.py:236 2021-06-27T06:17:01.327Z: JOB_MESSAGE_DETAILED: Unzipping flatten ref_AppliedPTransform_check_even-Group-Flatten_26-u27 for input ref_AppliedPTransform_check_even-Group-Flatten_26.None-c25
INFO apache_beam.runners.dataflow.dataflow_runner:dataflow_runner.py:236 2021-06-27T06:17:01.352Z: JOB_MESSAGE_DETAILED: Fusing unzipped copy of check_even/Group/GroupByKey/Write, through flatten check_even/Group/Flatten/Unzipped-1, into producer check_even/Group/Flatten/OutputIdentity
INFO apache_beam.runners.dataflow.dataflow_runner:dataflow_runner.py:236 2021-06-27T06:17:01.377Z: JOB_MESSAGE_DETAILED: Unzipping flatten ref_AppliedPTransform_check_odd-Group-Flatten_42-u32 for input ref_AppliedPTransform_check_odd-Group-Flatten_42.None-c30
INFO apache_beam.runners.dataflow.dataflow_runner:dataflow_runner.py:236 2021-06-27T06:17:01.406Z: JOB_MESSAGE_DETAILED: Fusing unzipped copy of check_odd/Group/GroupByKey/Write, through flatten check_odd/Group/Flatten/Unzipped-1, into producer check_odd/Group/Flatten/OutputIdentity
INFO apache_beam.runners.dataflow.dataflow_runner:dataflow_runner.py:236 2021-06-27T06:17:01.429Z: JOB_MESSAGE_DETAILED: Fusing consumer check_even/Group/Flatten/OutputIdentity into check_even/Group/pair_with_1
INFO apache_beam.runners.dataflow.dataflow_runner:dataflow_runner.py:236 2021-06-27T06:17:01.456Z: JOB_MESSAGE_DETAILED: Fusing consumer check_odd/Group/Flatten/OutputIdentity into check_odd/Group/pair_with_1
INFO apache_beam.runners.dataflow.dataflow_runner:dataflow_runner.py:236 2021-06-27T06:17:01.492Z: JOB_MESSAGE_DETAILED: Fusing consumer check_even/Group/GroupByKey/Write into check_even/Group/Flatten/OutputIdentity
INFO apache_beam.runners.dataflow.dataflow_runner:dataflow_runner.py:236 2021-06-27T06:17:01.526Z: JOB_MESSAGE_DETAILED: Fusing consumer check_odd/Group/GroupByKey/Write into check_odd/Group/Flatten/OutputIdentity
INFO apache_beam.runners.dataflow.dataflow_runner:dataflow_runner.py:236 2021-06-27T06:17:01.562Z: JOB_MESSAGE_DETAILED: Fusing consumer Create/FlatMap(<lambda at core.py:2972>) into Create/Impulse
INFO apache_beam.runners.dataflow.dataflow_runner:dataflow_runner.py:236 2021-06-27T06:17:01.585Z: JOB_MESSAGE_DETAILED: Fusing consumer Create/MaybeReshuffle/Reshuffle/AddRandomKeys into Create/FlatMap(<lambda at core.py:2972>)
INFO apache_beam.runners.dataflow.dataflow_runner:dataflow_runner.py:236 2021-06-27T06:17:01.607Z: JOB_MESSAGE_DETAILED: Fusing consumer Create/MaybeReshuffle/Reshuffle/ReshufflePerKey/Map(reify_timestamps) into Create/MaybeReshuffle/Reshuffle/AddRandomKeys
INFO apache_beam.runners.dataflow.dataflow_runner:dataflow_runner.py:236 2021-06-27T06:17:01.631Z: JOB_MESSAGE_DETAILED: Fusing consumer Create/MaybeReshuffle/Reshuffle/ReshufflePerKey/GroupByKey/Reify into Create/MaybeReshuffle/Reshuffle/ReshufflePerKey/Map(reify_timestamps)
INFO apache_beam.runners.dataflow.dataflow_runner:dataflow_runner.py:236 2021-06-27T06:17:01.663Z: JOB_MESSAGE_DETAILED: Fusing consumer Create/MaybeReshuffle/Reshuffle/ReshufflePerKey/GroupByKey/Write into Create/MaybeReshuffle/Reshuffle/ReshufflePerKey/GroupByKey/Reify
INFO apache_beam.runners.dataflow.dataflow_runner:dataflow_runner.py:236 2021-06-27T06:17:01.692Z: JOB_MESSAGE_DETAILED: Fusing consumer Create/MaybeReshuffle/Reshuffle/ReshufflePerKey/GroupByKey/GroupByWindow into Create/MaybeReshuffle/Reshuffle/ReshufflePerKey/GroupByKey/Read
INFO apache_beam.runners.dataflow.dataflow_runner:dataflow_runner.py:236 2021-06-27T06:17:01.717Z: JOB_MESSAGE_DETAILED: Fusing consumer Create/MaybeReshuffle/Reshuffle/ReshufflePerKey/FlatMap(restore_timestamps) into Create/MaybeReshuffle/Reshuffle/ReshufflePerKey/GroupByKey/GroupByWindow
INFO apache_beam.runners.dataflow.dataflow_runner:dataflow_runner.py:236 2021-06-27T06:17:01.735Z: JOB_MESSAGE_DETAILED: Fusing consumer Create/MaybeReshuffle/Reshuffle/RemoveRandomKeys into Create/MaybeReshuffle/Reshuffle/ReshufflePerKey/FlatMap(restore_timestamps)
INFO apache_beam.runners.dataflow.dataflow_runner:dataflow_runner.py:236 2021-06-27T06:17:01.756Z: JOB_MESSAGE_DETAILED: Fusing consumer Create/Map(decode) into Create/MaybeReshuffle/Reshuffle/RemoveRandomKeys
INFO apache_beam.runners.dataflow.dataflow_runner:dataflow_runner.py:236 2021-06-27T06:17:01.779Z: JOB_MESSAGE_DETAILED: Fusing consumer ExternalTransform(beam:transforms:xlang:test:partition)/ParMultiDo(Partition) into Create/Map(decode)
INFO apache_beam.runners.dataflow.dataflow_runner:dataflow_runner.py:236 2021-06-27T06:17:01.804Z: JOB_MESSAGE_DETAILED: Fusing consumer check_even/WindowInto(WindowIntoFn) into ExternalTransform(beam:transforms:xlang:test:partition)/ParMultiDo(Partition)
INFO apache_beam.runners.dataflow.dataflow_runner:dataflow_runner.py:236 2021-06-27T06:17:01.825Z: JOB_MESSAGE_DETAILED: Fusing consumer check_odd/WindowInto(WindowIntoFn) into ExternalTransform(beam:transforms:xlang:test:partition)/ParMultiDo(Partition)
INFO apache_beam.runners.dataflow.dataflow_runner:dataflow_runner.py:236 2021-06-27T06:17:01.858Z: JOB_MESSAGE_DETAILED: Fusing consumer check_even/Create/FlatMap(<lambda at core.py:2972>) into check_even/Create/Impulse
INFO apache_beam.runners.dataflow.dataflow_runner:dataflow_runner.py:236 2021-06-27T06:17:01.895Z: JOB_MESSAGE_DETAILED: Fusing consumer check_even/Create/Map(decode) into check_even/Create/FlatMap(<lambda at core.py:2972>)
INFO apache_beam.runners.dataflow.dataflow_runner:dataflow_runner.py:236 2021-06-27T06:17:01.921Z: JOB_MESSAGE_DETAILED: Fusing consumer check_even/Group/pair_with_0 into check_even/Create/Map(decode)
INFO apache_beam.runners.dataflow.dataflow_runner:dataflow_runner.py:236 2021-06-27T06:17:01.955Z: JOB_MESSAGE_DETAILED: Fusing consumer check_even/ToVoidKey into check_even/WindowInto(WindowIntoFn)
INFO apache_beam.runners.dataflow.dataflow_runner:dataflow_runner.py:236 2021-06-27T06:17:01.990Z: JOB_MESSAGE_DETAILED: Fusing consumer check_even/Group/pair_with_1 into check_even/ToVoidKey
INFO apache_beam.runners.dataflow.dataflow_runner:dataflow_runner.py:236 2021-06-27T06:17:02.023Z: JOB_MESSAGE_DETAILED: Fusing consumer check_odd/Create/FlatMap(<lambda at core.py:2972>) into check_odd/Create/Impulse
INFO apache_beam.runners.dataflow.dataflow_runner:dataflow_runner.py:236 2021-06-27T06:17:02.056Z: JOB_MESSAGE_DETAILED: Fusing consumer check_odd/Create/Map(decode) into check_odd/Create/FlatMap(<lambda at core.py:2972>)
INFO apache_beam.runners.dataflow.dataflow_runner:dataflow_runner.py:236 2021-06-27T06:17:02.089Z: JOB_MESSAGE_DETAILED: Fusing consumer check_odd/Group/pair_with_0 into check_odd/Create/Map(decode)
INFO apache_beam.runners.dataflow.dataflow_runner:dataflow_runner.py:236 2021-06-27T06:17:02.123Z: JOB_MESSAGE_DETAILED: Fusing consumer check_odd/ToVoidKey into check_odd/WindowInto(WindowIntoFn)
INFO apache_beam.runners.dataflow.dataflow_runner:dataflow_runner.py:236 2021-06-27T06:17:02.146Z: JOB_MESSAGE_DETAILED: Fusing consumer check_odd/Group/pair_with_1 into check_odd/ToVoidKey
INFO apache_beam.runners.dataflow.dataflow_runner:dataflow_runner.py:236 2021-06-27T06:17:02.172Z: JOB_MESSAGE_DEBUG: Workflow config is missing a default resource spec.
INFO apache_beam.runners.dataflow.dataflow_runner:dataflow_runner.py:236 2021-06-27T06:17:02.195Z: JOB_MESSAGE_DEBUG: Adding StepResource setup and teardown to workflow graph.
INFO apache_beam.runners.dataflow.dataflow_runner:dataflow_runner.py:236 2021-06-27T06:17:02.219Z: JOB_MESSAGE_DEBUG: Adding workflow start and stop steps.
INFO apache_beam.runners.dataflow.dataflow_runner:dataflow_runner.py:236 2021-06-27T06:17:02.245Z: JOB_MESSAGE_DEBUG: Assigning stage ids.
INFO apache_beam.runners.dataflow.dataflow_runner:dataflow_runner.py:236 2021-06-27T06:17:02.527Z: JOB_MESSAGE_DEBUG: Executing wait step start45
INFO apache_beam.runners.dataflow.dataflow_runner:dataflow_runner.py:236 2021-06-27T06:17:02.582Z: JOB_MESSAGE_BASIC: Executing operation Create/MaybeReshuffle/Reshuffle/ReshufflePerKey/GroupByKey/Create
INFO apache_beam.runners.dataflow.dataflow_runner:dataflow_runner.py:236 2021-06-27T06:17:02.603Z: JOB_MESSAGE_BASIC: Executing operation check_even/Group/GroupByKey/Create
INFO apache_beam.runners.dataflow.dataflow_runner:dataflow_runner.py:236 2021-06-27T06:17:02.627Z: JOB_MESSAGE_DEBUG: Starting worker pool setup.
INFO apache_beam.runners.dataflow.dataflow_runner:dataflow_runner.py:236 2021-06-27T06:17:02.627Z: JOB_MESSAGE_BASIC: Executing operation check_odd/Group/GroupByKey/Create
INFO apache_beam.runners.dataflow.dataflow_runner:dataflow_runner.py:236 2021-06-27T06:17:02.658Z: JOB_MESSAGE_BASIC: Starting 1 workers in us-central1-f...
INFO apache_beam.runners.dataflow.dataflow_runner:dataflow_runner.py:236 2021-06-27T06:17:02.704Z: JOB_MESSAGE_BASIC: Finished operation Create/MaybeReshuffle/Reshuffle/ReshufflePerKey/GroupByKey/Create
INFO apache_beam.runners.dataflow.dataflow_runner:dataflow_runner.py:236 2021-06-27T06:17:02.718Z: JOB_MESSAGE_BASIC: Finished operation check_even/Group/GroupByKey/Create
INFO apache_beam.runners.dataflow.dataflow_runner:dataflow_runner.py:236 2021-06-27T06:17:02.718Z: JOB_MESSAGE_BASIC: Finished operation check_odd/Group/GroupByKey/Create
INFO apache_beam.runners.dataflow.dataflow_runner:dataflow_runner.py:236 2021-06-27T06:17:02.759Z: JOB_MESSAGE_DEBUG: Value "Create/MaybeReshuffle/Reshuffle/ReshufflePerKey/GroupByKey/Session" materialized.
INFO apache_beam.runners.dataflow.dataflow_runner:dataflow_runner.py:236 2021-06-27T06:17:02.791Z: JOB_MESSAGE_DEBUG: Value "check_odd/Group/GroupByKey/Session" materialized.
INFO apache_beam.runners.dataflow.dataflow_runner:dataflow_runner.py:236 2021-06-27T06:17:02.825Z: JOB_MESSAGE_DEBUG: Value "check_even/Group/GroupByKey/Session" materialized.
INFO apache_beam.runners.dataflow.dataflow_runner:dataflow_runner.py:236 2021-06-27T06:17:02.859Z: JOB_MESSAGE_BASIC: Executing operation Create/Impulse+Create/FlatMap(<lambda at core.py:2972>)+Create/MaybeReshuffle/Reshuffle/AddRandomKeys+Create/MaybeReshuffle/Reshuffle/ReshufflePerKey/Map(reify_timestamps)+Create/MaybeReshuffle/Reshuffle/ReshufflePerKey/GroupByKey/Reify+Create/MaybeReshuffle/Reshuffle/ReshufflePerKey/GroupByKey/Write
INFO apache_beam.runners.dataflow.dataflow_runner:dataflow_runner.py:236 2021-06-27T06:17:02.891Z: JOB_MESSAGE_BASIC: Executing operation check_odd/Create/Impulse+check_odd/Create/FlatMap(<lambda at core.py:2972>)+check_odd/Create/Map(decode)+check_odd/Group/pair_with_0+check_odd/Group/Flatten/OutputIdentity+check_odd/Group/GroupByKey/Write
INFO apache_beam.runners.dataflow.dataflow_runner:dataflow_runner.py:236 2021-06-27T06:17:02.920Z: JOB_MESSAGE_BASIC: Executing operation check_even/Create/Impulse+check_even/Create/FlatMap(<lambda at core.py:2972>)+check_even/Create/Map(decode)+check_even/Group/pair_with_0+check_even/Group/Flatten/OutputIdentity+check_even/Group/GroupByKey/Write
INFO apache_beam.runners.dataflow.dataflow_runner:dataflow_runner.py:236 2021-06-27T06:17:38.131Z: JOB_MESSAGE_BASIC: Your project already contains 100 Dataflow-created metric descriptors, so new user metrics of the form custom.googleapis.com/* will not be created. However, all user metrics are also available in the metric dataflow.googleapis.com/job/user_counter. If you rely on the custom metrics, you can delete old / unused metric descriptors. See https://developers.google.com/apis-explorer/#p/monitoring/v3/monitoring.projects.metricDescriptors.list and https://developers.google.com/apis-explorer/#p/monitoring/v3/monitoring.projects.metricDescriptors.delete
INFO apache_beam.runners.dataflow.dataflow_runner:dataflow_runner.py:236 2021-06-27T06:17:48.565Z: JOB_MESSAGE_DETAILED: Autoscaling: Raised the number of workers to 1 based on the rate of progress in the currently running stage(s).
INFO apache_beam.runners.dataflow.dataflow_runner:dataflow_runner.py:236 2021-06-27T06:18:03.532Z: JOB_MESSAGE_DETAILED: Workers have started successfully.
INFO apache_beam.runners.dataflow.dataflow_runner:dataflow_runner.py:236 2021-06-27T06:18:03.567Z: JOB_MESSAGE_DETAILED: Workers have started successfully.
INFO oauth2client.transport:transport.py:185 Refreshing due to a 401 (attempt 1/2)
INFO apache_beam.runners.dataflow.dataflow_runner:dataflow_runner.py:236 2021-06-27T07:17:02.974Z: JOB_MESSAGE_ERROR: Workflow failed. Causes: The Dataflow job appears to be stuck because no worker activity has been seen in the last 1h. Please check the worker logs in Stackdriver Logging. You can also get help with Cloud Dataflow at https://cloud.google.com/dataflow/support.
INFO apache_beam.runners.dataflow.dataflow_runner:dataflow_runner.py:236 2021-06-27T07:17:03.226Z: JOB_MESSAGE_BASIC: Cancel request is committed for workflow job: 2021-06-26_23_16_53-17378079845190176977.
INFO apache_beam.runners.dataflow.dataflow_runner:dataflow_runner.py:236 2021-06-27T07:17:03.247Z: JOB_MESSAGE_BASIC: Finished operation check_odd/Create/Impulse+check_odd/Create/FlatMap(<lambda at core.py:2972>)+check_odd/Create/Map(decode)+check_odd/Group/pair_with_0+check_odd/Group/Flatten/OutputIdentity+check_odd/Group/GroupByKey/Write
INFO apache_beam.runners.dataflow.dataflow_runner:dataflow_runner.py:236 2021-06-27T07:17:03.247Z: JOB_MESSAGE_BASIC: Finished operation Create/Impulse+Create/FlatMap(<lambda at core.py:2972>)+Create/MaybeReshuffle/Reshuffle/AddRandomKeys+Create/MaybeReshuffle/Reshuffle/ReshufflePerKey/Map(reify_timestamps)+Create/MaybeReshuffle/Reshuffle/ReshufflePerKey/GroupByKey/Reify+Create/MaybeReshuffle/Reshuffle/ReshufflePerKey/GroupByKey/Write
INFO apache_beam.runners.dataflow.dataflow_runner:dataflow_runner.py:236 2021-06-27T07:17:03.247Z: JOB_MESSAGE_BASIC: Finished operation check_even/Create/Impulse+check_even/Create/FlatMap(<lambda at core.py:2972>)+check_even/Create/Map(decode)+check_even/Group/pair_with_0+check_even/Group/Flatten/OutputIdentity+check_even/Group/GroupByKey/Write
INFO apache_beam.runners.dataflow.dataflow_runner:dataflow_runner.py:236 2021-06-27T07:17:03.253Z: JOB_MESSAGE_ERROR: The Dataflow job appears to be stuck because no worker activity has been seen in the last 1h. Please check the worker logs in Stackdriver Logging. You can also get help with Cloud Dataflow at https://cloud.google.com/dataflow/support.
INFO apache_beam.runners.dataflow.dataflow_runner:dataflow_runner.py:236 2021-06-27T07:17:03.612Z: JOB_MESSAGE_DETAILED: Cleaning up.
INFO apache_beam.runners.dataflow.dataflow_runner:dataflow_runner.py:236 2021-06-27T07:17:03.678Z: JOB_MESSAGE_DEBUG: Starting worker pool teardown.
INFO apache_beam.runners.dataflow.dataflow_runner:dataflow_runner.py:236 2021-06-27T07:17:03.707Z: JOB_MESSAGE_BASIC: Stopping worker pool...
INFO apache_beam.runners.dataflow.dataflow_runner:dataflow_runner.py:236 2021-06-27T07:17:56.210Z: JOB_MESSAGE_DETAILED: Autoscaling: Resized worker pool from 1 to 0.
INFO apache_beam.runners.dataflow.dataflow_runner:dataflow_runner.py:236 2021-06-27T07:17:56.241Z: JOB_MESSAGE_BASIC: Worker pool stopped.
INFO apache_beam.runners.dataflow.dataflow_runner:dataflow_runner.py:236 2021-06-27T07:17:56.260Z: JOB_MESSAGE_DEBUG: Tearing down pending resources...
INFO apache_beam.runners.dataflow.dataflow_runner:dataflow_runner.py:191 Job 2021-06-26_23_16_53-17378079845190176977 is in state JOB_STATE_FAILED
=============================== warnings summary ===============================
apache_beam/io/filesystems_test.py:54
apache_beam/io/filesystems_test.py:54
<https://ci-beam.apache.org/job/beam_PostCommit_XVR_Dataflow/ws/src/sdks/python/apache_beam/io/filesystems_test.py>:54: DeprecationWarning: invalid escape sequence \c
self.assertIsNone(FileSystems.get_scheme('c:\\abc\cdf')) # pylint: disable=anomalous-backslash-in-string
apache_beam/io/filesystems_test.py:62
apache_beam/io/filesystems_test.py:62
<https://ci-beam.apache.org/job/beam_PostCommit_XVR_Dataflow/ws/src/sdks/python/apache_beam/io/filesystems_test.py>:62: DeprecationWarning: invalid escape sequence \d
self.assertTrue(isinstance(FileSystems.get_filesystem('c:\\abc\def'), # pylint: disable=anomalous-backslash-in-string
-- Docs: https://docs.pytest.org/en/latest/warnings.html
- generated xml file: <https://ci-beam.apache.org/job/beam_PostCommit_XVR_Dataflow/ws/src/sdks/python/pytest_xlangValidateRunner.xml> -
============== 7 failed, 1 passed, 4 warnings in 3713.25 seconds ===============
> Task :runners:google-cloud-dataflow-java:validatesCrossLanguageRunnerPythonUsingJava FAILED
> Task :runners:google-cloud-dataflow-java:validatesCrossLanguageRunnerCleanup
Stopping expansion service pid: 11661.
Stopping expansion service pid: 11664.
> Task :runners:google-cloud-dataflow-java:cleanUpDockerImages
Untagged: us.gcr.io/apache-beam-testing/java-postcommit-it/java:20210627060110
ERROR: (gcloud.container.images.delete) [us.gcr.io/apache-beam-testing/java-postcommit-it/java:20210627060110] is not a valid name. Expected tag in the form "base:tag" or "tag" or digest in the form "sha256:<digest>"
> Task :runners:google-cloud-dataflow-java:cleanUpDockerImages FAILED
FAILURE: Build completed with 2 failures.
1: Task failed with an exception.
-----------
* What went wrong:
Execution failed for task ':runners:google-cloud-dataflow-java:validatesCrossLanguageRunnerPythonUsingJava'.
> Process 'command 'sh'' finished with non-zero exit value 1
* Try:
Run with --stacktrace option to get the stack trace. Run with --info or --debug option to get more log output. Run with --scan to get full insights.
==============================================================================
2: Task failed with an exception.
-----------
* Where:
Build file '<https://ci-beam.apache.org/job/beam_PostCommit_XVR_Dataflow/ws/src/runners/google-cloud-dataflow-java/build.gradle'> line: 279
* What went wrong:
Execution failed for task ':runners:google-cloud-dataflow-java:cleanUpDockerImages'.
> Process 'command 'gcloud'' finished with non-zero exit value 1
* Try:
Run with --stacktrace option to get the stack trace. Run with --info or --debug option to get more log output. Run with --scan to get full insights.
==============================================================================
* Get more help at https://help.gradle.org
Deprecated Gradle features were used in this build, making it incompatible with Gradle 7.0.
Use '--warning-mode all' to show the individual deprecation warnings.
See https://docs.gradle.org/6.8.3/userguide/command_line_interface.html#sec:command_line_warnings
BUILD FAILED in 1h 17m 45s
113 actionable tasks: 84 executed, 25 from cache, 4 up-to-date
Publishing build scan...
https://gradle.com/s/kvjpoyothpksw
Build step 'Invoke Gradle script' changed build result to FAILURE
Build step 'Invoke Gradle script' marked build as failure
---------------------------------------------------------------------
To unsubscribe, e-mail: builds-unsubscribe@beam.apache.org
For additional commands, e-mail: builds-help@beam.apache.org
Jenkins build is back to normal : beam_PostCommit_XVR_Dataflow #881
Posted by Apache Jenkins Server <je...@builds.apache.org>.
See <https://ci-beam.apache.org/job/beam_PostCommit_XVR_Dataflow/881/display/redirect?page=changes>
---------------------------------------------------------------------
To unsubscribe, e-mail: builds-unsubscribe@beam.apache.org
For additional commands, e-mail: builds-help@beam.apache.org