You are viewing a plain text version of this content. The canonical link for it is here.
Posted to dev@kafka.apache.org by Apache Jenkins Server <je...@builds.apache.org> on 2017/10/19 14:47:51 UTC
Build failed in Jenkins: kafka-trunk-jdk9 #136
See <https://builds.apache.org/job/kafka-trunk-jdk9/136/display/redirect?page=changes>
Changes:
[damian.guy] KAFKA-6069: Properly tag KafkaStreams metrics with the client id.
------------------------------------------
[...truncated 1.02 MB...]
org.apache.kafka.clients.producer.MockProducerTest > shouldThrowOnSendIfProducerIsClosed STARTED
org.apache.kafka.clients.producer.MockProducerTest > shouldThrowOnSendIfProducerIsClosed PASSED
org.apache.kafka.clients.producer.MockProducerTest > shouldThrowOnCommitIfTransactionsNotInitialized STARTED
org.apache.kafka.clients.producer.MockProducerTest > shouldThrowOnCommitIfTransactionsNotInitialized PASSED
org.apache.kafka.clients.producer.MockProducerTest > shouldThrowOnBeginTransactionsIfProducerGotFenced STARTED
org.apache.kafka.clients.producer.MockProducerTest > shouldThrowOnBeginTransactionsIfProducerGotFenced PASSED
org.apache.kafka.clients.producer.MockProducerTest > shouldThrowOnAbortIfTransactionsNotInitialized STARTED
org.apache.kafka.clients.producer.MockProducerTest > shouldThrowOnAbortIfTransactionsNotInitialized PASSED
org.apache.kafka.clients.producer.MockProducerTest > shouldBeginTransactions STARTED
org.apache.kafka.clients.producer.MockProducerTest > shouldBeginTransactions PASSED
org.apache.kafka.clients.producer.MockProducerTest > shouldThrowOnSendOffsetsToTransactionIfTransactionsNotInitialized STARTED
org.apache.kafka.clients.producer.MockProducerTest > shouldThrowOnSendOffsetsToTransactionIfTransactionsNotInitialized PASSED
org.apache.kafka.clients.producer.MockProducerTest > shouldThrowOnCommitTransactionIfProducerGotFenced STARTED
org.apache.kafka.clients.producer.MockProducerTest > shouldThrowOnCommitTransactionIfProducerGotFenced PASSED
org.apache.kafka.clients.producer.MockProducerTest > shouldAbortEmptyTransaction STARTED
org.apache.kafka.clients.producer.MockProducerTest > shouldAbortEmptyTransaction PASSED
org.apache.kafka.clients.producer.MockProducerTest > shouldCommitEmptyTransaction STARTED
org.apache.kafka.clients.producer.MockProducerTest > shouldCommitEmptyTransaction PASSED
org.apache.kafka.clients.producer.MockProducerTest > shouldDropConsumerGroupOffsetsOnAbortIfTransactionsAreEnabled STARTED
org.apache.kafka.clients.producer.MockProducerTest > shouldDropConsumerGroupOffsetsOnAbortIfTransactionsAreEnabled PASSED
org.apache.kafka.clients.producer.RecordMetadataTest > testNullChecksum STARTED
org.apache.kafka.clients.producer.RecordMetadataTest > testNullChecksum PASSED
org.apache.kafka.clients.producer.RecordMetadataTest > testConstructionWithRelativeOffset STARTED
org.apache.kafka.clients.producer.RecordMetadataTest > testConstructionWithRelativeOffset PASSED
org.apache.kafka.clients.producer.RecordMetadataTest > testConstructionWithMissingRelativeOffset STARTED
org.apache.kafka.clients.producer.RecordMetadataTest > testConstructionWithMissingRelativeOffset PASSED
org.apache.kafka.clients.producer.RecordSendTest > testTimeout STARTED
org.apache.kafka.clients.producer.RecordSendTest > testTimeout PASSED
org.apache.kafka.clients.producer.RecordSendTest > testError STARTED
org.apache.kafka.clients.producer.RecordSendTest > testError PASSED
org.apache.kafka.clients.producer.RecordSendTest > testBlocking STARTED
org.apache.kafka.clients.producer.RecordSendTest > testBlocking PASSED
org.apache.kafka.clients.producer.KafkaProducerTest > closeShouldBeIdempotent STARTED
org.apache.kafka.clients.producer.KafkaProducerTest > closeShouldBeIdempotent PASSED
org.apache.kafka.clients.producer.KafkaProducerTest > testMetricConfigRecordingLevel STARTED
org.apache.kafka.clients.producer.KafkaProducerTest > testMetricConfigRecordingLevel PASSED
org.apache.kafka.clients.producer.KafkaProducerTest > testOsDefaultSocketBufferSizes STARTED
org.apache.kafka.clients.producer.KafkaProducerTest > testOsDefaultSocketBufferSizes PASSED
org.apache.kafka.clients.producer.KafkaProducerTest > testInvalidSocketSendBufferSize STARTED
org.apache.kafka.clients.producer.KafkaProducerTest > testInvalidSocketSendBufferSize PASSED
org.apache.kafka.clients.producer.KafkaProducerTest > testInvalidSocketReceiveBufferSize STARTED
org.apache.kafka.clients.producer.KafkaProducerTest > testInvalidSocketReceiveBufferSize PASSED
org.apache.kafka.clients.producer.KafkaProducerTest > testConstructorWithSerializers STARTED
org.apache.kafka.clients.producer.KafkaProducerTest > testConstructorWithSerializers PASSED
org.apache.kafka.clients.producer.KafkaProducerTest > testNoSerializerProvided STARTED
org.apache.kafka.clients.producer.KafkaProducerTest > testNoSerializerProvided PASSED
org.apache.kafka.clients.producer.KafkaProducerTest > testConstructorFailureCloseResource STARTED
org.apache.kafka.clients.producer.KafkaProducerTest > testConstructorFailureCloseResource PASSED
org.apache.kafka.clients.producer.KafkaProducerTest > testSerializerClose STARTED
org.apache.kafka.clients.producer.KafkaProducerTest > testSerializerClose PASSED
org.apache.kafka.clients.producer.KafkaProducerTest > testInterceptorConstructClose STARTED
org.apache.kafka.clients.producer.KafkaProducerTest > testInterceptorConstructClose PASSED
org.apache.kafka.clients.producer.KafkaProducerTest > testPartitionerClose STARTED
org.apache.kafka.clients.producer.KafkaProducerTest > testPartitionerClose PASSED
org.apache.kafka.clients.producer.KafkaProducerTest > testTopicRefreshInMetadata STARTED
org.apache.kafka.clients.producer.KafkaProducerTest > testTopicRefreshInMetadata PASSED
org.apache.kafka.clients.producer.KafkaProducerTest > testPartitionsForWithNullTopic STARTED
org.apache.kafka.clients.producer.KafkaProducerTest > testPartitionsForWithNullTopic PASSED
org.apache.kafka.clients.producer.KafkaProducerTest > testHeaders STARTED
org.apache.kafka.clients.producer.KafkaProducerTest > testHeaders PASSED
org.apache.kafka.clients.producer.KafkaProducerTest > testMetadataFetchOnStaleMetadata STARTED
org.apache.kafka.clients.producer.KafkaProducerTest > testMetadataFetchOnStaleMetadata PASSED
org.apache.kafka.clients.producer.KafkaProducerTest > testInterceptorPartitionSetOnTooLargeRecord STARTED
org.apache.kafka.clients.producer.KafkaProducerTest > testInterceptorPartitionSetOnTooLargeRecord PASSED
org.apache.kafka.clients.producer.KafkaProducerTest > testMetadataFetch STARTED
org.apache.kafka.clients.producer.KafkaProducerTest > testMetadataFetch PASSED
org.apache.kafka.clients.MetadataTest > testListenerCanUnregister STARTED
org.apache.kafka.clients.MetadataTest > testListenerCanUnregister PASSED
org.apache.kafka.clients.MetadataTest > testTopicExpiry STARTED
org.apache.kafka.clients.MetadataTest > testTopicExpiry PASSED
org.apache.kafka.clients.MetadataTest > testFailedUpdate STARTED
org.apache.kafka.clients.MetadataTest > testFailedUpdate PASSED
org.apache.kafka.clients.MetadataTest > testMetadataUpdateWaitTime STARTED
org.apache.kafka.clients.MetadataTest > testMetadataUpdateWaitTime PASSED
org.apache.kafka.clients.MetadataTest > testUpdateWithNeedMetadataForAllTopics STARTED
org.apache.kafka.clients.MetadataTest > testUpdateWithNeedMetadataForAllTopics PASSED
org.apache.kafka.clients.MetadataTest > testClusterListenerGetsNotifiedOfUpdate STARTED
org.apache.kafka.clients.MetadataTest > testClusterListenerGetsNotifiedOfUpdate PASSED
org.apache.kafka.clients.MetadataTest > testTimeToNextUpdate_RetryBackoff STARTED
org.apache.kafka.clients.MetadataTest > testTimeToNextUpdate_RetryBackoff PASSED
org.apache.kafka.clients.MetadataTest > testMetadata STARTED
org.apache.kafka.clients.MetadataTest > testMetadata PASSED
org.apache.kafka.clients.MetadataTest > testTimeToNextUpdate_OverwriteBackoff STARTED
org.apache.kafka.clients.MetadataTest > testTimeToNextUpdate_OverwriteBackoff PASSED
org.apache.kafka.clients.MetadataTest > testTimeToNextUpdate STARTED
org.apache.kafka.clients.MetadataTest > testTimeToNextUpdate PASSED
org.apache.kafka.clients.MetadataTest > testListenerGetsNotifiedOfUpdate STARTED
org.apache.kafka.clients.MetadataTest > testListenerGetsNotifiedOfUpdate PASSED
org.apache.kafka.clients.MetadataTest > testNonExpiringMetadata STARTED
org.apache.kafka.clients.MetadataTest > testNonExpiringMetadata PASSED
org.apache.kafka.clients.ClientUtilsTest > testOnlyBadHostname STARTED
org.apache.kafka.clients.ClientUtilsTest > testOnlyBadHostname PASSED
org.apache.kafka.clients.ClientUtilsTest > testParseAndValidateAddresses STARTED
org.apache.kafka.clients.ClientUtilsTest > testParseAndValidateAddresses PASSED
org.apache.kafka.clients.ClientUtilsTest > testNoPort STARTED
org.apache.kafka.clients.ClientUtilsTest > testNoPort PASSED
org.apache.kafka.clients.NodeApiVersionsTest > testLatestUsableVersionOutOfRangeHigh STARTED
org.apache.kafka.clients.NodeApiVersionsTest > testLatestUsableVersionOutOfRangeHigh PASSED
org.apache.kafka.clients.NodeApiVersionsTest > testLatestUsableVersion STARTED
org.apache.kafka.clients.NodeApiVersionsTest > testLatestUsableVersion PASSED
org.apache.kafka.clients.NodeApiVersionsTest > testUsableVersionCalculationNoKnownVersions STARTED
org.apache.kafka.clients.NodeApiVersionsTest > testUsableVersionCalculationNoKnownVersions PASSED
org.apache.kafka.clients.NodeApiVersionsTest > testVersionsToString STARTED
org.apache.kafka.clients.NodeApiVersionsTest > testVersionsToString PASSED
org.apache.kafka.clients.NodeApiVersionsTest > testUnsupportedVersionsToString STARTED
org.apache.kafka.clients.NodeApiVersionsTest > testUnsupportedVersionsToString PASSED
org.apache.kafka.clients.NodeApiVersionsTest > testLatestUsableVersionOutOfRangeLow STARTED
org.apache.kafka.clients.NodeApiVersionsTest > testLatestUsableVersionOutOfRangeLow PASSED
org.apache.kafka.clients.NodeApiVersionsTest > testLatestUsableVersionOutOfRange STARTED
org.apache.kafka.clients.NodeApiVersionsTest > testLatestUsableVersionOutOfRange PASSED
org.apache.kafka.clients.NodeApiVersionsTest > testUnknownApiVersionsToString STARTED
org.apache.kafka.clients.NodeApiVersionsTest > testUnknownApiVersionsToString PASSED
org.apache.kafka.clients.NodeApiVersionsTest > testUsableVersionLatestVersions STARTED
org.apache.kafka.clients.NodeApiVersionsTest > testUsableVersionLatestVersions PASSED
4003 tests completed, 1 failed, 1 skipped
:clients:test FAILED
FAILURE: Build failed with an exception.
* What went wrong:
Execution failed for task ':clients:test'.
> There were failing tests. See the report at: file://<https://builds.apache.org/job/kafka-trunk-jdk9/ws/clients/build/reports/tests/test/index.html>
* Try:
Run with --stacktrace option to get the stack trace. Run with --info or --debug option to get more log output.
* Get more help at https://help.gradle.org
BUILD FAILED in 2m 42s
22 actionable tasks: 21 executed, 1 up-to-date
Build step 'Execute shell' marked build as failure
Recording test results
Setting GRADLE_3_4_RC_2_HOME=/home/jenkins/jenkins-slave/tools/hudson.plugins.gradle.GradleInstallation/Gradle_3.4-rc-2
Setting GRADLE_3_4_RC_2_HOME=/home/jenkins/jenkins-slave/tools/hudson.plugins.gradle.GradleInstallation/Gradle_3.4-rc-2
Not sending mail to unregistered user damian.guy@gmail.com
Jenkins build is back to normal : kafka-trunk-jdk9 #138
Posted by Apache Jenkins Server <je...@builds.apache.org>.
See <https://builds.apache.org/job/kafka-trunk-jdk9/138/display/redirect?page=changes>
Build failed in Jenkins: kafka-trunk-jdk9 #137
Posted by Apache Jenkins Server <je...@builds.apache.org>.
See <https://builds.apache.org/job/kafka-trunk-jdk9/137/display/redirect?page=changes>
Changes:
[jason] MINOR: Fix var typo in verifiable_consumer assertion
------------------------------------------
[...truncated 1.41 MB...]
kafka.controller.PartitionStateMachineTest > testInvalidNonexistentPartitionToOfflinePartitionTransition STARTED
kafka.controller.PartitionStateMachineTest > testInvalidNonexistentPartitionToOfflinePartitionTransition PASSED
kafka.controller.PartitionStateMachineTest > testOnlinePartitionToOnlineTransition STARTED
kafka.controller.PartitionStateMachineTest > testOnlinePartitionToOnlineTransition PASSED
kafka.controller.PartitionStateMachineTest > testNewPartitionToOnlinePartitionTransitionZkUtilsExceptionFromCreateStates STARTED
kafka.controller.PartitionStateMachineTest > testNewPartitionToOnlinePartitionTransitionZkUtilsExceptionFromCreateStates PASSED
kafka.controller.PartitionStateMachineTest > testInvalidNewPartitionToNonexistentPartitionTransition STARTED
kafka.controller.PartitionStateMachineTest > testInvalidNewPartitionToNonexistentPartitionTransition PASSED
kafka.controller.PartitionStateMachineTest > testNewPartitionToOnlinePartitionTransition STARTED
kafka.controller.PartitionStateMachineTest > testNewPartitionToOnlinePartitionTransition PASSED
kafka.controller.PartitionStateMachineTest > testInvalidOnlinePartitionToNewPartitionTransition STARTED
kafka.controller.PartitionStateMachineTest > testInvalidOnlinePartitionToNewPartitionTransition PASSED
kafka.controller.PartitionStateMachineTest > testOfflinePartitionToOnlinePartitionTransitionErrorCodeFromStateLookup STARTED
kafka.controller.PartitionStateMachineTest > testOfflinePartitionToOnlinePartitionTransitionErrorCodeFromStateLookup PASSED
kafka.controller.PartitionStateMachineTest > testOnlinePartitionToOnlineTransitionForControlledShutdown STARTED
kafka.controller.PartitionStateMachineTest > testOnlinePartitionToOnlineTransitionForControlledShutdown PASSED
kafka.controller.PartitionStateMachineTest > testOfflinePartitionToOnlinePartitionTransitionZkUtilsExceptionFromStateLookup STARTED
kafka.controller.PartitionStateMachineTest > testOfflinePartitionToOnlinePartitionTransitionZkUtilsExceptionFromStateLookup PASSED
kafka.controller.PartitionStateMachineTest > testInvalidOnlinePartitionToNonexistentPartitionTransition STARTED
kafka.controller.PartitionStateMachineTest > testInvalidOnlinePartitionToNonexistentPartitionTransition PASSED
kafka.controller.PartitionStateMachineTest > testInvalidOfflinePartitionToNewPartitionTransition STARTED
kafka.controller.PartitionStateMachineTest > testInvalidOfflinePartitionToNewPartitionTransition PASSED
kafka.controller.PartitionStateMachineTest > testOfflinePartitionToOnlinePartitionTransition STARTED
kafka.controller.PartitionStateMachineTest > testOfflinePartitionToOnlinePartitionTransition PASSED
kafka.tools.ConsumerPerformanceTest > testDetailedHeaderMatchBody STARTED
kafka.tools.ConsumerPerformanceTest > testDetailedHeaderMatchBody PASSED
kafka.tools.ConsumerPerformanceTest > testNonDetailedHeaderMatchBody STARTED
kafka.tools.ConsumerPerformanceTest > testNonDetailedHeaderMatchBody PASSED
kafka.tools.MirrorMakerTest > testDefaultMirrorMakerMessageHandlerWithNoTimestampInSourceMessage STARTED
kafka.tools.MirrorMakerTest > testDefaultMirrorMakerMessageHandlerWithNoTimestampInSourceMessage PASSED
kafka.tools.MirrorMakerTest > testDefaultMirrorMakerMessageHandler STARTED
kafka.tools.MirrorMakerTest > testDefaultMirrorMakerMessageHandler PASSED
kafka.tools.MirrorMakerTest > testDefaultMirrorMakerMessageHandlerWithHeaders STARTED
kafka.tools.MirrorMakerTest > testDefaultMirrorMakerMessageHandlerWithHeaders PASSED
kafka.tools.MirrorMakerIntegrationTest > testCommaSeparatedRegex STARTED
kafka.tools.MirrorMakerIntegrationTest > testCommaSeparatedRegex PASSED
kafka.tools.ConsoleProducerTest > testParseKeyProp STARTED
kafka.tools.ConsoleProducerTest > testParseKeyProp PASSED
kafka.tools.ConsoleProducerTest > testValidConfigsOldProducer STARTED
kafka.tools.ConsoleProducerTest > testValidConfigsOldProducer PASSED
kafka.tools.ConsoleProducerTest > testInvalidConfigs STARTED
kafka.tools.ConsoleProducerTest > testInvalidConfigs PASSED
kafka.tools.ConsoleProducerTest > testValidConfigsNewProducer STARTED
kafka.tools.ConsoleProducerTest > testValidConfigsNewProducer PASSED
kafka.tools.ReplicaVerificationToolTest > testReplicaBufferVerifyChecksum STARTED
kafka.tools.ReplicaVerificationToolTest > testReplicaBufferVerifyChecksum PASSED
kafka.tools.ConsoleConsumerTest > shouldParseValidOldConsumerConfigWithAutoOffsetResetSmallest STARTED
kafka.tools.ConsoleConsumerTest > shouldParseValidOldConsumerConfigWithAutoOffsetResetSmallest PASSED
kafka.tools.ConsoleConsumerTest > shouldParseValidNewConsumerConfigWithNoOffsetReset STARTED
kafka.tools.ConsoleConsumerTest > shouldParseValidNewConsumerConfigWithNoOffsetReset PASSED
kafka.tools.ConsoleConsumerTest > shouldLimitReadsToMaxMessageLimit STARTED
kafka.tools.ConsoleConsumerTest > shouldLimitReadsToMaxMessageLimit PASSED
kafka.tools.ConsoleConsumerTest > shouldParseValidNewConsumerValidConfig STARTED
kafka.tools.ConsoleConsumerTest > shouldParseValidNewConsumerValidConfig PASSED
kafka.tools.ConsoleConsumerTest > shouldParseValidNewConsumerConfigWithAutoOffsetResetAndMatchingFromBeginning STARTED
kafka.tools.ConsoleConsumerTest > shouldParseValidNewConsumerConfigWithAutoOffsetResetAndMatchingFromBeginning PASSED
kafka.tools.ConsoleConsumerTest > shouldStopWhenOutputCheckErrorFails STARTED
kafka.tools.ConsoleConsumerTest > shouldStopWhenOutputCheckErrorFails PASSED
kafka.tools.ConsoleConsumerTest > shouldExitOnInvalidConfigWithAutoOffsetResetAndConflictingFromBeginningNewConsumer STARTED
kafka.tools.ConsoleConsumerTest > shouldExitOnInvalidConfigWithAutoOffsetResetAndConflictingFromBeginningNewConsumer PASSED
kafka.tools.ConsoleConsumerTest > shouldSetAutoResetToSmallestWhenFromBeginningConfigured STARTED
kafka.tools.ConsoleConsumerTest > shouldSetAutoResetToSmallestWhenFromBeginningConfigured PASSED
kafka.tools.ConsoleConsumerTest > shouldParseValidNewConsumerConfigWithAutoOffsetResetEarliest STARTED
kafka.tools.ConsoleConsumerTest > shouldParseValidNewConsumerConfigWithAutoOffsetResetEarliest PASSED
kafka.tools.ConsoleConsumerTest > shouldParseValidNewSimpleConsumerValidConfigWithStringOffset STARTED
kafka.tools.ConsoleConsumerTest > shouldParseValidNewSimpleConsumerValidConfigWithStringOffset PASSED
kafka.tools.ConsoleConsumerTest > shouldParseValidOldConsumerConfigWithAutoOffsetResetLargest STARTED
kafka.tools.ConsoleConsumerTest > shouldParseValidOldConsumerConfigWithAutoOffsetResetLargest PASSED
kafka.tools.ConsoleConsumerTest > shouldParseConfigsFromFile STARTED
kafka.tools.ConsoleConsumerTest > shouldParseConfigsFromFile PASSED
kafka.tools.ConsoleConsumerTest > groupIdsProvidedInDifferentPlacesMustMatch STARTED
kafka.tools.ConsoleConsumerTest > groupIdsProvidedInDifferentPlacesMustMatch PASSED
kafka.tools.ConsoleConsumerTest > shouldExitOnInvalidConfigWithAutoOffsetResetAndConflictingFromBeginningOldConsumer STARTED
kafka.tools.ConsoleConsumerTest > shouldExitOnInvalidConfigWithAutoOffsetResetAndConflictingFromBeginningOldConsumer PASSED
kafka.tools.ConsoleConsumerTest > shouldParseValidNewSimpleConsumerValidConfigWithNumericOffset STARTED
kafka.tools.ConsoleConsumerTest > shouldParseValidNewSimpleConsumerValidConfigWithNumericOffset PASSED
kafka.tools.ConsoleConsumerTest > testDefaultConsumer STARTED
kafka.tools.ConsoleConsumerTest > testDefaultConsumer PASSED
kafka.tools.ConsoleConsumerTest > shouldParseValidNewConsumerConfigWithAutoOffsetResetLatest STARTED
kafka.tools.ConsoleConsumerTest > shouldParseValidNewConsumerConfigWithAutoOffsetResetLatest PASSED
kafka.tools.ConsoleConsumerTest > shouldParseValidOldConsumerValidConfig STARTED
kafka.tools.ConsoleConsumerTest > shouldParseValidOldConsumerValidConfig PASSED
unit.kafka.server.KafkaApisTest > shouldRespondWithUnsupportedForMessageFormatOnHandleWriteTxnMarkersWhenMagicLowerThanRequired STARTED
unit.kafka.server.KafkaApisTest > shouldRespondWithUnsupportedForMessageFormatOnHandleWriteTxnMarkersWhenMagicLowerThanRequired PASSED
unit.kafka.server.KafkaApisTest > shouldThrowUnsupportedVersionExceptionOnHandleTxnOffsetCommitRequestWhenInterBrokerProtocolNotSupported STARTED
unit.kafka.server.KafkaApisTest > shouldThrowUnsupportedVersionExceptionOnHandleTxnOffsetCommitRequestWhenInterBrokerProtocolNotSupported PASSED
unit.kafka.server.KafkaApisTest > shouldThrowUnsupportedVersionExceptionOnHandleAddPartitionsToTxnRequestWhenInterBrokerProtocolNotSupported STARTED
unit.kafka.server.KafkaApisTest > shouldThrowUnsupportedVersionExceptionOnHandleAddPartitionsToTxnRequestWhenInterBrokerProtocolNotSupported PASSED
unit.kafka.server.KafkaApisTest > testReadUncommittedConsumerListOffsetLatest STARTED
unit.kafka.server.KafkaApisTest > testReadUncommittedConsumerListOffsetLatest PASSED
unit.kafka.server.KafkaApisTest > shouldAppendToLogOnWriteTxnMarkersWhenCorrectMagicVersion STARTED
unit.kafka.server.KafkaApisTest > shouldAppendToLogOnWriteTxnMarkersWhenCorrectMagicVersion PASSED
unit.kafka.server.KafkaApisTest > shouldThrowUnsupportedVersionExceptionOnHandleWriteTxnMarkersRequestWhenInterBrokerProtocolNotSupported STARTED
unit.kafka.server.KafkaApisTest > shouldThrowUnsupportedVersionExceptionOnHandleWriteTxnMarkersRequestWhenInterBrokerProtocolNotSupported PASSED
unit.kafka.server.KafkaApisTest > shouldRespondWithUnknownTopicWhenPartitionIsNotHosted STARTED
unit.kafka.server.KafkaApisTest > shouldRespondWithUnknownTopicWhenPartitionIsNotHosted PASSED
unit.kafka.server.KafkaApisTest > testReadCommittedConsumerListOffsetEarliestOffsetEqualsLastStableOffset STARTED
unit.kafka.server.KafkaApisTest > testReadCommittedConsumerListOffsetEarliestOffsetEqualsLastStableOffset PASSED
unit.kafka.server.KafkaApisTest > testReadCommittedConsumerListOffsetLatest STARTED
unit.kafka.server.KafkaApisTest > testReadCommittedConsumerListOffsetLatest PASSED
unit.kafka.server.KafkaApisTest > testReadCommittedConsumerListOffsetLimitedAtLastStableOffset STARTED
unit.kafka.server.KafkaApisTest > testReadCommittedConsumerListOffsetLimitedAtLastStableOffset PASSED
unit.kafka.server.KafkaApisTest > testReadUncommittedConsumerListOffsetEarliestOffsetEqualsHighWatermark STARTED
unit.kafka.server.KafkaApisTest > testReadUncommittedConsumerListOffsetEarliestOffsetEqualsHighWatermark PASSED
unit.kafka.server.KafkaApisTest > testReadUncommittedConsumerListOffsetLimitedAtHighWatermark STARTED
unit.kafka.server.KafkaApisTest > testReadUncommittedConsumerListOffsetLimitedAtHighWatermark PASSED
unit.kafka.server.KafkaApisTest > shouldThrowUnsupportedVersionExceptionOnHandleAddOffsetToTxnRequestWhenInterBrokerProtocolNotSupported STARTED
unit.kafka.server.KafkaApisTest > shouldThrowUnsupportedVersionExceptionOnHandleAddOffsetToTxnRequestWhenInterBrokerProtocolNotSupported PASSED
unit.kafka.server.KafkaApisTest > shouldRespondWithUnsupportedMessageFormatForBadPartitionAndNoErrorsForGoodPartition STARTED
unit.kafka.server.KafkaApisTest > shouldRespondWithUnsupportedMessageFormatForBadPartitionAndNoErrorsForGoodPartition PASSED
unit.kafka.server.KafkaApisTest > shouldThrowUnsupportedVersionExceptionOnHandleEndTxnRequestWhenInterBrokerProtocolNotSupported STARTED
unit.kafka.server.KafkaApisTest > shouldThrowUnsupportedVersionExceptionOnHandleEndTxnRequestWhenInterBrokerProtocolNotSupported PASSED
unit.kafka.server.KafkaApisTest > shouldRespondWithUnknownTopicOrPartitionForBadPartitionAndNoErrorsForGoodPartition STARTED
unit.kafka.server.KafkaApisTest > shouldRespondWithUnknownTopicOrPartitionForBadPartitionAndNoErrorsForGoodPartition PASSED
1689 tests completed, 1 failed, 4 skipped
:core:test FAILED
FAILURE: Build failed with an exception.
* What went wrong:
Execution failed for task ':core:test'.
> There were failing tests. See the report at: file://<https://builds.apache.org/job/kafka-trunk-jdk9/ws/core/build/reports/tests/test/index.html>
* Try:
Run with --stacktrace option to get the stack trace. Run with --info or --debug option to get more log output.
* Get more help at https://help.gradle.org
BUILD FAILED in 1h 9m 46s
29 actionable tasks: 28 executed, 1 up-to-date
Build step 'Execute shell' marked build as failure
Recording test results
Setting GRADLE_3_4_RC_2_HOME=/home/jenkins/jenkins-slave/tools/hudson.plugins.gradle.GradleInstallation/Gradle_3.4-rc-2
Setting GRADLE_3_4_RC_2_HOME=/home/jenkins/jenkins-slave/tools/hudson.plugins.gradle.GradleInstallation/Gradle_3.4-rc-2
Not sending mail to unregistered user damian.guy@gmail.com