You are viewing a plain text version of this content. The canonical link for it is here.
Posted to dev@lucene.apache.org by Apache Jenkins Server <je...@builds.apache.org> on 2015/09/08 21:35:06 UTC
[JENKINS] Lucene-Solr-Tests-trunk-Java8 - Build # 377 - Still
Failing
Build: https://builds.apache.org/job/Lucene-Solr-Tests-trunk-Java8/377/
1 tests failed.
REGRESSION: org.apache.solr.cloud.DistribCursorPagingTest.test
Error Message:
expected:<1264> but was:<902>
Stack Trace:
java.lang.AssertionError: expected:<1264> but was:<902>
at __randomizedtesting.SeedInfo.seed([3A0D3EFE9E0FFC60:B259012430F39198]:0)
at org.junit.Assert.fail(Assert.java:93)
at org.junit.Assert.failNotEquals(Assert.java:647)
at org.junit.Assert.assertEquals(Assert.java:128)
at org.junit.Assert.assertEquals(Assert.java:472)
at org.junit.Assert.assertEquals(Assert.java:456)
at org.apache.solr.cloud.DistribCursorPagingTest.doRandomSortsOnLargeIndex(DistribCursorPagingTest.java:599)
at org.apache.solr.cloud.DistribCursorPagingTest.test(DistribCursorPagingTest.java:93)
at sun.reflect.NativeMethodAccessorImpl.invoke0(Native Method)
at sun.reflect.NativeMethodAccessorImpl.invoke(NativeMethodAccessorImpl.java:62)
at sun.reflect.DelegatingMethodAccessorImpl.invoke(DelegatingMethodAccessorImpl.java:43)
at java.lang.reflect.Method.invoke(Method.java:497)
at com.carrotsearch.randomizedtesting.RandomizedRunner.invoke(RandomizedRunner.java:1627)
at com.carrotsearch.randomizedtesting.RandomizedRunner$6.evaluate(RandomizedRunner.java:836)
at com.carrotsearch.randomizedtesting.RandomizedRunner$7.evaluate(RandomizedRunner.java:872)
at com.carrotsearch.randomizedtesting.RandomizedRunner$8.evaluate(RandomizedRunner.java:886)
at org.apache.solr.BaseDistributedSearchTestCase$ShardsRepeatRule$ShardsFixedStatement.callStatement(BaseDistributedSearchTestCase.java:963)
at org.apache.solr.BaseDistributedSearchTestCase$ShardsRepeatRule$ShardsStatement.evaluate(BaseDistributedSearchTestCase.java:938)
at com.carrotsearch.randomizedtesting.rules.SystemPropertiesRestoreRule$1.evaluate(SystemPropertiesRestoreRule.java:57)
at org.apache.lucene.util.TestRuleSetupTeardownChained$1.evaluate(TestRuleSetupTeardownChained.java:50)
at org.apache.lucene.util.AbstractBeforeAfterRule$1.evaluate(AbstractBeforeAfterRule.java:46)
at org.apache.lucene.util.TestRuleThreadAndTestName$1.evaluate(TestRuleThreadAndTestName.java:49)
at org.apache.lucene.util.TestRuleIgnoreAfterMaxFailures$1.evaluate(TestRuleIgnoreAfterMaxFailures.java:65)
at org.apache.lucene.util.TestRuleMarkFailure$1.evaluate(TestRuleMarkFailure.java:48)
at com.carrotsearch.randomizedtesting.rules.StatementAdapter.evaluate(StatementAdapter.java:36)
at com.carrotsearch.randomizedtesting.ThreadLeakControl$StatementRunner.run(ThreadLeakControl.java:365)
at com.carrotsearch.randomizedtesting.ThreadLeakControl.forkTimeoutingTask(ThreadLeakControl.java:798)
at com.carrotsearch.randomizedtesting.ThreadLeakControl$3.evaluate(ThreadLeakControl.java:458)
at com.carrotsearch.randomizedtesting.RandomizedRunner.runSingleTest(RandomizedRunner.java:845)
at com.carrotsearch.randomizedtesting.RandomizedRunner$3.evaluate(RandomizedRunner.java:747)
at com.carrotsearch.randomizedtesting.RandomizedRunner$4.evaluate(RandomizedRunner.java:781)
at com.carrotsearch.randomizedtesting.RandomizedRunner$5.evaluate(RandomizedRunner.java:792)
at com.carrotsearch.randomizedtesting.rules.StatementAdapter.evaluate(StatementAdapter.java:36)
at com.carrotsearch.randomizedtesting.rules.SystemPropertiesRestoreRule$1.evaluate(SystemPropertiesRestoreRule.java:57)
at org.apache.lucene.util.AbstractBeforeAfterRule$1.evaluate(AbstractBeforeAfterRule.java:46)
at com.carrotsearch.randomizedtesting.rules.StatementAdapter.evaluate(StatementAdapter.java:36)
at org.apache.lucene.util.TestRuleStoreClassName$1.evaluate(TestRuleStoreClassName.java:42)
at com.carrotsearch.randomizedtesting.rules.NoShadowingOrOverridesOnMethodsRule$1.evaluate(NoShadowingOrOverridesOnMethodsRule.java:39)
at com.carrotsearch.randomizedtesting.rules.NoShadowingOrOverridesOnMethodsRule$1.evaluate(NoShadowingOrOverridesOnMethodsRule.java:39)
at com.carrotsearch.randomizedtesting.rules.StatementAdapter.evaluate(StatementAdapter.java:36)
at com.carrotsearch.randomizedtesting.rules.StatementAdapter.evaluate(StatementAdapter.java:36)
at com.carrotsearch.randomizedtesting.rules.StatementAdapter.evaluate(StatementAdapter.java:36)
at org.apache.lucene.util.TestRuleAssertionsRequired$1.evaluate(TestRuleAssertionsRequired.java:54)
at org.apache.lucene.util.TestRuleMarkFailure$1.evaluate(TestRuleMarkFailure.java:48)
at org.apache.lucene.util.TestRuleIgnoreAfterMaxFailures$1.evaluate(TestRuleIgnoreAfterMaxFailures.java:65)
at org.apache.lucene.util.TestRuleIgnoreTestSuites$1.evaluate(TestRuleIgnoreTestSuites.java:55)
at com.carrotsearch.randomizedtesting.rules.StatementAdapter.evaluate(StatementAdapter.java:36)
at com.carrotsearch.randomizedtesting.ThreadLeakControl$StatementRunner.run(ThreadLeakControl.java:365)
at java.lang.Thread.run(Thread.java:745)
Build Log:
[...truncated 9278 lines...]
[junit4] Suite: org.apache.solr.cloud.DistribCursorPagingTest
[junit4] 2> Creating dataDir: /x1/jenkins/jenkins-slave/workspace/Lucene-Solr-Tests-trunk-Java8/solr/build/solr-core/test/J1/temp/solr.cloud.DistribCursorPagingTest_3A0D3EFE9E0FFC60-001/init-core-data-001
[junit4] 2> 113563 INFO (SUITE-DistribCursorPagingTest-seed#[3A0D3EFE9E0FFC60]-worker) [ ] o.a.s.SolrTestCaseJ4 Randomized ssl (true) and clientAuth (false)
[junit4] 2> 113563 INFO (SUITE-DistribCursorPagingTest-seed#[3A0D3EFE9E0FFC60]-worker) [ ] o.a.s.BaseDistributedSearchTestCase Setting hostContext system property: /
[junit4] 2> 113571 INFO (TEST-DistribCursorPagingTest.test-seed#[3A0D3EFE9E0FFC60]) [ ] o.a.s.c.ZkTestServer STARTING ZK TEST SERVER
[junit4] 2> 113572 INFO (Thread-331) [ ] o.a.s.c.ZkTestServer client port:0.0.0.0/0.0.0.0:0
[junit4] 2> 113572 INFO (Thread-331) [ ] o.a.s.c.ZkTestServer Starting server
[junit4] 2> 113672 INFO (TEST-DistribCursorPagingTest.test-seed#[3A0D3EFE9E0FFC60]) [ ] o.a.s.c.ZkTestServer start zk server on port:50512
[junit4] 2> 113673 INFO (TEST-DistribCursorPagingTest.test-seed#[3A0D3EFE9E0FFC60]) [ ] o.a.s.c.c.SolrZkClient Using default ZkCredentialsProvider
[junit4] 2> 113678 INFO (TEST-DistribCursorPagingTest.test-seed#[3A0D3EFE9E0FFC60]) [ ] o.a.s.c.c.ConnectionManager Waiting for client to connect to ZooKeeper
[junit4] 2> 113685 INFO (zkCallback-45-thread-1) [ ] o.a.s.c.c.ConnectionManager Watcher org.apache.solr.common.cloud.ConnectionManager@552529a8 name:ZooKeeperConnection Watcher:127.0.0.1:50512 got event WatchedEvent state:SyncConnected type:None path:null path:null type:None
[junit4] 2> 113685 INFO (TEST-DistribCursorPagingTest.test-seed#[3A0D3EFE9E0FFC60]) [ ] o.a.s.c.c.ConnectionManager Client is connected to ZooKeeper
[junit4] 2> 113686 INFO (TEST-DistribCursorPagingTest.test-seed#[3A0D3EFE9E0FFC60]) [ ] o.a.s.c.c.SolrZkClient Using default ZkACLProvider
[junit4] 2> 113686 INFO (TEST-DistribCursorPagingTest.test-seed#[3A0D3EFE9E0FFC60]) [ ] o.a.s.c.c.SolrZkClient makePath: /solr
[junit4] 2> 113690 INFO (TEST-DistribCursorPagingTest.test-seed#[3A0D3EFE9E0FFC60]) [ ] o.a.s.c.c.SolrZkClient Using default ZkCredentialsProvider
[junit4] 2> 113698 INFO (TEST-DistribCursorPagingTest.test-seed#[3A0D3EFE9E0FFC60]) [ ] o.a.s.c.c.ConnectionManager Waiting for client to connect to ZooKeeper
[junit4] 2> 113714 INFO (zkCallback-46-thread-1) [ ] o.a.s.c.c.ConnectionManager Watcher org.apache.solr.common.cloud.ConnectionManager@11c88a6a name:ZooKeeperConnection Watcher:127.0.0.1:50512/solr got event WatchedEvent state:SyncConnected type:None path:null path:null type:None
[junit4] 2> 113715 INFO (TEST-DistribCursorPagingTest.test-seed#[3A0D3EFE9E0FFC60]) [ ] o.a.s.c.c.ConnectionManager Client is connected to ZooKeeper
[junit4] 2> 113715 INFO (TEST-DistribCursorPagingTest.test-seed#[3A0D3EFE9E0FFC60]) [ ] o.a.s.c.c.SolrZkClient Using default ZkACLProvider
[junit4] 2> 113715 INFO (TEST-DistribCursorPagingTest.test-seed#[3A0D3EFE9E0FFC60]) [ ] o.a.s.c.c.SolrZkClient makePath: /collections/collection1
[junit4] 2> 113719 INFO (TEST-DistribCursorPagingTest.test-seed#[3A0D3EFE9E0FFC60]) [ ] o.a.s.c.c.SolrZkClient makePath: /collections/collection1/shards
[junit4] 2> 113721 INFO (TEST-DistribCursorPagingTest.test-seed#[3A0D3EFE9E0FFC60]) [ ] o.a.s.c.c.SolrZkClient makePath: /collections/control_collection
[junit4] 2> 113723 INFO (TEST-DistribCursorPagingTest.test-seed#[3A0D3EFE9E0FFC60]) [ ] o.a.s.c.c.SolrZkClient makePath: /collections/control_collection/shards
[junit4] 2> 113726 INFO (TEST-DistribCursorPagingTest.test-seed#[3A0D3EFE9E0FFC60]) [ ] o.a.s.c.AbstractZkTestCase put /x1/jenkins/jenkins-slave/workspace/Lucene-Solr-Tests-trunk-Java8/solr/core/src/test-files/solr/collection1/conf/solrconfig-deeppaging.xml to /configs/conf1/solrconfig.xml
[junit4] 2> 113730 INFO (TEST-DistribCursorPagingTest.test-seed#[3A0D3EFE9E0FFC60]) [ ] o.a.s.c.c.SolrZkClient makePath: /configs/conf1/solrconfig.xml
[junit4] 2> 113735 INFO (TEST-DistribCursorPagingTest.test-seed#[3A0D3EFE9E0FFC60]) [ ] o.a.s.c.AbstractZkTestCase put /x1/jenkins/jenkins-slave/workspace/Lucene-Solr-Tests-trunk-Java8/solr/core/src/test-files/solr/collection1/conf/schema-sorts.xml to /configs/conf1/schema.xml
[junit4] 2> 113735 INFO (TEST-DistribCursorPagingTest.test-seed#[3A0D3EFE9E0FFC60]) [ ] o.a.s.c.c.SolrZkClient makePath: /configs/conf1/schema.xml
[junit4] 2> 113738 INFO (TEST-DistribCursorPagingTest.test-seed#[3A0D3EFE9E0FFC60]) [ ] o.a.s.c.AbstractZkTestCase put /x1/jenkins/jenkins-slave/workspace/Lucene-Solr-Tests-trunk-Java8/solr/core/src/test-files/solr/collection1/conf/solrconfig.snippet.randomindexconfig.xml to /configs/conf1/solrconfig.snippet.randomindexconfig.xml
[junit4] 2> 113738 INFO (TEST-DistribCursorPagingTest.test-seed#[3A0D3EFE9E0FFC60]) [ ] o.a.s.c.c.SolrZkClient makePath: /configs/conf1/solrconfig.snippet.randomindexconfig.xml
[junit4] 2> 113742 INFO (TEST-DistribCursorPagingTest.test-seed#[3A0D3EFE9E0FFC60]) [ ] o.a.s.c.AbstractZkTestCase put /x1/jenkins/jenkins-slave/workspace/Lucene-Solr-Tests-trunk-Java8/solr/core/src/test-files/solr/collection1/conf/stopwords.txt to /configs/conf1/stopwords.txt
[junit4] 2> 113742 INFO (TEST-DistribCursorPagingTest.test-seed#[3A0D3EFE9E0FFC60]) [ ] o.a.s.c.c.SolrZkClient makePath: /configs/conf1/stopwords.txt
[junit4] 2> 113745 INFO (TEST-DistribCursorPagingTest.test-seed#[3A0D3EFE9E0FFC60]) [ ] o.a.s.c.AbstractZkTestCase put /x1/jenkins/jenkins-slave/workspace/Lucene-Solr-Tests-trunk-Java8/solr/core/src/test-files/solr/collection1/conf/protwords.txt to /configs/conf1/protwords.txt
[junit4] 2> 113745 INFO (TEST-DistribCursorPagingTest.test-seed#[3A0D3EFE9E0FFC60]) [ ] o.a.s.c.c.SolrZkClient makePath: /configs/conf1/protwords.txt
[junit4] 2> 113752 INFO (TEST-DistribCursorPagingTest.test-seed#[3A0D3EFE9E0FFC60]) [ ] o.a.s.c.AbstractZkTestCase put /x1/jenkins/jenkins-slave/workspace/Lucene-Solr-Tests-trunk-Java8/solr/core/src/test-files/solr/collection1/conf/currency.xml to /configs/conf1/currency.xml
[junit4] 2> 113753 INFO (TEST-DistribCursorPagingTest.test-seed#[3A0D3EFE9E0FFC60]) [ ] o.a.s.c.c.SolrZkClient makePath: /configs/conf1/currency.xml
[junit4] 2> 113756 INFO (TEST-DistribCursorPagingTest.test-seed#[3A0D3EFE9E0FFC60]) [ ] o.a.s.c.AbstractZkTestCase put /x1/jenkins/jenkins-slave/workspace/Lucene-Solr-Tests-trunk-Java8/solr/core/src/test-files/solr/collection1/conf/enumsConfig.xml to /configs/conf1/enumsConfig.xml
[junit4] 2> 113756 INFO (TEST-DistribCursorPagingTest.test-seed#[3A0D3EFE9E0FFC60]) [ ] o.a.s.c.c.SolrZkClient makePath: /configs/conf1/enumsConfig.xml
[junit4] 2> 113760 INFO (TEST-DistribCursorPagingTest.test-seed#[3A0D3EFE9E0FFC60]) [ ] o.a.s.c.AbstractZkTestCase put /x1/jenkins/jenkins-slave/workspace/Lucene-Solr-Tests-trunk-Java8/solr/core/src/test-files/solr/collection1/conf/open-exchange-rates.json to /configs/conf1/open-exchange-rates.json
[junit4] 2> 113761 INFO (TEST-DistribCursorPagingTest.test-seed#[3A0D3EFE9E0FFC60]) [ ] o.a.s.c.c.SolrZkClient makePath: /configs/conf1/open-exchange-rates.json
[junit4] 2> 113767 INFO (TEST-DistribCursorPagingTest.test-seed#[3A0D3EFE9E0FFC60]) [ ] o.a.s.c.AbstractZkTestCase put /x1/jenkins/jenkins-slave/workspace/Lucene-Solr-Tests-trunk-Java8/solr/core/src/test-files/solr/collection1/conf/mapping-ISOLatin1Accent.txt to /configs/conf1/mapping-ISOLatin1Accent.txt
[junit4] 2> 113767 INFO (TEST-DistribCursorPagingTest.test-seed#[3A0D3EFE9E0FFC60]) [ ] o.a.s.c.c.SolrZkClient makePath: /configs/conf1/mapping-ISOLatin1Accent.txt
[junit4] 2> 113771 INFO (TEST-DistribCursorPagingTest.test-seed#[3A0D3EFE9E0FFC60]) [ ] o.a.s.c.AbstractZkTestCase put /x1/jenkins/jenkins-slave/workspace/Lucene-Solr-Tests-trunk-Java8/solr/core/src/test-files/solr/collection1/conf/old_synonyms.txt to /configs/conf1/old_synonyms.txt
[junit4] 2> 113772 INFO (TEST-DistribCursorPagingTest.test-seed#[3A0D3EFE9E0FFC60]) [ ] o.a.s.c.c.SolrZkClient makePath: /configs/conf1/old_synonyms.txt
[junit4] 2> 113777 INFO (TEST-DistribCursorPagingTest.test-seed#[3A0D3EFE9E0FFC60]) [ ] o.a.s.c.AbstractZkTestCase put /x1/jenkins/jenkins-slave/workspace/Lucene-Solr-Tests-trunk-Java8/solr/core/src/test-files/solr/collection1/conf/synonyms.txt to /configs/conf1/synonyms.txt
[junit4] 2> 113777 INFO (TEST-DistribCursorPagingTest.test-seed#[3A0D3EFE9E0FFC60]) [ ] o.a.s.c.c.SolrZkClient makePath: /configs/conf1/synonyms.txt
[junit4] 2> 113792 WARN (NIOServerCxn.Factory:0.0.0.0/0.0.0.0:0) [ ] o.a.z.s.NIOServerCnxn caught end of stream exception
[junit4] 2> EndOfStreamException: Unable to read additional data from client sessionid 0x14fae56242e0001, likely client has closed socket
[junit4] 2> at org.apache.zookeeper.server.NIOServerCnxn.doIO(NIOServerCnxn.java:228)
[junit4] 2> at org.apache.zookeeper.server.NIOServerCnxnFactory.run(NIOServerCnxnFactory.java:208)
[junit4] 2> at java.lang.Thread.run(Thread.java:745)
[junit4] 2> 113793 INFO (TEST-DistribCursorPagingTest.test-seed#[3A0D3EFE9E0FFC60]) [ ] o.a.s.c.c.SolrZkClient Using default ZkCredentialsProvider
[junit4] 2> 113798 INFO (TEST-DistribCursorPagingTest.test-seed#[3A0D3EFE9E0FFC60]) [ ] o.a.s.c.c.ConnectionManager Waiting for client to connect to ZooKeeper
[junit4] 2> 113802 INFO (zkCallback-47-thread-1) [ ] o.a.s.c.c.ConnectionManager Watcher org.apache.solr.common.cloud.ConnectionManager@12c76c9e name:ZooKeeperConnection Watcher:127.0.0.1:50512/solr got event WatchedEvent state:SyncConnected type:None path:null path:null type:None
[junit4] 2> 113802 INFO (TEST-DistribCursorPagingTest.test-seed#[3A0D3EFE9E0FFC60]) [ ] o.a.s.c.c.ConnectionManager Client is connected to ZooKeeper
[junit4] 2> 113803 INFO (TEST-DistribCursorPagingTest.test-seed#[3A0D3EFE9E0FFC60]) [ ] o.a.s.c.c.SolrZkClient Using default ZkACLProvider
[junit4] 2> 114133 INFO (TEST-DistribCursorPagingTest.test-seed#[3A0D3EFE9E0FFC60]) [ ] o.a.s.SolrTestCaseJ4 Writing core.properties file to /x1/jenkins/jenkins-slave/workspace/Lucene-Solr-Tests-trunk-Java8/solr/build/solr-core/test/J1/temp/solr.cloud.DistribCursorPagingTest_3A0D3EFE9E0FFC60-001/control-001/cores/collection1
[junit4] 2> 114135 INFO (TEST-DistribCursorPagingTest.test-seed#[3A0D3EFE9E0FFC60]) [ ] o.e.j.s.Server jetty-9.2.13.v20150730
[junit4] 2> 114137 INFO (TEST-DistribCursorPagingTest.test-seed#[3A0D3EFE9E0FFC60]) [ ] o.e.j.s.h.ContextHandler Started o.e.j.s.ServletContextHandler@3234ce04{/,null,AVAILABLE}
[junit4] 2> 114144 INFO (TEST-DistribCursorPagingTest.test-seed#[3A0D3EFE9E0FFC60]) [ ] o.e.j.s.ServerConnector Started ServerConnector@21dc1848{SSL-http/1.1}{127.0.0.1:40482}
[junit4] 2> 114144 INFO (TEST-DistribCursorPagingTest.test-seed#[3A0D3EFE9E0FFC60]) [ ] o.e.j.s.Server Started @117936ms
[junit4] 2> 114145 INFO (TEST-DistribCursorPagingTest.test-seed#[3A0D3EFE9E0FFC60]) [ ] o.a.s.c.s.e.JettySolrRunner Jetty properties: {solr.data.dir=/x1/jenkins/jenkins-slave/workspace/Lucene-Solr-Tests-trunk-Java8/solr/build/solr-core/test/J1/temp/solr.cloud.DistribCursorPagingTest_3A0D3EFE9E0FFC60-001/tempDir-001/control/data, hostContext=/, hostPort=40482, coreRootDirectory=/x1/jenkins/jenkins-slave/workspace/Lucene-Solr-Tests-trunk-Java8/solr/build/solr-core/test/J1/temp/solr.cloud.DistribCursorPagingTest_3A0D3EFE9E0FFC60-001/control-001/cores}
[junit4] 2> 114145 INFO (TEST-DistribCursorPagingTest.test-seed#[3A0D3EFE9E0FFC60]) [ ] o.a.s.s.SolrDispatchFilter SolrDispatchFilter.init(): sun.misc.Launcher$AppClassLoader@4e0e2f2a
[junit4] 2> 114145 INFO (TEST-DistribCursorPagingTest.test-seed#[3A0D3EFE9E0FFC60]) [ ] o.a.s.c.SolrResourceLoader new SolrResourceLoader for directory: '/x1/jenkins/jenkins-slave/workspace/Lucene-Solr-Tests-trunk-Java8/solr/build/solr-core/test/J1/temp/solr.cloud.DistribCursorPagingTest_3A0D3EFE9E0FFC60-001/control-001/'
[junit4] 2> 114160 INFO (TEST-DistribCursorPagingTest.test-seed#[3A0D3EFE9E0FFC60]) [ ] o.a.s.c.c.SolrZkClient Using default ZkCredentialsProvider
[junit4] 2> 114183 INFO (TEST-DistribCursorPagingTest.test-seed#[3A0D3EFE9E0FFC60]) [ ] o.a.s.c.c.ConnectionManager Waiting for client to connect to ZooKeeper
[junit4] 2> 114192 INFO (zkCallback-48-thread-1) [ ] o.a.s.c.c.ConnectionManager Watcher org.apache.solr.common.cloud.ConnectionManager@72c5c94f name:ZooKeeperConnection Watcher:127.0.0.1:50512/solr got event WatchedEvent state:SyncConnected type:None path:null path:null type:None
[junit4] 2> 114193 INFO (TEST-DistribCursorPagingTest.test-seed#[3A0D3EFE9E0FFC60]) [ ] o.a.s.c.c.ConnectionManager Client is connected to ZooKeeper
[junit4] 2> 114193 INFO (TEST-DistribCursorPagingTest.test-seed#[3A0D3EFE9E0FFC60]) [ ] o.a.s.c.c.SolrZkClient Using default ZkACLProvider
[junit4] 2> 114201 INFO (TEST-DistribCursorPagingTest.test-seed#[3A0D3EFE9E0FFC60]) [ ] o.a.s.s.SolrDispatchFilter Loading solr.xml from SolrHome (not found in ZooKeeper)
[junit4] 2> 114201 INFO (TEST-DistribCursorPagingTest.test-seed#[3A0D3EFE9E0FFC60]) [ ] o.a.s.c.SolrXmlConfig Loading container configuration from /x1/jenkins/jenkins-slave/workspace/Lucene-Solr-Tests-trunk-Java8/solr/build/solr-core/test/J1/temp/solr.cloud.DistribCursorPagingTest_3A0D3EFE9E0FFC60-001/control-001/solr.xml
[junit4] 2> 114207 INFO (TEST-DistribCursorPagingTest.test-seed#[3A0D3EFE9E0FFC60]) [ ] o.a.s.c.CoresLocator Config-defined core root directory: /x1/jenkins/jenkins-slave/workspace/Lucene-Solr-Tests-trunk-Java8/solr/build/solr-core/test/J1/temp/solr.cloud.DistribCursorPagingTest_3A0D3EFE9E0FFC60-001/control-001/cores
[junit4] 2> 114207 INFO (TEST-DistribCursorPagingTest.test-seed#[3A0D3EFE9E0FFC60]) [ ] o.a.s.c.CoreContainer New CoreContainer 842051111
[junit4] 2> 114207 INFO (TEST-DistribCursorPagingTest.test-seed#[3A0D3EFE9E0FFC60]) [ ] o.a.s.c.CoreContainer Loading cores into CoreContainer [instanceDir=/x1/jenkins/jenkins-slave/workspace/Lucene-Solr-Tests-trunk-Java8/solr/build/solr-core/test/J1/temp/solr.cloud.DistribCursorPagingTest_3A0D3EFE9E0FFC60-001/control-001/]
[junit4] 2> 114207 INFO (TEST-DistribCursorPagingTest.test-seed#[3A0D3EFE9E0FFC60]) [ ] o.a.s.c.CoreContainer loading shared library: /x1/jenkins/jenkins-slave/workspace/Lucene-Solr-Tests-trunk-Java8/solr/build/solr-core/test/J1/temp/solr.cloud.DistribCursorPagingTest_3A0D3EFE9E0FFC60-001/control-001/lib
[junit4] 2> 114207 WARN (TEST-DistribCursorPagingTest.test-seed#[3A0D3EFE9E0FFC60]) [ ] o.a.s.c.SolrResourceLoader Can't find (or read) directory to add to classloader: lib (resolved as: /x1/jenkins/jenkins-slave/workspace/Lucene-Solr-Tests-trunk-Java8/solr/build/solr-core/test/J1/temp/solr.cloud.DistribCursorPagingTest_3A0D3EFE9E0FFC60-001/control-001/lib).
[junit4] 2> 114219 INFO (TEST-DistribCursorPagingTest.test-seed#[3A0D3EFE9E0FFC60]) [ ] o.a.s.h.c.HttpShardHandlerFactory created with socketTimeout : 90000,urlScheme : ,connTimeout : 15000,maxConnectionsPerHost : 20,maxConnections : 10000,corePoolSize : 0,maximumPoolSize : 2147483647,maxThreadIdleTime : 5,sizeOfQueue : -1,fairnessPolicy : false,useRetries : false,
[junit4] 2> 114221 INFO (TEST-DistribCursorPagingTest.test-seed#[3A0D3EFE9E0FFC60]) [ ] o.a.s.u.UpdateShardHandler Creating UpdateShardHandler HTTP client with params: socketTimeout=340000&connTimeout=45000&retry=true
[junit4] 2> 114227 INFO (TEST-DistribCursorPagingTest.test-seed#[3A0D3EFE9E0FFC60]) [ ] o.a.s.l.LogWatcher SLF4J impl is org.slf4j.impl.Log4jLoggerFactory
[junit4] 2> 114227 INFO (TEST-DistribCursorPagingTest.test-seed#[3A0D3EFE9E0FFC60]) [ ] o.a.s.l.LogWatcher Registering Log Listener [Log4j (org.slf4j.impl.Log4jLoggerFactory)]
[junit4] 2> 114228 INFO (TEST-DistribCursorPagingTest.test-seed#[3A0D3EFE9E0FFC60]) [ ] o.a.s.c.ZkContainer Zookeeper client=127.0.0.1:50512/solr
[junit4] 2> 114244 INFO (TEST-DistribCursorPagingTest.test-seed#[3A0D3EFE9E0FFC60]) [ ] o.a.s.c.ZkController zkHost includes chroot
[junit4] 2> 114244 INFO (TEST-DistribCursorPagingTest.test-seed#[3A0D3EFE9E0FFC60]) [ ] o.a.s.c.c.SolrZkClient Using default ZkCredentialsProvider
[junit4] 2> 114250 INFO (TEST-DistribCursorPagingTest.test-seed#[3A0D3EFE9E0FFC60]) [ ] o.a.s.c.c.ConnectionManager Waiting for client to connect to ZooKeeper
[junit4] 2> 114253 INFO (zkCallback-50-thread-1) [ ] o.a.s.c.c.ConnectionManager Watcher org.apache.solr.common.cloud.ConnectionManager@30cc6d1e name:ZooKeeperConnection Watcher:127.0.0.1:50512 got event WatchedEvent state:SyncConnected type:None path:null path:null type:None
[junit4] 2> 114254 INFO (TEST-DistribCursorPagingTest.test-seed#[3A0D3EFE9E0FFC60]) [ ] o.a.s.c.c.ConnectionManager Client is connected to ZooKeeper
[junit4] 2> 114254 INFO (TEST-DistribCursorPagingTest.test-seed#[3A0D3EFE9E0FFC60]) [ ] o.a.s.c.c.SolrZkClient Using default ZkACLProvider
[junit4] 2> 114265 INFO (TEST-DistribCursorPagingTest.test-seed#[3A0D3EFE9E0FFC60]) [n:127.0.0.1:40482_ ] o.a.s.c.c.ConnectionManager Waiting for client to connect to ZooKeeper
[junit4] 2> 114276 INFO (zkCallback-51-thread-1-processing-n:127.0.0.1:40482_) [n:127.0.0.1:40482_ ] o.a.s.c.c.ConnectionManager Watcher org.apache.solr.common.cloud.ConnectionManager@34af715b name:ZooKeeperConnection Watcher:127.0.0.1:50512/solr got event WatchedEvent state:SyncConnected type:None path:null path:null type:None
[junit4] 2> 114276 INFO (TEST-DistribCursorPagingTest.test-seed#[3A0D3EFE9E0FFC60]) [n:127.0.0.1:40482_ ] o.a.s.c.c.ConnectionManager Client is connected to ZooKeeper
[junit4] 2> 114300 INFO (TEST-DistribCursorPagingTest.test-seed#[3A0D3EFE9E0FFC60]) [n:127.0.0.1:40482_ ] o.a.s.c.c.SolrZkClient makePath: /overseer/queue
[junit4] 2> 114309 INFO (TEST-DistribCursorPagingTest.test-seed#[3A0D3EFE9E0FFC60]) [n:127.0.0.1:40482_ ] o.a.s.c.c.SolrZkClient makePath: /overseer/collection-queue-work
[junit4] 2> 114314 INFO (TEST-DistribCursorPagingTest.test-seed#[3A0D3EFE9E0FFC60]) [n:127.0.0.1:40482_ ] o.a.s.c.c.SolrZkClient makePath: /overseer/collection-map-running
[junit4] 2> 114318 INFO (TEST-DistribCursorPagingTest.test-seed#[3A0D3EFE9E0FFC60]) [n:127.0.0.1:40482_ ] o.a.s.c.c.SolrZkClient makePath: /overseer/collection-map-completed
[junit4] 2> 114320 INFO (TEST-DistribCursorPagingTest.test-seed#[3A0D3EFE9E0FFC60]) [n:127.0.0.1:40482_ ] o.a.s.c.c.SolrZkClient makePath: /overseer/collection-map-failure
[junit4] 2> 114324 INFO (TEST-DistribCursorPagingTest.test-seed#[3A0D3EFE9E0FFC60]) [n:127.0.0.1:40482_ ] o.a.s.c.c.SolrZkClient makePath: /live_nodes
[junit4] 2> 114326 INFO (TEST-DistribCursorPagingTest.test-seed#[3A0D3EFE9E0FFC60]) [n:127.0.0.1:40482_ ] o.a.s.c.c.SolrZkClient makePath: /aliases.json
[junit4] 2> 114328 INFO (TEST-DistribCursorPagingTest.test-seed#[3A0D3EFE9E0FFC60]) [n:127.0.0.1:40482_ ] o.a.s.c.c.SolrZkClient makePath: /clusterstate.json
[junit4] 2> 114329 INFO (TEST-DistribCursorPagingTest.test-seed#[3A0D3EFE9E0FFC60]) [n:127.0.0.1:40482_ ] o.a.s.c.c.SolrZkClient makePath: /security.json
[junit4] 2> 114331 INFO (TEST-DistribCursorPagingTest.test-seed#[3A0D3EFE9E0FFC60]) [n:127.0.0.1:40482_ ] o.a.s.c.ZkController Register node as live in ZooKeeper:/live_nodes/127.0.0.1:40482_
[junit4] 2> 114331 INFO (TEST-DistribCursorPagingTest.test-seed#[3A0D3EFE9E0FFC60]) [n:127.0.0.1:40482_ ] o.a.s.c.c.SolrZkClient makePath: /live_nodes/127.0.0.1:40482_
[junit4] 2> 114336 INFO (TEST-DistribCursorPagingTest.test-seed#[3A0D3EFE9E0FFC60]) [n:127.0.0.1:40482_ ] o.a.s.c.c.SolrZkClient makePath: /overseer_elect
[junit4] 2> 114337 INFO (TEST-DistribCursorPagingTest.test-seed#[3A0D3EFE9E0FFC60]) [n:127.0.0.1:40482_ ] o.a.s.c.c.SolrZkClient makePath: /overseer_elect/election
[junit4] 2> 114339 INFO (TEST-DistribCursorPagingTest.test-seed#[3A0D3EFE9E0FFC60]) [n:127.0.0.1:40482_ ] o.a.s.c.Overseer Overseer (id=null) closing
[junit4] 2> 114340 INFO (TEST-DistribCursorPagingTest.test-seed#[3A0D3EFE9E0FFC60]) [n:127.0.0.1:40482_ ] o.a.s.c.LeaderElector Joined leadership election with path: /overseer_elect/election/94485802195484677-127.0.0.1:40482_-n_0000000000
[junit4] 2> 114342 INFO (TEST-DistribCursorPagingTest.test-seed#[3A0D3EFE9E0FFC60]) [n:127.0.0.1:40482_ ] o.a.s.c.OverseerElectionContext I am going to be the leader 127.0.0.1:40482_
[junit4] 2> 114342 INFO (TEST-DistribCursorPagingTest.test-seed#[3A0D3EFE9E0FFC60]) [n:127.0.0.1:40482_ ] o.a.s.c.c.SolrZkClient makePath: /overseer_elect/leader
[junit4] 2> 114344 INFO (TEST-DistribCursorPagingTest.test-seed#[3A0D3EFE9E0FFC60]) [n:127.0.0.1:40482_ ] o.a.s.c.Overseer Overseer (id=94485802195484677-127.0.0.1:40482_-n_0000000000) starting
[junit4] 2> 114351 INFO (TEST-DistribCursorPagingTest.test-seed#[3A0D3EFE9E0FFC60]) [n:127.0.0.1:40482_ ] o.a.s.c.c.SolrZkClient makePath: /overseer/queue-work
[junit4] 2> 114371 INFO (TEST-DistribCursorPagingTest.test-seed#[3A0D3EFE9E0FFC60]) [n:127.0.0.1:40482_ ] o.a.s.c.OverseerAutoReplicaFailoverThread Starting OverseerAutoReplicaFailoverThread autoReplicaFailoverWorkLoopDelay=10000 autoReplicaFailoverWaitAfterExpiration=30000 autoReplicaFailoverBadNodeExpiration=60000
[junit4] 2> 114374 INFO (TEST-DistribCursorPagingTest.test-seed#[3A0D3EFE9E0FFC60]) [n:127.0.0.1:40482_ ] o.a.s.c.c.ZkStateReader Updating cluster state from ZooKeeper...
[junit4] 2> 114378 INFO (OverseerCollectionConfigSetProcessor-94485802195484677-127.0.0.1:40482_-n_0000000000) [n:127.0.0.1:40482_ ] o.a.s.c.OverseerTaskProcessor Process current queue of overseer operations
[junit4] 2> 114379 INFO (OverseerStateUpdate-94485802195484677-127.0.0.1:40482_-n_0000000000) [n:127.0.0.1:40482_ ] o.a.s.c.Overseer Starting to work on the main queue
[junit4] 2> 114443 INFO (TEST-DistribCursorPagingTest.test-seed#[3A0D3EFE9E0FFC60]) [n:127.0.0.1:40482_ ] o.a.s.c.CoreContainer Security conf doesn't exist. Skipping setup for authorization module.
[junit4] 2> 114443 INFO (TEST-DistribCursorPagingTest.test-seed#[3A0D3EFE9E0FFC60]) [n:127.0.0.1:40482_ ] o.a.s.c.CoreContainer No authentication plugin used.
[junit4] 2> 114448 INFO (TEST-DistribCursorPagingTest.test-seed#[3A0D3EFE9E0FFC60]) [n:127.0.0.1:40482_ ] o.a.s.c.CoresLocator Looking for core definitions underneath /x1/jenkins/jenkins-slave/workspace/Lucene-Solr-Tests-trunk-Java8/solr/build/solr-core/test/J1/temp/solr.cloud.DistribCursorPagingTest_3A0D3EFE9E0FFC60-001/control-001/cores
[junit4] 2> 114450 INFO (TEST-DistribCursorPagingTest.test-seed#[3A0D3EFE9E0FFC60]) [n:127.0.0.1:40482_ ] o.a.s.c.SolrCore Created CoreDescriptor: {name=collection1, config=solrconfig.xml, transient=false, schema=schema.xml, loadOnStartup=true, configSetProperties=configsetprops.json, instanceDir=/x1/jenkins/jenkins-slave/workspace/Lucene-Solr-Tests-trunk-Java8/solr/build/solr-core/test/J1/temp/solr.cloud.DistribCursorPagingTest_3A0D3EFE9E0FFC60-001/control-001/cores/collection1, collection=control_collection, absoluteInstDir=/x1/jenkins/jenkins-slave/workspace/Lucene-Solr-Tests-trunk-Java8/solr/build/solr-core/test/J1/temp/solr.cloud.DistribCursorPagingTest_3A0D3EFE9E0FFC60-001/control-001/cores/collection1/, coreNodeName=, dataDir=data/, shard=}
[junit4] 2> 114450 INFO (TEST-DistribCursorPagingTest.test-seed#[3A0D3EFE9E0FFC60]) [n:127.0.0.1:40482_ ] o.a.s.c.CoresLocator Found core collection1 in /x1/jenkins/jenkins-slave/workspace/Lucene-Solr-Tests-trunk-Java8/solr/build/solr-core/test/J1/temp/solr.cloud.DistribCursorPagingTest_3A0D3EFE9E0FFC60-001/control-001/cores/collection1/
[junit4] 2> 114451 INFO (TEST-DistribCursorPagingTest.test-seed#[3A0D3EFE9E0FFC60]) [n:127.0.0.1:40482_ ] o.a.s.c.CoresLocator Found 1 core definitions
[junit4] 2> 114459 INFO (coreLoadExecutor-205-thread-1-processing-n:127.0.0.1:40482_) [n:127.0.0.1:40482_ c:control_collection x:collection1] o.a.s.c.ZkController publishing state=down
[junit4] 2> 114459 INFO (coreLoadExecutor-205-thread-1-processing-n:127.0.0.1:40482_) [n:127.0.0.1:40482_ c:control_collection x:collection1] o.a.s.c.ZkController numShards not found on descriptor - reading it from system property
[junit4] 2> 114459 INFO (TEST-DistribCursorPagingTest.test-seed#[3A0D3EFE9E0FFC60]) [n:127.0.0.1:40482_ ] o.a.s.s.SolrDispatchFilter user.dir=/x1/jenkins/jenkins-slave/workspace/Lucene-Solr-Tests-trunk-Java8/solr/build/solr-core/test/J1
[junit4] 2> 114459 INFO (TEST-DistribCursorPagingTest.test-seed#[3A0D3EFE9E0FFC60]) [n:127.0.0.1:40482_ ] o.a.s.s.SolrDispatchFilter SolrDispatchFilter.init() done
[junit4] 2> 114466 INFO (OverseerStateUpdate-94485802195484677-127.0.0.1:40482_-n_0000000000) [n:127.0.0.1:40482_ ] o.a.s.c.Overseer processMessage: queueSize: 1, message = {
[junit4] 2> "core":"collection1",
[junit4] 2> "roles":null,
[junit4] 2> "base_url":"https://127.0.0.1:40482",
[junit4] 2> "node_name":"127.0.0.1:40482_",
[junit4] 2> "numShards":"1",
[junit4] 2> "state":"down",
[junit4] 2> "shard":null,
[junit4] 2> "collection":"control_collection",
[junit4] 2> "operation":"state"} current state version: 0
[junit4] 2> 114470 INFO (coreLoadExecutor-205-thread-1-processing-n:127.0.0.1:40482_) [n:127.0.0.1:40482_ c:control_collection x:collection1] o.a.s.c.ZkController look for our core node name
[junit4] 2> 114475 INFO (OverseerStateUpdate-94485802195484677-127.0.0.1:40482_-n_0000000000) [n:127.0.0.1:40482_ ] o.a.s.c.o.ReplicaMutator Update state numShards=1 message={
[junit4] 2> "core":"collection1",
[junit4] 2> "roles":null,
[junit4] 2> "base_url":"https://127.0.0.1:40482",
[junit4] 2> "node_name":"127.0.0.1:40482_",
[junit4] 2> "numShards":"1",
[junit4] 2> "state":"down",
[junit4] 2> "shard":null,
[junit4] 2> "collection":"control_collection",
[junit4] 2> "operation":"state"}
[junit4] 2> 114475 INFO (OverseerStateUpdate-94485802195484677-127.0.0.1:40482_-n_0000000000) [n:127.0.0.1:40482_ ] o.a.s.c.o.ClusterStateMutator building a new cName: control_collection
[junit4] 2> 114478 INFO (OverseerStateUpdate-94485802195484677-127.0.0.1:40482_-n_0000000000) [n:127.0.0.1:40482_ ] o.a.s.c.o.ReplicaMutator Assigning new node to shard shard=shard1
[junit4] 2> 114482 INFO (zkCallback-51-thread-1-processing-n:127.0.0.1:40482_) [n:127.0.0.1:40482_ ] o.a.s.c.c.ZkStateReader A cluster state change: WatchedEvent state:SyncConnected type:NodeDataChanged path:/clusterstate.json, has occurred - updating... (live nodes size: 1)
[junit4] 2> 115471 INFO (coreLoadExecutor-205-thread-1-processing-n:127.0.0.1:40482_) [n:127.0.0.1:40482_ c:control_collection x:collection1] o.a.s.c.ZkController waiting to find shard id in clusterstate for collection1
[junit4] 2> 115471 INFO (coreLoadExecutor-205-thread-1-processing-n:127.0.0.1:40482_) [n:127.0.0.1:40482_ c:control_collection x:collection1] o.a.s.c.ZkController Check for collection zkNode:control_collection
[junit4] 2> 115472 INFO (coreLoadExecutor-205-thread-1-processing-n:127.0.0.1:40482_) [n:127.0.0.1:40482_ c:control_collection x:collection1] o.a.s.c.ZkController Collection zkNode exists
[junit4] 2> 115472 INFO (coreLoadExecutor-205-thread-1-processing-n:127.0.0.1:40482_) [n:127.0.0.1:40482_ c:control_collection x:collection1] o.a.s.c.c.ZkStateReader Load collection config from:/collections/control_collection
[junit4] 2> 115474 INFO (coreLoadExecutor-205-thread-1-processing-n:127.0.0.1:40482_) [n:127.0.0.1:40482_ c:control_collection x:collection1] o.a.s.c.c.ZkStateReader path=/collections/control_collection configName=conf1 specified config exists in ZooKeeper
[junit4] 2> 115475 INFO (coreLoadExecutor-205-thread-1-processing-n:127.0.0.1:40482_) [n:127.0.0.1:40482_ c:control_collection x:collection1] o.a.s.c.SolrResourceLoader new SolrResourceLoader for directory: '/x1/jenkins/jenkins-slave/workspace/Lucene-Solr-Tests-trunk-Java8/solr/build/solr-core/test/J1/temp/solr.cloud.DistribCursorPagingTest_3A0D3EFE9E0FFC60-001/control-001/cores/collection1/'
[junit4] 2> 115509 INFO (coreLoadExecutor-205-thread-1-processing-n:127.0.0.1:40482_) [n:127.0.0.1:40482_ c:control_collection x:collection1] o.a.s.c.Config loaded config solrconfig.xml with version 0
[junit4] 2> 115527 INFO (coreLoadExecutor-205-thread-1-processing-n:127.0.0.1:40482_) [n:127.0.0.1:40482_ c:control_collection x:collection1] o.a.s.c.SolrConfig current version of requestparams : -1
[junit4] 2> 115531 INFO (coreLoadExecutor-205-thread-1-processing-n:127.0.0.1:40482_) [n:127.0.0.1:40482_ c:control_collection x:collection1] o.a.s.c.SolrConfig Using Lucene MatchVersion: 6.0.0
[junit4] 2> 115559 INFO (coreLoadExecutor-205-thread-1-processing-n:127.0.0.1:40482_) [n:127.0.0.1:40482_ c:control_collection x:collection1] o.a.s.c.Config Loaded SolrConfig: solrconfig.xml
[junit4] 2> 115561 INFO (coreLoadExecutor-205-thread-1-processing-n:127.0.0.1:40482_) [n:127.0.0.1:40482_ c:control_collection x:collection1] o.a.s.s.IndexSchema Reading Solr Schema from /configs/conf1/schema.xml
[junit4] 2> 115566 INFO (coreLoadExecutor-205-thread-1-processing-n:127.0.0.1:40482_) [n:127.0.0.1:40482_ c:control_collection x:collection1] o.a.s.s.IndexSchema [collection1] Schema name=sortable
[junit4] 2> 116113 INFO (coreLoadExecutor-205-thread-1-processing-n:127.0.0.1:40482_) [n:127.0.0.1:40482_ c:control_collection x:collection1] o.a.s.s.IndexSchema unique key field: id
[junit4] 2> 116115 INFO (coreLoadExecutor-205-thread-1-processing-n:127.0.0.1:40482_) [n:127.0.0.1:40482_ c:control_collection x:collection1] o.a.s.c.ConfigSetProperties Did not find ConfigSet properties, assuming default properties: Can't find resource 'configsetprops.json' in classpath or '/configs/conf1', cwd=/x1/jenkins/jenkins-slave/workspace/Lucene-Solr-Tests-trunk-Java8/solr/build/solr-core/test/J1
[junit4] 2> 116116 INFO (coreLoadExecutor-205-thread-1-processing-n:127.0.0.1:40482_) [n:127.0.0.1:40482_ c:control_collection x:collection1] o.a.s.c.CoreContainer Creating SolrCore 'collection1' using configuration from collection control_collection
[junit4] 2> 116116 INFO (coreLoadExecutor-205-thread-1-processing-n:127.0.0.1:40482_) [n:127.0.0.1:40482_ c:control_collection s:shard1 r:core_node1 x:collection1] o.a.s.c.SolrCore org.apache.solr.core.MockDirectoryFactory
[junit4] 2> 116116 INFO (coreLoadExecutor-205-thread-1-processing-n:127.0.0.1:40482_) [n:127.0.0.1:40482_ c:control_collection s:shard1 r:core_node1 x:collection1] o.a.s.c.SolrCore [[collection1] ] Opening new SolrCore at [/x1/jenkins/jenkins-slave/workspace/Lucene-Solr-Tests-trunk-Java8/solr/build/solr-core/test/J1/temp/solr.cloud.DistribCursorPagingTest_3A0D3EFE9E0FFC60-001/control-001/cores/collection1/], dataDir=[null]
[junit4] 2> 116116 INFO (coreLoadExecutor-205-thread-1-processing-n:127.0.0.1:40482_) [n:127.0.0.1:40482_ c:control_collection s:shard1 r:core_node1 x:collection1] o.a.s.c.SolrCore JMX monitoring not detected for core: collection1
[junit4] 2> 116117 INFO (coreLoadExecutor-205-thread-1-processing-n:127.0.0.1:40482_) [n:127.0.0.1:40482_ c:control_collection s:shard1 r:core_node1 x:collection1] o.a.s.c.CachingDirectoryFactory return new directory for /x1/jenkins/jenkins-slave/workspace/Lucene-Solr-Tests-trunk-Java8/solr/build/solr-core/test/J1/temp/solr.cloud.DistribCursorPagingTest_3A0D3EFE9E0FFC60-001/control-001/cores/collection1/data
[junit4] 2> 116117 INFO (coreLoadExecutor-205-thread-1-processing-n:127.0.0.1:40482_) [n:127.0.0.1:40482_ c:control_collection s:shard1 r:core_node1 x:collection1] o.a.s.c.SolrCore New index directory detected: old=null new=/x1/jenkins/jenkins-slave/workspace/Lucene-Solr-Tests-trunk-Java8/solr/build/solr-core/test/J1/temp/solr.cloud.DistribCursorPagingTest_3A0D3EFE9E0FFC60-001/control-001/cores/collection1/data/index/
[junit4] 2> 116117 WARN (coreLoadExecutor-205-thread-1-processing-n:127.0.0.1:40482_) [n:127.0.0.1:40482_ c:control_collection s:shard1 r:core_node1 x:collection1] o.a.s.c.SolrCore [collection1] Solr index directory '/x1/jenkins/jenkins-slave/workspace/Lucene-Solr-Tests-trunk-Java8/solr/build/solr-core/test/J1/temp/solr.cloud.DistribCursorPagingTest_3A0D3EFE9E0FFC60-001/control-001/cores/collection1/data/index' doesn't exist. Creating new index...
[junit4] 2> 116117 INFO (coreLoadExecutor-205-thread-1-processing-n:127.0.0.1:40482_) [n:127.0.0.1:40482_ c:control_collection s:shard1 r:core_node1 x:collection1] o.a.s.c.CachingDirectoryFactory return new directory for /x1/jenkins/jenkins-slave/workspace/Lucene-Solr-Tests-trunk-Java8/solr/build/solr-core/test/J1/temp/solr.cloud.DistribCursorPagingTest_3A0D3EFE9E0FFC60-001/control-001/cores/collection1/data/index
[junit4] 2> 116118 INFO (coreLoadExecutor-205-thread-1-processing-n:127.0.0.1:40482_) [n:127.0.0.1:40482_ c:control_collection s:shard1 r:core_node1 x:collection1] o.a.s.u.RandomMergePolicy RandomMergePolicy wrapping class org.apache.lucene.index.TieredMergePolicy: [TieredMergePolicy: maxMergeAtOnce=25, maxMergeAtOnceExplicit=11, maxMergedSegmentMB=91.615234375, floorSegmentMB=1.4580078125, forceMergeDeletesPctAllowed=3.0501930119323637, segmentsPerTier=14.0, maxCFSSegmentSizeMB=8.796093022207999E12, noCFSRatio=0.0
[junit4] 2> 116119 INFO (coreLoadExecutor-205-thread-1-processing-n:127.0.0.1:40482_) [n:127.0.0.1:40482_ c:control_collection s:shard1 r:core_node1 x:collection1] o.a.s.c.SolrCore SolrDeletionPolicy.onCommit: commits: num=1
[junit4] 2> commit{dir=MockDirectoryWrapper(RAMDirectory@26430011 lockFactory=org.apache.lucene.store.SingleInstanceLockFactory@6426ab74),segFN=segments_1,generation=1}
[junit4] 2> 116119 INFO (coreLoadExecutor-205-thread-1-processing-n:127.0.0.1:40482_) [n:127.0.0.1:40482_ c:control_collection s:shard1 r:core_node1 x:collection1] o.a.s.c.SolrCore newest commit generation = 1
[junit4] 2> 116134 INFO (coreLoadExecutor-205-thread-1-processing-n:127.0.0.1:40482_) [n:127.0.0.1:40482_ c:control_collection s:shard1 r:core_node1 x:collection1] o.a.s.c.SolrCore no updateRequestProcessorChain defined as default, creating implicit default
[junit4] 2> 116137 INFO (coreLoadExecutor-205-thread-1-processing-n:127.0.0.1:40482_) [n:127.0.0.1:40482_ c:control_collection s:shard1 r:core_node1 x:collection1] o.a.s.h.l.XMLLoader xsltCacheLifetimeSeconds=60
[junit4] 2> 116137 INFO (OldIndexDirectoryCleanupThreadForCore-collection1) [n:127.0.0.1:40482_ c:control_collection s:shard1 r:core_node1 x:collection1] o.a.s.c.SolrCore Looking for old index directories to cleanup for core collection1 in /x1/jenkins/jenkins-slave/workspace/Lucene-Solr-Tests-trunk-Java8/solr/build/solr-core/test/J1/temp/solr.cloud.DistribCursorPagingTest_3A0D3EFE9E0FFC60-001/control-001/cores/collection1/data/
[junit4] 2> 116137 WARN (OldIndexDirectoryCleanupThreadForCore-collection1) [n:127.0.0.1:40482_ c:control_collection s:shard1 r:core_node1 x:collection1] o.a.s.c.DirectoryFactory /x1/jenkins/jenkins-slave/workspace/Lucene-Solr-Tests-trunk-Java8/solr/build/solr-core/test/J1/temp/solr.cloud.DistribCursorPagingTest_3A0D3EFE9E0FFC60-001/control-001/cores/collection1/data/ does not point to a valid data directory; skipping clean-up of old index directories.
[junit4] 2> 116139 INFO (coreLoadExecutor-205-thread-1-processing-n:127.0.0.1:40482_) [n:127.0.0.1:40482_ c:control_collection s:shard1 r:core_node1 x:collection1] o.a.s.h.l.XMLLoader xsltCacheLifetimeSeconds=60
[junit4] 2> 116140 INFO (coreLoadExecutor-205-thread-1-processing-n:127.0.0.1:40482_) [n:127.0.0.1:40482_ c:control_collection s:shard1 r:core_node1 x:collection1] o.a.s.h.l.XMLLoader xsltCacheLifetimeSeconds=60
[junit4] 2> 116141 INFO (coreLoadExecutor-205-thread-1-processing-n:127.0.0.1:40482_) [n:127.0.0.1:40482_ c:control_collection s:shard1 r:core_node1 x:collection1] o.a.s.h.l.XMLLoader xsltCacheLifetimeSeconds=60
[junit4] 2> 116144 INFO (coreLoadExecutor-205-thread-1-processing-n:127.0.0.1:40482_) [n:127.0.0.1:40482_ c:control_collection s:shard1 r:core_node1 x:collection1] o.a.s.c.RequestHandlers Registered paths: /admin/mbeans,,/update/csv,/update/json/docs,/admin/luke,/select,/admin/segments,/get,/admin/system,/replication,/admin/properties,/config,/schema,/admin/plugins,/admin/logging,/update/json,/admin/threads,/admin/ping,/update,/admin/file
[junit4] 2> 116145 INFO (coreLoadExecutor-205-thread-1-processing-n:127.0.0.1:40482_) [n:127.0.0.1:40482_ c:control_collection s:shard1 r:core_node1 x:collection1] o.a.s.c.SolrCore Using default statsCache cache: org.apache.solr.search.stats.LocalStatsCache
[junit4] 2> 116154 INFO (coreLoadExecutor-205-thread-1-processing-n:127.0.0.1:40482_) [n:127.0.0.1:40482_ c:control_collection s:shard1 r:core_node1 x:collection1] o.a.s.u.UpdateHandler Using UpdateLog implementation: org.apache.solr.update.UpdateLog
[junit4] 2> 116154 INFO (coreLoadExecutor-205-thread-1-processing-n:127.0.0.1:40482_) [n:127.0.0.1:40482_ c:control_collection s:shard1 r:core_node1 x:collection1] o.a.s.u.UpdateLog Initializing UpdateLog: dataDir= defaultSyncLevel=FLUSH numRecordsToKeep=100 maxNumLogsToKeep=10 numVersionBuckets=65536
[junit4] 2> 116155 INFO (coreLoadExecutor-205-thread-1-processing-n:127.0.0.1:40482_) [n:127.0.0.1:40482_ c:control_collection s:shard1 r:core_node1 x:collection1] o.a.s.c.SolrCore Hard AutoCommit: disabled
[junit4] 2> 116155 INFO (coreLoadExecutor-205-thread-1-processing-n:127.0.0.1:40482_) [n:127.0.0.1:40482_ c:control_collection s:shard1 r:core_node1 x:collection1] o.a.s.c.SolrCore Soft AutoCommit: disabled
[junit4] 2> 116155 INFO (coreLoadExecutor-205-thread-1-processing-n:127.0.0.1:40482_) [n:127.0.0.1:40482_ c:control_collection s:shard1 r:core_node1 x:collection1] o.a.s.u.RandomMergePolicy RandomMergePolicy wrapping class org.apache.lucene.index.TieredMergePolicy: [TieredMergePolicy: maxMergeAtOnce=34, maxMergeAtOnceExplicit=12, maxMergedSegmentMB=69.916015625, floorSegmentMB=1.0458984375, forceMergeDeletesPctAllowed=7.365565744881094, segmentsPerTier=20.0, maxCFSSegmentSizeMB=8.796093022207999E12, noCFSRatio=1.0
[junit4] 2> 116156 INFO (coreLoadExecutor-205-thread-1-processing-n:127.0.0.1:40482_) [n:127.0.0.1:40482_ c:control_collection s:shard1 r:core_node1 x:collection1] o.a.s.c.SolrCore SolrDeletionPolicy.onInit: commits: num=1
[junit4] 2> commit{dir=MockDirectoryWrapper(RAMDirectory@26430011 lockFactory=org.apache.lucene.store.SingleInstanceLockFactory@6426ab74),segFN=segments_1,generation=1}
[junit4] 2> 116156 INFO (coreLoadExecutor-205-thread-1-processing-n:127.0.0.1:40482_) [n:127.0.0.1:40482_ c:control_collection s:shard1 r:core_node1 x:collection1] o.a.s.c.SolrCore newest commit generation = 1
[junit4] 2> 116156 INFO (coreLoadExecutor-205-thread-1-processing-n:127.0.0.1:40482_) [n:127.0.0.1:40482_ c:control_collection s:shard1 r:core_node1 x:collection1] o.a.s.s.SolrIndexSearcher Opening Searcher@29775081[collection1] main
[junit4] 2> 116157 INFO (coreLoadExecutor-205-thread-1-processing-n:127.0.0.1:40482_) [n:127.0.0.1:40482_ c:control_collection s:shard1 r:core_node1 x:collection1] o.a.s.c.c.ZkStateReader Load collection config from:/collections/control_collection
[junit4] 2> 116158 INFO (coreLoadExecutor-205-thread-1-processing-n:127.0.0.1:40482_) [n:127.0.0.1:40482_ c:control_collection s:shard1 r:core_node1 x:collection1] o.a.s.c.c.ZkStateReader path=/collections/control_collection configName=conf1 specified config exists in ZooKeeper
[junit4] 2> 116158 INFO (coreLoadExecutor-205-thread-1-processing-n:127.0.0.1:40482_) [n:127.0.0.1:40482_ c:control_collection s:shard1 r:core_node1 x:collection1] o.a.s.r.ManagedResourceStorage Setting up ZooKeeper-based storage for the RestManager with znodeBase: /configs/conf1
[junit4] 2> 116161 INFO (coreLoadExecutor-205-thread-1-processing-n:127.0.0.1:40482_) [n:127.0.0.1:40482_ c:control_collection s:shard1 r:core_node1 x:collection1] o.a.s.r.ManagedResourceStorage Configured ZooKeeperStorageIO with znodeBase: /configs/conf1
[junit4] 2> 116161 INFO (coreLoadExecutor-205-thread-1-processing-n:127.0.0.1:40482_) [n:127.0.0.1:40482_ c:control_collection s:shard1 r:core_node1 x:collection1] o.a.s.r.RestManager Initializing RestManager with initArgs: {}
[junit4] 2> 116161 INFO (coreLoadExecutor-205-thread-1-processing-n:127.0.0.1:40482_) [n:127.0.0.1:40482_ c:control_collection s:shard1 r:core_node1 x:collection1] o.a.s.r.ManagedResourceStorage Reading _rest_managed.json using ZooKeeperStorageIO:path=/configs/conf1
[junit4] 2> 116162 INFO (coreLoadExecutor-205-thread-1-processing-n:127.0.0.1:40482_) [n:127.0.0.1:40482_ c:control_collection s:shard1 r:core_node1 x:collection1] o.a.s.r.ManagedResourceStorage No data found for znode /configs/conf1/_rest_managed.json
[junit4] 2> 116162 INFO (coreLoadExecutor-205-thread-1-processing-n:127.0.0.1:40482_) [n:127.0.0.1:40482_ c:control_collection s:shard1 r:core_node1 x:collection1] o.a.s.r.ManagedResourceStorage Loaded null at path _rest_managed.json using ZooKeeperStorageIO:path=/configs/conf1
[junit4] 2> 116162 INFO (coreLoadExecutor-205-thread-1-processing-n:127.0.0.1:40482_) [n:127.0.0.1:40482_ c:control_collection s:shard1 r:core_node1 x:collection1] o.a.s.r.RestManager Initializing 0 registered ManagedResources
[junit4] 2> 116162 INFO (coreLoadExecutor-205-thread-1-processing-n:127.0.0.1:40482_) [n:127.0.0.1:40482_ c:control_collection s:shard1 r:core_node1 x:collection1] o.a.s.h.ReplicationHandler Commits will be reserved for 10000
[junit4] 2> 116162 INFO (coreLoadExecutor-205-thread-1-processing-n:127.0.0.1:40482_) [n:127.0.0.1:40482_ c:control_collection s:shard1 r:core_node1 x:collection1] o.a.s.u.UpdateLog Looking up max value of version field to seed version buckets
[junit4] 2> 116162 INFO (coreLoadExecutor-205-thread-1-processing-n:127.0.0.1:40482_) [n:127.0.0.1:40482_ c:control_collection s:shard1 r:core_node1 x:collection1] o.a.s.u.VersionInfo Refreshing highest value of _version_ for 65536 version buckets from index
[junit4] 2> 116163 INFO (coreLoadExecutor-205-thread-1-processing-n:127.0.0.1:40482_) [n:127.0.0.1:40482_ c:control_collection s:shard1 r:core_node1 x:collection1] o.a.s.u.VersionInfo No terms found for _version_, cannot seed version bucket highest value from index
[junit4] 2> 116163 INFO (coreLoadExecutor-205-thread-1-processing-n:127.0.0.1:40482_) [n:127.0.0.1:40482_ c:control_collection s:shard1 r:core_node1 x:collection1] o.a.s.u.UpdateLog Could not find max version in index or recent updates, using new clock 1511772837840420864
[junit4] 2> 116165 INFO (coreLoadExecutor-205-thread-1-processing-n:127.0.0.1:40482_) [n:127.0.0.1:40482_ c:control_collection s:shard1 r:core_node1 x:collection1] o.a.s.u.UpdateLog Took 2.0ms to seed version buckets with highest version 1511772837840420864
[junit4] 2> 116166 INFO (searcherExecutor-206-thread-1-processing-n:127.0.0.1:40482_ x:collection1 s:shard1 c:control_collection r:core_node1) [n:127.0.0.1:40482_ c:control_collection s:shard1 r:core_node1 x:collection1] o.a.s.c.SolrCore [collection1] Registered new searcher Searcher@29775081[collection1] main{ExitableDirectoryReader(UninvertingDirectoryReader())}
[junit4] 2> 116167 INFO (coreLoadExecutor-205-thread-1-processing-n:127.0.0.1:40482_) [n:127.0.0.1:40482_ c:control_collection s:shard1 r:core_node1 x:collection1] o.a.s.c.ZkController watch zkdir /configs/conf1
[junit4] 2> 116168 INFO (coreLoadExecutor-205-thread-1-processing-n:127.0.0.1:40482_) [n:127.0.0.1:40482_ c:control_collection s:shard1 r:core_node1 x:collection1] o.a.s.c.CoreContainer registering core: collection1
[junit4] 2> 116170 INFO (coreZkRegister-199-thread-1-processing-n:127.0.0.1:40482_ x:collection1 s:shard1 c:control_collection r:core_node1) [n:127.0.0.1:40482_ c:control_collection s:shard1 r:core_node1 x:collection1] o.a.s.c.ZkController Register replica - core:collection1 address:https://127.0.0.1:40482 collection:control_collection shard:shard1
[junit4] 2> 116190 INFO (coreZkRegister-199-thread-1-processing-n:127.0.0.1:40482_ x:collection1 s:shard1 c:control_collection r:core_node1) [n:127.0.0.1:40482_ c:control_collection s:shard1 r:core_node1 x:collection1] o.a.s.c.c.SolrZkClient makePath: /collections/control_collection/leader_elect/shard1/election
[junit4] 2> 116195 INFO (coreZkRegister-199-thread-1-processing-n:127.0.0.1:40482_ x:collection1 s:shard1 c:control_collection r:core_node1) [n:127.0.0.1:40482_ c:control_collection s:shard1 r:core_node1 x:collection1] o.a.s.c.LeaderElector Joined leadership election with path: /collections/control_collection/leader_elect/shard1/election/94485802195484677-core_node1-n_0000000000
[junit4] 2> 116196 INFO (coreZkRegister-199-thread-1-processing-n:127.0.0.1:40482_ x:collection1 s:shard1 c:control_collection r:core_node1) [n:127.0.0.1:40482_ c:control_collection s:shard1 r:core_node1 x:collection1] o.a.s.c.ShardLeaderElectionContext Running the leader process for shard shard1
[junit4] 2> 116199 INFO (OverseerStateUpdate-94485802195484677-127.0.0.1:40482_-n_0000000000) [n:127.0.0.1:40482_ ] o.a.s.c.Overseer processMessage: queueSize: 1, message = {
[junit4] 2> "operation":"leader",
[junit4] 2> "shard":"shard1",
[junit4] 2> "collection":"control_collection"} current state version: 1
[junit4] 2> 116204 INFO (coreZkRegister-199-thread-1-processing-n:127.0.0.1:40482_ x:collection1 s:shard1 c:control_collection r:core_node1) [n:127.0.0.1:40482_ c:control_collection s:shard1 r:core_node1 x:collection1] o.a.s.c.ShardLeaderElectionContext Enough replicas found to continue.
[junit4] 2> 116204 INFO (coreZkRegister-199-thread-1-processing-n:127.0.0.1:40482_ x:collection1 s:shard1 c:control_collection r:core_node1) [n:127.0.0.1:40482_ c:control_collection s:shard1 r:core_node1 x:collection1] o.a.s.c.ShardLeaderElectionContext I may be the new leader - try and sync
[junit4] 2> 116204 INFO (coreZkRegister-199-thread-1-processing-n:127.0.0.1:40482_ x:collection1 s:shard1 c:control_collection r:core_node1) [n:127.0.0.1:40482_ c:control_collection s:shard1 r:core_node1 x:collection1] o.a.s.c.SyncStrategy Sync replicas to https://127.0.0.1:40482/collection1/
[junit4] 2> 116205 INFO (coreZkRegister-199-thread-1-processing-n:127.0.0.1:40482_ x:collection1 s:shard1 c:control_collection r:core_node1) [n:127.0.0.1:40482_ c:control_collection s:shard1 r:core_node1 x:collection1] o.a.s.c.SyncStrategy Sync Success - now sync replicas to me
[junit4] 2> 116205 INFO (coreZkRegister-199-thread-1-processing-n:127.0.0.1:40482_ x:collection1 s:shard1 c:control_collection r:core_node1) [n:127.0.0.1:40482_ c:control_collection s:shard1 r:core_node1 x:collection1] o.a.s.c.SyncStrategy https://127.0.0.1:40482/collection1/ has no replicas
[junit4] 2> 116205 INFO (coreZkRegister-199-thread-1-processing-n:127.0.0.1:40482_ x:collection1 s:shard1 c:control_collection r:core_node1) [n:127.0.0.1:40482_ c:control_collection s:shard1 r:core_node1 x:collection1] o.a.s.c.ShardLeaderElectionContext I am the new leader: https://127.0.0.1:40482/collection1/ shard1
[junit4] 2> 116206 INFO (zkCallback-51-thread-1-processing-n:127.0.0.1:40482_) [n:127.0.0.1:40482_ ] o.a.s.c.c.ZkStateReader A cluster state change: WatchedEvent state:SyncConnected type:NodeDataChanged path:/clusterstate.json, has occurred - updating... (live nodes size: 1)
[junit4] 2> 116207 INFO (coreZkRegister-199-thread-1-processing-n:127.0.0.1:40482_ x:collection1 s:shard1 c:control_collection r:core_node1) [n:127.0.0.1:40482_ c:control_collection s:shard1 r:core_node1 x:collection1] o.a.s.c.c.SolrZkClient makePath: /collections/control_collection/leaders/shard1
[junit4] 2> 116214 INFO (coreZkRegister-199-thread-1-processing-n:127.0.0.1:40482_ x:collection1 s:shard1 c:control_collection r:core_node1) [n:127.0.0.1:40482_ c:control_collection s:shard1 r:core_node1 x:collection1] o.a.s.c.ShardLeaderElectionContextBase Creating leader registration node
[junit4] 2> 116234 INFO (OverseerStateUpdate-94485802195484677-127.0.0.1:40482_-n_0000000000) [n:127.0.0.1:40482_ ] o.a.s.c.Overseer processMessage: queueSize: 1, message = {
[junit4] 2> "operation":"leader",
[junit4] 2> "shard":"shard1",
[junit4] 2> "collection":"control_collection",
[junit4] 2> "base_url":"https://127.0.0.1:40482",
[junit4] 2> "core":"collection1",
[junit4] 2> "state":"active"} current state version: 2
[junit4] 2> 116347 INFO (zkCallback-51-thread-1-processing-n:127.0.0.1:40482_) [n:127.0.0.1:40482_ ] o.a.s.c.c.ZkStateReader A cluster state change: WatchedEvent state:SyncConnected type:NodeDataChanged path:/clusterstate.json, has occurred - updating... (live nodes size: 1)
[junit4] 2> 116385 INFO (coreZkRegister-199-thread-1-processing-n:127.0.0.1:40482_ x:collection1 s:shard1 c:control_collection r:core_node1) [n:127.0.0.1:40482_ c:control_collection s:shard1 r:core_node1 x:collection1] o.a.s.c.ZkController We are https://127.0.0.1:40482/collection1/ and leader is https://127.0.0.1:40482/collection1/
[junit4] 2> 116385 INFO (coreZkRegister-199-thread-1-processing-n:127.0.0.1:40482_ x:collection1 s:shard1 c:control_collection r:core_node1) [n:127.0.0.1:40482_ c:control_collection s:shard1 r:core_node1 x:collection1] o.a.s.c.ZkController No LogReplay needed for core=collection1 baseURL=https://127.0.0.1:40482
[junit4] 2> 116385 INFO (coreZkRegister-199-thread-1-processing-n:127.0.0.1:40482_ x:collection1 s:shard1 c:control_collection r:core_node1) [n:127.0.0.1:40482_ c:control_collection s:shard1 r:core_node1 x:collection1] o.a.s.c.ZkController I am the leader, no recovery necessary
[junit4] 2> 116385 INFO (coreZkRegister-199-thread-1-processing-n:127.0.0.1:40482_ x:collection1 s:shard1 c:control_collection r:core_node1) [n:127.0.0.1:40482_ c:control_collection s:shard1 r:core_node1 x:collection1] o.a.s.c.ZkController publishing state=active
[junit4] 2> 116386 INFO (coreZkRegister-199-thread-1-processing-n:127.0.0.1:40482_ x:collection1 s:shard1 c:control_collection r:core_node1) [n:127.0.0.1:40482_ c:control_collection s:shard1 r:core_node1 x:collection1] o.a.s.c.ZkController numShards not found on descriptor - reading it from system property
[junit4] 2> 116390 INFO (OverseerStateUpdate-94485802195484677-127.0.0.1:40482_-n_0000000000) [n:127.0.0.1:40482_ ] o.a.s.c.Overseer processMessage: queueSize: 1, message = {
[junit4] 2> "core":"collection1",
[junit4] 2> "core_node_name":"core_node1",
[junit4] 2> "roles":null,
[junit4] 2> "base_url":"https://127.0.0.1:40482",
[junit4] 2> "node_name":"127.0.0.1:40482_",
[junit4] 2> "numShards":"1",
[junit4] 2> "state":"active",
[junit4] 2> "shard":"shard1",
[junit4] 2> "collection":"control_collection",
[junit4] 2> "operation":"state"} current state version: 3
[junit4] 2> 116391 INFO (OverseerStateUpdate-94485802195484677-127.0.0.1:40482_-n_0000000000) [n:127.0.0.1:40482_ ] o.a.s.c.o.ReplicaMutator Update state numShards=1 message={
[junit4] 2> "core":"collection1",
[junit4] 2> "core_node_name":"core_node1",
[junit4] 2> "roles":null,
[junit4] 2> "base_url":"https://127.0.0.1:40482",
[junit4] 2> "node_name":"127.0.0.1:40482_",
[junit4] 2> "numShards":"1",
[junit4] 2> "state":"active",
[junit4] 2> "shard":"shard1",
[junit4] 2> "collection":"control_collection",
[junit4] 2> "operation":"state"}
[junit4] 2> 116492 INFO (TEST-DistribCursorPagingTest.test-seed#[3A0D3EFE9E0FFC60]) [ ] o.a.s.c.c.SolrZkClient Using default ZkCredentialsProvider
[junit4] 2> 116495 INFO (TEST-DistribCursorPagingTest.test-seed#[3A0D3EFE9E0FFC60]) [ ] o.a.s.c.c.ConnectionManager Waiting for client to connect to ZooKeeper
[junit4] 2> 116497 INFO (zkCallback-51-thread-1-processing-n:127.0.0.1:40482_) [n:127.0.0.1:40482_ ] o.a.s.c.c.ZkStateReader A cluster state change: WatchedEvent state:SyncConnected type:NodeDataChanged path:/clusterstate.json, has occurred - updating... (live nodes size: 1)
[junit4] 2> 116501 INFO (zkCallback-53-thread-1) [ ] o.a.s.c.c.ConnectionManager Watcher org.apache.solr.common.cloud.ConnectionManager@5ec77026 name:ZooKeeperConnection Watcher:127.0.0.1:50512/solr got event WatchedEvent state:SyncConnected type:None path:null path:null type:None
[junit4] 2> 116501 INFO (TEST-DistribCursorPagingTest.test-seed#[3A0D3EFE9E0FFC60]) [ ] o.a.s.c.c.ConnectionManager Client is connected to ZooKeeper
[junit4] 2> 116501 INFO (TEST-DistribCursorPagingTest.test-seed#[3A0D3EFE9E0FFC60]) [ ] o.a.s.c.c.SolrZkClient Using default ZkACLProvider
[junit4] 2> 116502 INFO (TEST-DistribCursorPagingTest.test-seed#[3A0D3EFE9E0FFC60]) [ ] o.a.s.c.c.ZkStateReader Updating cluster state from ZooKeeper...
[junit4] 2> 116507 INFO (TEST-DistribCursorPagingTest.test-seed#[3A0D3EFE9E0FFC60]) [ ] o.a.s.c.ChaosMonkey monkey: init - expire sessions:false cause connection loss:false
[junit4] 2> 116847 INFO (TEST-DistribCursorPagingTest.test-seed#[3A0D3EFE9E0FFC60]) [ ] o.a.s.SolrTestCaseJ4 Writing core.properties file to /x1/jenkins/jenkins-slave/workspace/Lucene-Solr-Tests-trunk-Java8/solr/build/solr-core/test/J1/temp/solr.cloud.DistribCursorPagingTest_3A0D3EFE9E0FFC60-001/shard-1-001/cores/collection1
[junit4] 2> 116848 INFO (TEST-DistribCursorPagingTest.test-seed#[3A0D3EFE9E0FFC60]) [ ] o.a.s.c.AbstractFullDistribZkTestBase create jetty 1 in directory /x1/jenkins/jenkins-slave/workspace/Lucene-Solr-Tests-trunk-Java8/solr/build/solr-core/test/J1/temp/solr.cloud.DistribCursorPagingTest_3A0D3EFE9E0FFC60-001/shard-1-001
[junit4] 2> 116849 INFO (TEST-DistribCursorPagingTest.test-seed#[3A0D3EFE9E0FFC60]) [ ] o.e.j.s.Server jetty-9.2.13.v20150730
[junit4] 2> 116856 INFO (TEST-DistribCursorPagingTest.test-seed#[3A0D3EFE9E0FFC60]) [ ] o.e.j.s.h.ContextHandler Started o.e.j.s.ServletContextHandler@25ff32b9{/,null,AVAILABLE}
[junit4] 2> 116863 INFO (TEST-DistribCursorPagingTest.test-seed#[3A0D3EFE9E0FFC60]) [ ] o.e.j.s.ServerConnector Started ServerConnector@7448f5e4{SSL-http/1.1}{127.0.0.1:35893}
[junit4] 2> 116864 INFO (TEST-DistribCursorPagingTest.test-seed#[3A0D3EFE9E0FFC60]) [ ] o.e.j.s.Server Started @120655ms
[junit4] 2> 116864 INFO (TEST-DistribCursorPagingTest.test-seed#[3A0D3EFE9E0FFC60]) [ ] o.a.s.c.s.e.JettySolrRunner Jetty properties: {solr.data.dir=/x1/jenkins/jenkins-slave/workspace/Lucene-Solr-Tests-trunk-Java8/solr/build/solr-core/test/J1/temp/solr.cloud.DistribCursorPagingTest_3A0D3EFE9E0FFC60-001/tempDir-001/jetty1, solrconfig=solrconfig.xml, hostContext=/, hostPort=35893, coreRootDirectory=/x1/jenkins/jenkins-slave/workspace/Lucene-Solr-Tests-trunk-Java8/solr/build/solr-core/test/J1/temp/solr.cloud.DistribCursorPagingTest_3A0D3EFE9E0FFC60-001/shard-1-001/cores}
[junit4] 2> 116865 INFO (TEST-DistribCursorPagingTest.test-seed#[3A0D3EFE9E0FFC60]) [ ] o.a.s.s.SolrDispatchFilter SolrDispatchFilter.init(): sun.misc.Launcher$AppClassLoader@4e0e2f2a
[junit4] 2> 116865 INFO (TEST-DistribCursorPagingTest.test-seed#[3A0D3EFE9E0FFC60]) [ ] o.a.s.c.SolrResourceLoader new SolrResourceLoader for directory: '/x1/jenkins/jenkins-slave/workspace/Lucene-Solr-Tests-trunk-Java8/solr/build/solr-core/test/J1/temp/solr.cloud.DistribCursorPagingTest_3A0D3EFE9E0FFC60-001/shard-1-001/'
[junit4] 2> 116881 INFO (TEST-DistribCursorPagingTest.test-seed#[3A0D3EFE9E0FFC60]) [ ] o.a.s.c.c.SolrZkClient Using default ZkCredentialsProvider
[junit4] 2> 116886 INFO (TEST-DistribCursorPagingTest.test-seed#[3A0D3EFE9E0FFC60]) [ ] o.a.s.c.c.ConnectionManager Waiting for client to connect to ZooKeeper
[junit4] 2> 116898 INFO (zkCallback-54-thread-1) [ ] o.a.s.c.c.ConnectionManager Watcher org.apache.solr.common.cloud.ConnectionManager@76c11958 name:ZooKeeperConnection Watcher:127.0.0.1:50512/solr got event WatchedEvent state:SyncConnected type:None path:null path:null type:None
[junit4] 2> 116898 INFO (TEST-DistribCursorPagingTest.test-seed#[3A0D3EFE9E0FFC60]) [ ] o.a.s.c.c.ConnectionManager Client is connected to ZooKeeper
[junit4] 2> 116898 INFO (TEST-DistribCursorPagingTest.test-seed#[3A0D3EFE9E0FFC60]) [ ] o.a.s.c.c.SolrZkClient Using default ZkACLProvider
[junit4] 2> 116900 INFO (TEST-DistribCursorPagingTest.test-seed#[3A0D3EFE9E0FFC60]) [ ] o.a.s.s.SolrDispatchFilter Loading solr.xml from SolrHome (not found in ZooKeeper)
[junit4] 2> 116901 INFO (TEST-DistribCursorPagingTest.test-seed#[3A0D3EFE9E0FFC60]) [ ] o.a.s.c.SolrXmlConfig Loading container configuration from /x1/jenkins/jenkins-slave/workspace/Lucene-Solr-Tests-trunk-Java8/solr/build/solr-core/test/J1/temp/solr.cloud.DistribCursorPagingTest_3A0D3EFE9E0FFC60-001/shard-1-001/solr.xml
[junit4] 2> 116908 INFO (TEST-DistribCursorPagingTest.test-seed#[3A0D3EFE9E0FFC60]) [ ] o.a.s.c.CoresLocator Config-defined core root directory: /x1/jenkins/jenkins-slave/workspace/Lucene-Solr-Tests-trunk-Java8/solr/build/solr-core/test/J1/temp/solr.cloud.DistribCursorPagingTest_3A0D3EFE9E0FFC60-001/shard-1-001/cores
[junit4] 2> 116908 INFO (TEST-DistribCursorPagingTest.test-seed#[3A0D3EFE9E0FFC60]) [ ] o.a.s.c.CoreContainer New CoreContainer 2031109608
[junit4] 2> 116908 INFO (TEST-DistribCursorPagingTest.test-seed#[3A0D3EFE9E0FFC60]) [ ] o.a.s.c.CoreContainer Loading cores into CoreContainer [instanceDir=/x1/jenkins/jenkins-slave/workspace/Lucene-Solr-Tests-trunk-Java8/solr/build/solr-core/test/J1/temp/solr.cloud.DistribCursorPagingTest_3A0D3EFE9E0FFC60-001/shard-1-001/]
[junit4] 2> 116908 INFO (TEST-DistribCursorPagingTest.test-seed#[3A0D3EFE9E0FFC60]) [ ] o.a.s.c.CoreContainer loading shared library: /x1/jenkins/jenkins-slave/workspace/Lucene-Solr-Tests-trunk-Java8/solr/build/solr-core/test/J1/temp/solr.cloud.DistribCursorPagingTest_3A0D3EFE9E0FFC60-001/shard-1-001/lib
[junit4] 2> 116908 WARN (TEST-DistribCursorPagingTest.test-seed#[3A0D3EFE9E0FFC60]) [ ] o.a.s.c.SolrResourceLoader Can't find (or read) directory to add to classloader: lib (resolved as: /x1/jenkins/jenkins-slave/workspace/Lucene-Solr-Tests-trunk-Java8/solr/build/solr-core/test/J1/temp/solr.cloud.DistribCursorPagingTest_3A0D3EFE9E0FFC60-001/shard-1-001/lib).
[junit4] 2> 116916 INFO (TEST-DistribCursorPagingTest.test-seed#[3A0D3EFE9E0FFC60]) [ ] o.a.s.h.c.HttpShardHandlerFactory created with socketTimeout : 90000,urlScheme : ,connTimeout : 15000,maxConnectionsPerHost : 20,maxConnections : 10000,corePoolSize : 0,maximumPoolSize : 2147483647,maxThreadIdleTime : 5,sizeOfQueue : -1,fairnessPolicy : false,useRetries : false,
[junit4] 2> 116919 INFO (TEST-DistribCursorPagingTest.test-seed#[3A0D3EFE9E0FFC60]) [ ] o.a.s.u.UpdateShardHandler Creating UpdateShardHandler HTTP client with params: socketTimeout=340000&connTimeout=45000&retry=true
[junit4] 2> 116920 INFO (TEST-DistribCursorPagingTest.test-seed#[3A0D3EFE9E0FFC60]) [ ] o.a.s.l.LogWatcher SLF4J impl is org.slf4j.impl.Log4jLoggerFactory
[junit4] 2> 116921 INFO (TEST-DistribCursorPagingTest.test-seed#[3A0D3EFE9E0FFC60]) [ ] o.a.s.l.LogWatcher Registering Log Listener [Log4j (org.slf4j.impl.Log4jLoggerFactory)]
[junit4] 2> 116921 INFO (TEST-DistribCursorPagingTest.test-seed#[3A0D3EFE9E0FFC60]) [ ] o.a.s.c.ZkContainer Zookeeper client=127.0.0.1:50512/solr
[junit4] 2> 116921 INFO (TEST-DistribCursorPagingTest.test-seed#[3A0D3EFE9E0FFC60]) [ ] o.a.s.c.ZkController zkHost includes chroot
[junit4] 2> 116921 INFO (TEST-DistribCursorPagingTest.test-seed#[3A0D3EFE9E0FFC60]) [ ] o.a.s.c.c.SolrZkClient Using default ZkCredentialsProvider
[junit4] 2> 116934 INFO (TEST-DistribCursorPagingTest.test-seed#[3A0D3EFE9E0FFC60]) [ ] o.a.s.c.c.ConnectionManager Waiting for client to connect to ZooKeeper
[junit4] 2> 116949 INFO (zkCallback-56-thread-1) [ ] o.a.s.c.c.ConnectionManager Watcher org.apache.solr.common.cloud.ConnectionManager@651049aa name:ZooKeeperConnection Watcher:127.0.0.1:50512 got event WatchedEvent state:SyncConnected type:None path:null path:null type:None
[junit4] 2> 116950 INFO (TEST-DistribCursorPagingTest.test-seed#[3A0D3EFE9E0FFC60]) [ ] o.a.s.c.c.ConnectionManager Client is connected to ZooKeeper
[junit4] 2> 116951 INFO (TEST-DistribCursorPagingTest.test-seed#[3A0D3EFE9E0FFC60]) [ ] o.a.s.c.c.SolrZkClient Using default ZkACLProvider
[junit4] 2> 116954 INFO (TEST-DistribCursorPagingTest.test-seed#[3A0D3EFE9E0FFC60]) [n:127.0.0.1:35893_ ] o.a.s.c.c.ConnectionManager Waiting for client to connect to ZooKeeper
[junit4] 2> 116961 INFO (zkCallback-57-thread-1-processing-n:127.0.0.1:35893_) [n:127.0.0.1:35893_ ] o.a.s.c.c.ConnectionManager Watcher org.apache.solr.common.cloud.ConnectionManager@76af9a26 name:ZooKeeperConnection Watcher:127.0.0.1:50512/solr got event WatchedEvent state:SyncConnected type:None path:null path:null type:None
[junit4] 2> 116961 INFO (TEST-DistribCursorPagingTest.test-seed#[3A0D3EFE9E0FFC60]) [n:127.0.0.1:35893_ ] o.a.s.c.c.ConnectionManager Client is connected to ZooKeeper
[junit4] 2> 116974 INFO (TEST-DistribCursorPagingTest.test-seed#[3A0D3EFE9E0FFC60]) [n:127.0.0.1:35893_ ] o.a.s.c.c.ZkStateReader Updating cluster state from ZooKeeper...
[junit4] 2> 117981 INFO (TEST-DistribCursorPagingTest.test-seed#[3A0D3EFE9E0FFC60]) [n:127.0.0.1:35893_ ] o.a.s.c.ZkController Register node as live in ZooKeeper:/live_nodes/127.0.0.1:35893_
[junit4] 2> 117982 INFO (TEST-DistribCursorPagingTest.test-seed#[3A0D3EFE9E0FFC60]) [n:127.0.0.1:35893_ ] o.a.s.c.c.SolrZkClient makePath: /live_nodes/127.0.0.1:35893_
[junit4] 2> 117984 INFO (zkCallback-51-thread-1-processing-n:127.0.0.1:40482_) [n:127.0.0.1:40482_ ] o.a.s.c.c.ZkStateReader A live node change: WatchedEvent state:SyncConnected type:NodeChildrenChanged path:/live_nodes, has occurred - updating... (live nodes size: 1)
[junit4] 2> 117984 INFO (zkCallback-57-thread-1-processing-n:127.0.0.1:35893_) [n:127.0.0.1:35893_ ] o.a.s.c.c.ZkStateReader A live node change: WatchedEvent state:SyncConnected type:NodeChildrenChanged path:/live_nodes, has occurred - updating... (live nodes size: 1)
[junit4] 2> 117984 INFO (zkCallback-53-thread-1) [ ] o.a.s.c.c.ZkStateReader A live node change: WatchedEvent state:SyncConnected type:NodeChildrenChanged path:/live_nodes, has occurred - updating... (live nodes size: 1)
[junit4] 2> 117987 INFO (TEST-DistribCursorPagingTest.test-seed#[3A0D3EFE9E0FFC60]) [n:127.0.0.1:35893_ ] o.a.s.c.Overseer Overseer (id=null) closing
[junit4] 2> 117988 INFO (TEST-DistribCursorPagingTest.test-seed#[3A0D3EFE9E0FFC60]) [n:127.0.0.1:35893_ ] o.a.s.c.LeaderElector Joined leadership election with path: /overseer_elect/election/94485802195484681-127.0.0.1:35893_-n_0000000001
[junit4] 2> 117990 INFO (TEST-DistribCursorPagingTest.test-seed#[3A0D3EFE9E0FFC60]) [n:127.0.0.1:35893_ ] o.a.s.c.LeaderElector Watching path /overseer_elect/election/94485802195484677-127.0.0.1:40482_-n_0000000000 to know if I could be the leader
[junit4] 2> 118010 INFO (TEST-DistribCursorPagingTest.test-seed#[3A0D3EFE9E0FFC60]) [n:127.0.0.1:35893_ ] o.a.s.c.CoreContainer Security conf doesn't exist. Skipping setup for authorization module.
[junit4] 2> 118011 INFO (TEST-DistribCursorPagingTest.test-seed#[3A0D3EFE9E0FFC60]) [n:127.0.0.1:35893_ ] o.a.s.c.CoreContainer No authentication plugin used.
[junit4] 2> 118012 INFO (TEST-DistribCursorPagingTest.test-seed#[3A0D3EFE9E0FFC60]) [n:127.0.0.1:35893_ ] o.a.s.c.CoresLocator Looking for core definitions underneath /x1/jenkins/jenkins-slave/workspace/Lucene-Solr-Tests-trunk-Java8/solr/build/solr-core/test/J1/temp/solr.cloud.DistribCursorPagingTest_3A0D3EFE9E0FFC60-001/shard-1-001/cores
[junit4] 2> 118012 INFO (TEST-DistribCursorPagingTest.test-seed#[3A0D3EFE9E0FFC60]) [n:127.0.0.1:35893_ ] o.a.s.c.SolrCore Created CoreDescriptor: {name=collection1, config=solrconfig.xml, transient=false, schema=schema.xml, loadOnStartup=true, configSetProperties=configsetprops.json, instanceDir=/x1/jenkins/jenkins-slave/workspace/Lucene-Solr-Tests-trunk-Java8/solr/build/solr-core/test/J1/temp/solr.cloud.DistribCursorPagingTest_3A0D3EFE9E0FFC60-001/shard-1-001/cores/collection1, collection=collection1, absoluteInstDir=/x1/jenkins/jenkins-slave/workspace/Lucene-Solr-Tests-trunk-Java8/solr/build/solr-core/test/J1/temp/solr.cloud.DistribCursorPagingTest_3A0D3EFE9E0FFC60-001/shard-1-001/cores/collection1/, coreNodeName=, dataDir=data/, shard=}
[junit4] 2> 118013 INFO (TEST-DistribCursorPagingTest.test-seed#[3A0D3EFE9E0FFC60]) [n:127.0.0.1:35893_ ] o.a.s.c.CoresLocator Found core collection1 in /x1/jenkins/jenkins-slave/workspace/Lucene-Solr-Tests-trunk-Java8/solr/build/solr-core/test/J1/temp/solr.cloud.DistribCursorPagingTest_3A0D3EFE9E0FFC60-001/shard-1-001/cores/collection1/
[junit4] 2> 118013 INFO (TEST-DistribCursorPagingTest.test-seed#[3A0D3EFE9E0FFC60]) [n:127.0.0.1:35893_ ] o.a.s.c.CoresLocator Found 1 core definitions
[junit4] 2> 118030 INFO (TEST-DistribCursorPagingTest.test-seed#[3A0D3EFE9E0FFC60]) [n:127.0.0.1:35893_ ] o.a.s.s.SolrDispatchFilter user.dir=/x1/jenkins/jenkins-slave/workspace/Lucene-Solr-Tests-trunk-Java8/solr/build/solr-core/test/J1
[junit4] 2> 118031 INFO (TEST-DistribCursorPagingTest.test-seed#[3A0D3EFE9E0FFC60]) [n:127.0.0.1:35893_ ] o.a.s.s.SolrDispatchFilter SolrDispatchFilter.init() done
[junit4] 2> 118032 INFO (coreLoadExecutor-216-thread-1-processing-n:127.0.0.1:35893_) [n:127.0.0.1:35893_ c:collection1 x:collection1] o.a.s.c.ZkController publishing state=down
[junit4] 2> 118032 INFO (coreLoadExecutor-216-thread-1-processing-n:127.0.0.1:35893_) [n:127.0.0.1:35893_ c:collection1 x:collection1] o.a.s.c.ZkController numShards not found on descriptor - reading it from system property
[junit4] 2> 118034 INFO (OverseerStateUpdate-94485802195484677-127.0.0.1:40482_-n_0000000000) [n:127.0.0.1:40482_ ] o.a.s.c.Overseer processMessage: queueSize: 1, message = {
[junit4] 2> "core":"collection1",
[junit4] 2> "roles":null,
[junit4] 2> "base_url":"https://127.0.0.1:35893",
[junit4] 2> "node_name":"127.0.0.1:35893_",
[junit4] 2> "numShards":"2",
[junit4] 2> "state":"down",
[junit4] 2> "shard":null,
[junit4] 2> "collection":"collection1",
[junit4] 2> "operation":"state"} current state version: 4
[junit4] 2> 118035 INFO (OverseerStateUpdate-94485802195484677-127.0.0.1:40482_-n_0000000000) [n:127.0.0.1:40482_ ] o.a.s.c.o.ReplicaMutator Update state numShards=2 message={
[junit4] 2> "core":"collection1",
[junit4] 2> "roles":null,
[junit4] 2> "base_url":"https://127.0.0.1:35893",
[junit4] 2> "node_name":"127.0.0.1:35893_",
[junit4] 2> "numShards":"2",
[junit4] 2> "state":"down",
[junit4] 2> "shard":null,
[junit4] 2> "collection":"collection1",
[junit4] 2> "operation":"state"}
[junit4] 2> 118035 INFO (OverseerStateUpdate-94485802195484677-127.0.0.1:40482_-n_0000000000) [n:127.0.0.1:40482_ ] o.a.s.c.o.ClusterStateMutator building a new cName: collection1
[junit4] 2> 118036 INFO (OverseerStateUpdate-94485802195484677-127.0.0.1:40482_-n_0000000000) [n:127.0.0.1:40482_ ] o.a.s.c.o.ReplicaMutator Assigning new node to shard shard=shard2
[junit4] 2> 118039 INFO (zkCallback-53-thread-1) [ ] o.a.s.c.c.ZkStateReader A cluster state change: WatchedEvent state:SyncConnected type:NodeDataChanged path:/clusterstate.json, has occurred - updating... (live nodes size: 2)
[junit4] 2> 118039 INFO (zkCallback-57-thread-1-processing-n:127.0.0.1:35893_) [n:127.0.0.1:35893_ ] o.a.s.c.c.ZkStateReader A cluster state change: WatchedEvent state:SyncConnected type:NodeDataChanged path:/clusterstate.json, has occurred - updating... (live nodes size: 2)
[junit4] 2> 118040 INFO (zkCallback-51-thread-1-processing-n:127.0.0.1:40482_) [n:127.0.0.1:40482_ ] o.a.s.c.c.ZkStateReader A cluster state change: WatchedEvent state:SyncConnected type:NodeDataChanged path:/clusterstate.json, has occurred - updating... (live nodes size: 2)
[junit4] 2> 118042 INFO (coreLoadExecutor-216-thread-1-processing-n:127.0.0.1:35893_) [n:127.0.0.1:35893_ c:collection1 x:collection1] o.a.s.c.ZkController look for our core node name
[junit4] 2> 118042 INFO (coreLoadExecutor-216-thread-1-processing-n:127.0.0.1:35893_) [n:127.0.0.1:35893_ c:collection1 x:collection1] o.a.s.c.ZkController waiting to find shard id in clusterstate for collection1
[junit4] 2> 118042 INFO (coreLoadExecutor-216-thread-1-processing-n:127.0.0.1:35893_) [n:127.0.0.1:35893_ c:collection1 x:collection1] o.a.s.c.ZkController Check for collection zkNode:collection1
[junit4] 2> 118043 INFO (coreLoadExecutor-216-thread-1-processing-n:127.0.0.1:35893_) [n:127.0.0.1:35893_ c:collection1 x:collection1] o.a.s.c.ZkController Collection zkNode exists
[junit4] 2> 118043 INFO (coreLoadExecutor-216-thread-1-processing-n:127.0.0.1:35893_) [n:127.0.0.1:35893_ c:collection1 x:collection1] o.a.s.c.c.ZkStateReader Load collection config from:/collections/collection1
[junit4] 2> 118045 INFO (coreLoadExecutor-216-thread-1-processing-n:127.0.0.1:35893_) [n:127.0.0.1:35893_ c:collection1 x:collection1] o.a.s.c.c.ZkStateReader path=/collections/collection1 configName=conf1 specified config exists in ZooKeeper
[junit4] 2> 118045 INFO (coreLoadExecutor-216-thread-1-processing-n:127.0.0.1:35893_) [n:127.0.0.1:35893_ c:collection1 x:collection1] o.a.s.c.SolrResourceLoader new SolrResourceLoader for directory: '/x1/jenkins/jenkins-slave/workspace/Lucene-Solr-Tests-trunk-Java8/solr/build/solr-core/test/J1/temp/solr.cloud.DistribCursorPagingTest_3A0D3EFE9E0FFC60-001/shard-1-001/cores/collection1/'
[junit4] 2> 118060 INFO (coreLoadExecutor-216-thread-1-processing-n:127.0.0.1:35893_) [n:127.0.0.1:35893_ c:collection1 x:collection1] o.a.s.c.Config loaded config solrconfig.xml with version 0
[junit4] 2> 118070 INFO (coreLoadExecutor-216-thread-1-processing-n:127.0.0.1:35893_) [n:127.0.0.1:35893_ c:collection1 x:collection1] o.a.s.c.SolrConfig current version of requestparams : -1
[junit4] 2> 118073 INFO (coreLoadExecutor-216-thread-1-processing-n:127.0.0.1:35893_) [n:127.0.0.1:35893_ c:collection1 x:collection1] o.a.s.c.SolrConfig Using Lucene MatchVersion: 6.0.0
[junit4] 2> 118080 INFO (coreLoadExecutor-216-thread-1-processing-n:127.0.0.1:35893_) [n:127.0.0.1:35893_ c:collection1 x:collection1] o.a.s.c.Config Loaded SolrConfig: solrconfig.xml
[junit4] 2> 118083 INFO (coreLoadExecutor-216-thread-1-processing-n:127.0.0.1:35893_) [n:127.0.0.1:35893_ c:collection1 x:collection1] o.a.s.s.IndexSchema Reading Solr Schema from /configs/conf1/schema.xml
[junit4] 2> 118087 INFO (coreLoadExecutor-216-thread-1-processing-n:127.0.0.1:35893_) [n:127.0.0.1:35893_ c:collection1 x:collection1] o.a.s.s.IndexSchema [collection1] Schema name=sortable
[junit4] 2> 118218 INFO (coreLoadExecutor-216-thread-1-processing-n:127.0.0.1:35893_) [n:127.0.0.1:35893_ c:collection1 x:collection1] o.a.s.s.IndexSchema unique key field: id
[junit4] 2> 118221 INFO (coreLoadExecutor-216-thread-1-processing-n:127.0.0.1:35893_) [n:127.0.0.1:35893_ c:collection1 x:collection1] o.a.s.c.ConfigSetProperties Did not find ConfigSet properties, assuming default properties: Can't find resource 'configsetprops.json' in classpath or '/configs/conf1', cwd=/x1/jenkins/jenkins-slave/workspace/Lucene-Solr-Tests-trunk-Java8/solr/build/solr-core/test/J1
[junit4] 2> 118221 INFO (coreLoadExecutor-216-thread-1-processing-n:127.0.0.1:35893_) [n:127.0.0.1:35893_ c:collection1 x:collection1] o.a.s.c.CoreContainer Creating SolrCore 'collection1' using configuration from collection collection1
[junit4] 2> 118222 INFO (coreLoadExecutor-216-thread-1-processing-n:127.0.0.1:35893_) [n:127.0.0.1:35893_ c:collection1 s:shard2 r:core_node1 x:collection1] o.a.s.c.SolrCore org.apache.solr.core.MockDirectoryFactory
[junit4] 2> 118222 INFO (coreLoadExecutor-216-thread-1-processing-n:127.0.0.1:35893_) [n:127.0.0.1:35893_ c:collection1 s:shard2 r:core_node1 x:collection1] o.a.s.c.SolrCore [[collection1] ] Opening new SolrCore at [/x1/jenkins/jenkins-slave/workspace/Lucene-Solr-Tests-trunk-Java8/solr/build/solr-core/test/J1/temp/solr.cloud.DistribCursorPagingTest_3A0D3EFE9E0FFC60-001/shard-1-001/cores/collection1/], dataDir=[null]
[junit4] 2> 118222 INFO (coreLoadExecutor-216-thread-1-processing-n:127.0.0.1:35893_) [n:127.0.0.1:35893_ c:collection1 s:shard2 r:core_node1 x:collection1] o.a.s.c.SolrCore JMX monitoring not detected for core: collection1
[junit4] 2> 118223 INFO (coreLoadExecutor-216-thread-1-processing-n:127.0.0.1:35893_) [n:127.0.0.1:35893_ c:collection1 s:shard2 r:core_node1 x:collection1] o.a.s.c.CachingDirectoryFactory return new directory for /x1/jenkins/jenkins-slave/workspace/Lucene-Solr-Tests-trunk-Java8/solr/build/solr-core/test/J1/temp/solr.cloud.DistribCursorPagingTest_3A0D3EFE9E0FFC60-001/shard-1-001/cores/collection1/data
[junit4] 2> 118223 INFO (coreLoadExecutor-216-thread-1-processing-n:127.0.0.1:35893_) [n:127.0.0.1:35893_ c:collection1 s:shard2 r:core_node1 x:collection1] o.a.s.c.SolrCore New index directory detected: old=null new=/x1/jenkins/jenkins-slave/workspace/Lucene-Solr-Tests-trunk-Java8/solr/build/solr-core/test/J1/temp/solr.cloud.DistribCursorPagingTest_3A0D3EFE9E0FFC60-001/shard-1-001/cores/collection1/data/index/
[junit4] 2> 118223 WARN (coreLoadExecutor-216-thread-1-processing-n:127.0.0.1:35893_) [n:127.0.0.1:35893_ c:collection1 s:shard2 r:core_node1 x:collection1] o.a.s.c.SolrCore [collection1] Solr index directory '/x1/jenkins/jenkins-slave/workspace/Lucene-Solr-Tests-trunk-Java8/solr/build/solr-core/test/J1/temp/solr.cloud.DistribCursorPagingTest_3A0D3EFE9E0FFC60-001/shard-1-001/cores/collection1/data/index' doesn't exist. Creating new index...
[junit4] 2> 118229 INFO (coreLoadExecutor-216-thread-1-processing-n:127.0.0.1:35893_) [n:127.0.0.1:35893_ c:collection1 s:shard2 r:core_node1 x:collection1] o.a.s.c.CachingDirectoryFactory return new directory for /x1/jenkins/jenkins-slave/workspace/Lucene-Solr-Tests-trunk-Java8/solr/build/solr-core/test/J1/temp/solr.cloud.DistribCursorPagingTest_3A0D3EFE9E0FFC60-001/shard-1-001/cores/collection1/data/index
[junit4] 2> 118232 INFO (coreLoadExecutor-216-thread-1-processing-n:127.0.0.1:35893_) [n:127.0.0.1:35893_ c:collection1 s:shard2 r:core_node1 x:collection1] o.a.s.u.RandomMergePolicy RandomMergePolicy wrapping class org.apache.lucene.index.TieredMergePolicy: [TieredMergePolicy: maxMergeAtOnce=25, maxMergeAtOnceExplicit=11, maxMergedSegmentMB=91.615234375, floorSegmentMB=1.4580078125, forceMergeDeletesPctAllowed=3.0501930119323637, segmentsPerTier=14.0, maxCFSSegmentSizeMB=8.796093022207999E12, noCFSRatio=0.0
[junit4] 2> 118234 INFO (coreLoadExecutor-216-thread-1-processing-n:127.0.0.1:35893_) [n:127.0.0.1:35893_ c:collection1 s:shard2 r:core_node1 x:collection1] o.a.s.c.SolrCore SolrDeletionPolicy.onCommit: commits: num=1
[junit4] 2> commit{dir=MockDirectoryWrapper(RAMDirectory@6e4b59e lockFactory=org.apache.lucene.store.SingleInstanceLockFactory@60de1623),segFN=segments_1,generation=1}
[junit4] 2> 118235 INFO (coreLoadExecutor-216-thread-1-processing-n:127.0.0.1:35893_) [n:127.0.0.1:35893_ c:collection1 s:shard2 r:core_node1 x:collection1] o.a.s.c.SolrCore newest commit generation = 1
[junit4] 2> 118237 INFO (coreLoadExecutor-216-thread-1-processing-n:127.0.0.1:35893_) [n:127.0.0.1:35893_ c:collection1 s:shard2 r:core_node1 x:collection1] o.a.s.c.SolrCore no updateRequestProcessorChain defined as default, creating implicit default
[junit4] 2> 118239 INFO (coreLoadExecutor-216-thread-1-processing-n:127.0.0.1:35893_) [n:127.0.0.1:35893_ c:collection1 s:shard2 r:core_node1 x:collection1] o.a.s.h.l.XMLLoader xsltCacheLifetimeSeconds=60
[junit4] 2> 118240 INFO (coreLoadExecutor-216-thread-1-processing-n:127.0.0.1:35893_) [n:127.0.0.1:35893_ c:collection1 s:shard2 r:core_node1 x:collection1] o.a.s.h.l.XMLLoader xsltCacheLifetimeSeconds=60
[junit4] 2> 118240 INFO (OldIndexDirectoryCleanupThreadForCore-collection1) [n:127.0.0.1:35893_ c:collection1 s:shard2 r:core_node1 x:collection1] o.a.s.c.SolrCore Looking for old index directories to cleanup for core collection1 in /x1/jenkins/jenkins-slave/workspace/Lucene-Solr-Tests-trunk-Java8/solr/build/solr-core/test/J1/temp/solr.cloud.DistribCursorPagingTest_3A0D3EFE9E0FFC60-001/shard-1-001/cores/collection1/data/
[junit4] 2> 118240 WARN (OldIndexDirectoryCleanupThreadForCore-collection1) [n:127.0.0.1:35893_ c:collection1 s:shard2 r:core_node1 x:collection1] o.a.s.c.DirectoryFactory /x1/jenkins/jenkins-slave/workspace/Lucene-Solr-Tests-trunk-Java8/solr/build/solr-core/test/J1/temp/solr.cloud.DistribCursorPagingTest_3A0D3EFE9E0FFC60-001/shard-1-001/cores/collection1/data/ does not point to a valid data directory; skipping clean-up of old index directories.
[junit4] 2> 118242 INFO (coreLoadExecutor-216-thread-1-processing-n:127.0.0.1:35893_) [n:127.0.0.1:35893_ c:collection1 s:shard2 r:core_node1 x:collection1] o.a.s.h.l.XMLLoader xsltCacheLifetimeSeconds=60
[junit4] 2> 118243 INFO (coreLoadExecutor-216-thread-1-processing-n:127.0.0.1:35893_) [n:127.0.0.1:35893_ c:collection1 s:shard2 r:core_node1 x:collection1] o.a.s.h.l.XMLLoader xsltCacheLifetimeSeconds=60
[junit4] 2> 118245 INFO (coreLoadExecutor-216-thread-1-processing-n:127.0.0.1:35893_) [n:127.0.0.1:35893_ c:collection1 s:shard2 r:core_node1 x:collection1] o.a.s.c.RequestHandlers Registered paths: /admin/mbeans,,/update/csv,/update/json/docs,/admin/luke,/select,/admin/segments,/get,/admin/system,/replication,/admin/properties,/config,/schema,/admin/plugins,/admin/logging,/update/json,/admin/threads,/admin/ping,/update,/admin/file
[junit4] 2> 118245 INFO (coreLoadExecutor-216-thread-1-processing-n:127.0.0.1:35893_) [n:127.0.0.1:35893_ c:collection1 s:shard2 r:core_node1 x:collection1] o.a.s.c.SolrCore Using default statsCache cache: org.apache.solr.search.stats.LocalStatsCache
[junit4] 2> 118246 INFO (coreLoadExecutor-216-thread-1-processing-n:127.0.0.1:35893_) [n:127.0.0.1:35893_ c:collection1 s:shard2 r:core_node1 x:collection1] o.a.s.u.UpdateHandler Using UpdateLog implementation: org.apache.solr.update.UpdateLog
[junit4] 2> 118246 INFO (coreLoadExecutor-216-thread-1-processing-n:127.0.0.1:35893_) [n:127.0.0.1:35893_ c:collection1 s:shard2 r:core_node1 x:collection1] o.a.s.u.UpdateLog Initializing UpdateLog: dataDir= defaultSyncLevel=FLUSH numRecordsToKeep=100 maxNumLogsToKeep=10 numVersionBuckets=65536
[junit4] 2> 118247 INFO (coreLoadExecutor-216-thread-1-processing-n:127.0.0.1:35893_) [n:127.0.0.1:35893_ c:collection1 s:shard2 r:core_node1 x:collection1] o.a.s.c.SolrCore Hard AutoCommit: disabled
[junit4] 2> 118247 INFO (coreLoadExecutor-216-thread-1-processing-n:127.0.0.1:35893_) [n:127.0.0.1:35893_ c:collection1 s:shard2 r:core_node1 x:collection1] o.a.s.c.SolrCore Soft AutoCommit: disabled
[junit4] 2> 118247 INFO (coreLoadExecutor-216-thread-1-processing-n:127.0.0.1:35893_) [n:127.0.0.1:35893_ c:collection1 s:shard2 r:core_node1 x:collection1] o.a.s.u.RandomMergePolicy RandomMergePolicy wrapping class org.apache.lucene.index.TieredMergePolicy: [TieredMergePolicy: maxMergeAtOnce=34, maxMergeAtOnceExplicit=12, maxMergedSegmentMB=69.916015625, floorSegmentMB=1.0458984375, forceMergeDeletesPctAllowed=7.365565744881094, segmentsPerTier=20.0, maxCFSSegmentSizeMB=8.796093022207999E12, noCFSRatio=1.0
[junit4] 2> 118248 INFO (coreLoadExecutor-216-thread-1-processing-n:127.0.0.1:35893_) [n:127.0.0.1:35893_ c:collection1 s:shard2 r:core_node1 x:collection1] o.a.s.c.SolrCore SolrDeletionPolicy.onInit: commits: num=1
[junit4] 2> commit{dir=MockDirectoryWrapper(RAMDirectory@6e4b59e lockFactory=org.apache.lucene.store.SingleInstanceLockFactory@60de1623),segFN=segments_1,generation=1}
[junit4] 2> 118249 INFO (coreLoadExecutor-216-thread-1-processing-n:127.0.0.1:35893_) [n:127.0.0.1:35893_ c:collection1 s:shard2 r:core_node1 x:collection1] o.a.s.c.SolrCore newest commit generation = 1
[junit4] 2> 118249 INFO (coreLoadExecutor-216-thread-1-processing-n:127.0.0.1:35893_) [n:127.0.0.1:35893_ c:collection1 s:shard2 r:core_node1 x:collection1] o.a.s.s.SolrIndexSearcher Opening Searcher@4c97aa3e[collection1] main
[junit4] 2> 118249 INFO (coreLoadExecutor-216-thread-1-processing-n:127.0.0.1:35893_) [n:127.0.0.1:35893_ c:collection1 s:shard2 r:core_node1 x:collection1] o.a.s.c.c.ZkStateReader Load collection config from:/collections/collection1
[junit4] 2> 118250 INFO (coreLoadExecutor-216-thread-1-processing-n:127.0.0.1:35893_) [n:127.0.0.1:35893_ c:collection1 s:shard2 r:core_node1 x:collection1] o.a.s.c.c.ZkStateReader path=/collections/collection1 configName=conf1 specified config exists in ZooKeeper
[junit4] 2> 118250 INFO (coreLoadExecutor-216-thread-1-processing-n:127.0.0.1:35893_) [n:127.0.0.1:35893_ c:collection1 s:shard2 r:core_node1 x:collection1] o.a.s.r.ManagedResourceStorage Setting up ZooKeeper-based storage for the RestManager with znodeBase: /configs/conf1
[junit4] 2> 118251 INFO (coreLoadExecutor-216-thread-1-processing-n:127.0.0.1:35893_) [n:127.0.0.1:35893_ c:collection1 s:shard2 r:core_node1 x:collection1] o.a.s.r.ManagedResourceStorage Configured ZooKeeperStorageIO with znodeBase: /configs/conf1
[junit4] 2> 118251 INFO (coreLoadExecutor-216-thread-1-processing-n:127.0.0.1:35893_) [n:127.0.0.1:35893_ c:collection1 s:shard2 r:core_node1 x:collection1] o.a.s.r.RestManager Initializing RestManager with initArgs: {}
[junit4] 2> 118251 INFO (coreLoadExecutor-216-thread-1-processing-n:127.0.0.1:35893_) [n:127.0.0.1:35893_ c:collection1 s:shard2 r:core_node1 x:collection1] o.a.s.r.ManagedResourceStorage Reading _rest_managed.json using ZooKeeperStorageIO:path=/configs/conf1
[junit4] 2> 118252 INFO (coreLoadExecutor-216-thread-1-processing-n:127.0.0.1:35893_) [n:127.0.0.1:35893_ c:collection1 s:shard2 r:core_node1 x:collection1] o.a.s.r.ManagedResourceStorage No data found for znode /configs/conf1/_rest_managed.json
[junit4] 2> 118252 INFO (coreLoadExecutor-216-thread-1-processing-n:127.0.0.1:35893_) [n:127.0.0.1:35893_ c:collection1 s:shard2 r:core_node1 x:collection1] o.a.s.r.ManagedResourceStorage Loaded null at path _rest_managed.json using ZooKeeperStorageIO:path=/configs/conf1
[junit4] 2> 118252 INFO (coreLoadExecutor-216-thread-1-processing-n:127.0.0.1:35893_) [n:127.0.0.1:35893_ c:collection1 s:shard2 r:core_node1 x:collection1] o.a.s.r.RestManager Initializing 0 registered ManagedResources
[junit4] 2> 118252 INFO (coreLoadExecutor-216-thread-1-processing-n:127.0.0.1:35893_) [n:127.0.0.1:35893_ c:collection1 s:shard2 r:core_node1 x:collection1] o.a.s.h.ReplicationHandler Commits will be reserved for 10000
[junit4] 2> 118252 INFO (coreLoadExecutor-216-thread-1-processing-n:127.0.0.1:35893_) [n:127.0.0.1:35893_ c:collection1 s:shard2 r:core_node1 x:collection1] o.a.s.u.UpdateLog Looking up max value of version field to seed version buckets
[junit4] 2> 118252 INFO (coreLoadExecutor-216-thread-1-processing-n:127.0.0.1:35893_) [n:127.0.0.1:35893_ c:collection1 s:shard2 r:core_node1 x:collection1] o.a.s.u.VersionInfo Refreshing highest value of _version_ for 65536 version buckets from index
[junit4] 2> 118253 INFO (coreLoadExecutor-216-thread-1-processing-n:127.0.0.1:35893_) [n:127.0.0.1:35893_ c:collection1 s:shard2 r:core_node1 x:collection1] o.a.s.u.VersionInfo No terms found for
[...truncated too long message...]
.0.1:56660_) [n:127.0.0.1:56660_ c:collection1 s:shard1 r:core_node4 x:collection1] o.a.s.c.CachingDirectoryFactory Closing MockDirectoryFactory - 2 directories currently being tracked
[junit4] 2> 168301 INFO (zkCallback-70-thread-1-processing-n:127.0.0.1:56660_) [n:127.0.0.1:56660_ c:collection1 s:shard1 r:core_node4 x:collection1] o.a.s.c.CachingDirectoryFactory looking to close /x1/jenkins/jenkins-slave/workspace/Lucene-Solr-Tests-trunk-Java8/solr/build/solr-core/test/J1/../../../../../../../../../../x1/jenkins/jenkins-slave/workspace/Lucene-Solr-Tests-trunk-Java8/solr/build/solr-core/test/J1/temp/solr.cloud.DistribCursorPagingTest_3A0D3EFE9E0FFC60-001/shard-4-001/cores/collection1/data [CachedDir<<refCount=0;path=/x1/jenkins/jenkins-slave/workspace/Lucene-Solr-Tests-trunk-Java8/solr/build/solr-core/test/J1/../../../../../../../../../../x1/jenkins/jenkins-slave/workspace/Lucene-Solr-Tests-trunk-Java8/solr/build/solr-core/test/J1/temp/solr.cloud.DistribCursorPagingTest_3A0D3EFE9E0FFC60-001/shard-4-001/cores/collection1/data;done=false>>]
[junit4] 2> 168301 INFO (zkCallback-70-thread-1-processing-n:127.0.0.1:56660_) [n:127.0.0.1:56660_ c:collection1 s:shard1 r:core_node4 x:collection1] o.a.s.c.CachingDirectoryFactory Closing directory: /x1/jenkins/jenkins-slave/workspace/Lucene-Solr-Tests-trunk-Java8/solr/build/solr-core/test/J1/../../../../../../../../../../x1/jenkins/jenkins-slave/workspace/Lucene-Solr-Tests-trunk-Java8/solr/build/solr-core/test/J1/temp/solr.cloud.DistribCursorPagingTest_3A0D3EFE9E0FFC60-001/shard-4-001/cores/collection1/data
[junit4] 2> 168301 INFO (zkCallback-70-thread-1-processing-n:127.0.0.1:56660_) [n:127.0.0.1:56660_ c:collection1 s:shard1 r:core_node4 x:collection1] o.a.s.c.CachingDirectoryFactory looking to close /x1/jenkins/jenkins-slave/workspace/Lucene-Solr-Tests-trunk-Java8/solr/build/solr-core/test/J1/../../../../../../../../../../x1/jenkins/jenkins-slave/workspace/Lucene-Solr-Tests-trunk-Java8/solr/build/solr-core/test/J1/temp/solr.cloud.DistribCursorPagingTest_3A0D3EFE9E0FFC60-001/shard-4-001/cores/collection1/data/index.20150908200227001 [CachedDir<<refCount=0;path=/x1/jenkins/jenkins-slave/workspace/Lucene-Solr-Tests-trunk-Java8/solr/build/solr-core/test/J1/../../../../../../../../../../x1/jenkins/jenkins-slave/workspace/Lucene-Solr-Tests-trunk-Java8/solr/build/solr-core/test/J1/temp/solr.cloud.DistribCursorPagingTest_3A0D3EFE9E0FFC60-001/shard-4-001/cores/collection1/data/index.20150908200227001;done=false>>]
[junit4] 2> 168301 INFO (zkCallback-70-thread-1-processing-n:127.0.0.1:56660_) [n:127.0.0.1:56660_ c:collection1 s:shard1 r:core_node4 x:collection1] o.a.s.c.CachingDirectoryFactory Closing directory: /x1/jenkins/jenkins-slave/workspace/Lucene-Solr-Tests-trunk-Java8/solr/build/solr-core/test/J1/../../../../../../../../../../x1/jenkins/jenkins-slave/workspace/Lucene-Solr-Tests-trunk-Java8/solr/build/solr-core/test/J1/temp/solr.cloud.DistribCursorPagingTest_3A0D3EFE9E0FFC60-001/shard-4-001/cores/collection1/data/index.20150908200227001
[junit4] 2> 168313 INFO (TEST-DistribCursorPagingTest.test-seed#[3A0D3EFE9E0FFC60]) [ ] o.e.j.s.ServerConnector Stopped ServerConnector@34b97c28{SSL-http/1.1}{127.0.0.1:0}
[junit4] 2> 168314 INFO (TEST-DistribCursorPagingTest.test-seed#[3A0D3EFE9E0FFC60]) [ ] o.e.j.s.h.ContextHandler Stopped o.e.j.s.ServletContextHandler@1fc8690e{/,null,UNAVAILABLE}
[junit4] 2> 168317 INFO (TEST-DistribCursorPagingTest.test-seed#[3A0D3EFE9E0FFC60]) [n:127.0.0.1:56660_ c:collection1 s:shard1 r:core_node4 x:collection1] o.a.s.c.ZkTestServer connecting to 127.0.0.1:50512 50512
[junit4] 2> 168532 INFO (Thread-331) [ ] o.a.s.c.ZkTestServer connecting to 127.0.0.1:50512 50512
[junit4] 2> 168534 WARN (Thread-331) [ ] o.a.s.c.ZkTestServer Watch limit violations:
[junit4] 2> Maximum concurrent create/delete watches above limit:
[junit4] 2>
[junit4] 2> 6 /solr/aliases.json
[junit4] 2> 5 /solr/security.json
[junit4] 2> 5 /solr/configs/conf1
[junit4] 2>
[junit4] 2> Maximum concurrent data watches above limit:
[junit4] 2>
[junit4] 2> 6 /solr/clusterstate.json
[junit4] 2>
[junit4] 2> Maximum concurrent children watches above limit:
[junit4] 2>
[junit4] 2> 6 /solr/live_nodes
[junit4] 2> 6 /solr/collections
[junit4] 2> 5 /solr/overseer/queue
[junit4] 2> 5 /solr/overseer/collection-queue-work
[junit4] 2> 5 /solr/overseer/queue-work
[junit4] 2>
[junit4] 2> NOTE: reproduce with: ant test -Dtestcase=DistribCursorPagingTest -Dtests.method=test -Dtests.seed=3A0D3EFE9E0FFC60 -Dtests.multiplier=2 -Dtests.slow=true -Dtests.locale= -Dtests.timezone=Europe/Belfast -Dtests.asserts=true -Dtests.file.encoding=US-ASCII
[junit4] FAILURE 55.0s J1 | DistribCursorPagingTest.test <<<
[junit4] > Throwable #1: java.lang.AssertionError: expected:<1264> but was:<902>
[junit4] > at __randomizedtesting.SeedInfo.seed([3A0D3EFE9E0FFC60:B259012430F39198]:0)
[junit4] > at org.apache.solr.cloud.DistribCursorPagingTest.doRandomSortsOnLargeIndex(DistribCursorPagingTest.java:599)
[junit4] > at org.apache.solr.cloud.DistribCursorPagingTest.test(DistribCursorPagingTest.java:93)
[junit4] > at org.apache.solr.BaseDistributedSearchTestCase$ShardsRepeatRule$ShardsFixedStatement.callStatement(BaseDistributedSearchTestCase.java:963)
[junit4] > at org.apache.solr.BaseDistributedSearchTestCase$ShardsRepeatRule$ShardsStatement.evaluate(BaseDistributedSearchTestCase.java:938)
[junit4] > at java.lang.Thread.run(Thread.java:745)
[junit4] 2> 168568 INFO (SUITE-DistribCursorPagingTest-seed#[3A0D3EFE9E0FFC60]-worker) [n:127.0.0.1:56660_ c:collection1 s:shard1 r:core_node4 x:collection1] o.a.s.SolrTestCaseJ4 ###deleteCore
[junit4] 2> NOTE: leaving temporary files on disk at: /x1/jenkins/jenkins-slave/workspace/Lucene-Solr-Tests-trunk-Java8/solr/build/solr-core/test/J1/temp/solr.cloud.DistribCursorPagingTest_3A0D3EFE9E0FFC60-001
[junit4] 2> Sep 08, 2015 3:03:00 PM com.carrotsearch.randomizedtesting.ThreadLeakControl checkThreadLeaks
[junit4] 2> WARNING: Will linger awaiting termination of 1 leaked thread(s).
[junit4] 2> 169769 WARN (OverseerStateUpdate-94485802195484690-127.0.0.1:56660_-n_0000000004) [n:127.0.0.1:56660_ ] o.a.s.c.Overseer Solr cannot talk to ZK, exiting Overseer main queue loop
[junit4] 2> org.apache.zookeeper.KeeperException$SessionExpiredException: KeeperErrorCode = Session expired for /overseer/queue/qn-0000000024
[junit4] 2> at org.apache.zookeeper.KeeperException.create(KeeperException.java:127)
[junit4] 2> at org.apache.zookeeper.KeeperException.create(KeeperException.java:51)
[junit4] 2> at org.apache.zookeeper.ZooKeeper.getData(ZooKeeper.java:1155)
[junit4] 2> at org.apache.solr.common.cloud.SolrZkClient$7.execute(SolrZkClient.java:353)
[junit4] 2> at org.apache.solr.common.cloud.SolrZkClient$7.execute(SolrZkClient.java:350)
[junit4] 2> at org.apache.solr.common.cloud.ZkCmdExecutor.retryOperation(ZkCmdExecutor.java:61)
[junit4] 2> at org.apache.solr.common.cloud.SolrZkClient.getData(SolrZkClient.java:350)
[junit4] 2> at org.apache.solr.cloud.DistributedQueue.removeFirst(DistributedQueue.java:384)
[junit4] 2> at org.apache.solr.cloud.DistributedQueue.poll(DistributedQueue.java:187)
[junit4] 2> at org.apache.solr.cloud.Overseer$ClusterStateUpdater.run(Overseer.java:229)
[junit4] 2> at java.lang.Thread.run(Thread.java:745)
[junit4] 2> 169770 INFO (OverseerStateUpdate-94485802195484690-127.0.0.1:56660_-n_0000000004) [n:127.0.0.1:56660_ ] o.a.s.c.Overseer Overseer Loop exiting : 127.0.0.1:56660_
[junit4] 2> NOTE: test params are: codec=CheapBastard, sim=DefaultSimilarity, locale=, timezone=Europe/Belfast
[junit4] 2> NOTE: Linux 3.13.0-52-generic amd64/Oracle Corporation 1.8.0_45 (64-bit)/cpus=4,threads=1,free=186141504,total=382730240
[junit4] 2> NOTE: All tests run in this JVM: [BufferStoreTest, CachingDirectoryFactoryTest, PreAnalyzedFieldTest, TestDistributedGrouping, HdfsLockFactoryTest, RuleEngineTest, TestTrie, TestClusterStateMutator, TestSurroundQueryParser, SliceStateTest, BaseCdcrDistributedZkTest, SSLMigrationTest, DistributedExpandComponentTest, TestMissingGroups, VMParamsZkACLAndCredentialsProvidersTest, DistribCursorPagingTest]
[junit4] Completed [46/544] on J1 in 56.31s, 1 test, 1 failure <<< FAILURES!
[...truncated 1562 lines...]
BUILD FAILED
/x1/jenkins/jenkins-slave/workspace/Lucene-Solr-Tests-trunk-Java8/build.xml:775: The following error occurred while executing this line:
/x1/jenkins/jenkins-slave/workspace/Lucene-Solr-Tests-trunk-Java8/build.xml:719: The following error occurred while executing this line:
/x1/jenkins/jenkins-slave/workspace/Lucene-Solr-Tests-trunk-Java8/build.xml:59: The following error occurred while executing this line:
/x1/jenkins/jenkins-slave/workspace/Lucene-Solr-Tests-trunk-Java8/solr/build.xml:233: The following error occurred while executing this line:
/x1/jenkins/jenkins-slave/workspace/Lucene-Solr-Tests-trunk-Java8/solr/common-build.xml:514: The following error occurred while executing this line:
/x1/jenkins/jenkins-slave/workspace/Lucene-Solr-Tests-trunk-Java8/lucene/common-build.xml:1432: The following error occurred while executing this line:
/x1/jenkins/jenkins-slave/workspace/Lucene-Solr-Tests-trunk-Java8/lucene/common-build.xml:987: There were test failures: 544 suites, 2141 tests, 1 failure, 47 ignored (35 assumptions)
Total time: 57 minutes 3 seconds
Build step 'Invoke Ant' marked build as failure
Archiving artifacts
Sending artifact delta relative to Lucene-Solr-Tests-trunk-Java8 #375
Archived 4 artifacts
Archive block size is 32768
Received 0 blocks and 331984827 bytes
Compression is 0.0%
Took 57 sec
Recording test results
Email was triggered for: Failure
Sending email for trigger: Failure