You are viewing a plain text version of this content. The canonical link for it is here.
Posted to dev@atlas.apache.org by Apache Jenkins Server <je...@builds.apache.org> on 2018/06/06 00:33:11 UTC

Build failed in Jenkins: Atlas-master-UnitTests #1588

See <https://builds.apache.org/job/Atlas-master-UnitTests/1588/display/redirect>

------------------------------------------
[...truncated 172.76 KB...]
[INFO] 
[INFO] --- maven-compiler-plugin:3.7.0:compile (default-compile) @ atlas-repository ---
[INFO] Changes detected - recompiling the module!
[INFO] Compiling 131 source files to <https://builds.apache.org/job/Atlas-master-UnitTests/ws/repository/target/classes>
[INFO] <https://builds.apache.org/job/Atlas-master-UnitTests/ws/repository/src/main/java/org/apache/atlas/repository/converters/AtlasInstanceConverter.java>: Some input files use or override a deprecated API.
[INFO] <https://builds.apache.org/job/Atlas-master-UnitTests/ws/repository/src/main/java/org/apache/atlas/repository/converters/AtlasInstanceConverter.java>: Recompile with -Xlint:deprecation for details.
[INFO] <https://builds.apache.org/job/Atlas-master-UnitTests/ws/repository/src/main/java/org/apache/atlas/repository/store/graph/v2/AtlasGraphUtilsV2.java>: Some input files use unchecked or unsafe operations.
[INFO] <https://builds.apache.org/job/Atlas-master-UnitTests/ws/repository/src/main/java/org/apache/atlas/repository/store/graph/v2/AtlasGraphUtilsV2.java>: Recompile with -Xlint:unchecked for details.
[INFO] 
[INFO] --- maven-resources-plugin:2.7:testResources (default-testResources) @ atlas-repository ---
[INFO] Using 'UTF-8' encoding to copy filtered resources.
[INFO] Copying 40 resources
[INFO] Copying 3 resources
[INFO] 
[INFO] --- maven-compiler-plugin:3.7.0:testCompile (default-testCompile) @ atlas-repository ---
[INFO] Changes detected - recompiling the module!
[INFO] Compiling 49 source files to <https://builds.apache.org/job/Atlas-master-UnitTests/ws/repository/target/test-classes>
[INFO] <https://builds.apache.org/job/Atlas-master-UnitTests/ws/repository/src/test/java/org/apache/atlas/query/BasicTestSetup.java>: <https://builds.apache.org/job/Atlas-master-UnitTests/ws/repository/src/test/java/org/apache/atlas/query/BasicTestSetup.java> uses or overrides a deprecated API.
[INFO] <https://builds.apache.org/job/Atlas-master-UnitTests/ws/repository/src/test/java/org/apache/atlas/query/BasicTestSetup.java>: Recompile with -Xlint:deprecation for details.
[INFO] <https://builds.apache.org/job/Atlas-master-UnitTests/ws/repository/src/test/java/org/apache/atlas/repository/migration/MigrationBaseAsserts.java>: Some input files use unchecked or unsafe operations.
[INFO] <https://builds.apache.org/job/Atlas-master-UnitTests/ws/repository/src/test/java/org/apache/atlas/repository/migration/MigrationBaseAsserts.java>: Recompile with -Xlint:unchecked for details.
[INFO] 
[INFO] --- maven-surefire-plugin:2.18.1:test (default-test) @ atlas-repository ---
[INFO] Surefire report directory: <https://builds.apache.org/job/Atlas-master-UnitTests/ws/repository/target/surefire-reports>
[INFO] Using configured provider org.apache.maven.surefire.testng.TestNGProvider

-------------------------------------------------------
 T E S T S
-------------------------------------------------------
Running org.apache.atlas.glossary.PaginationHelperTest
Running org.apache.atlas.services.MetricsServiceTest
Running org.apache.atlas.query.GremlinQueryComposerTest
Running org.apache.atlas.glossary.GlossaryServiceTest
Running org.apache.atlas.repository.impexp.AtlasImportRequestTest
Running org.apache.atlas.query.DSLParsingTest
Running org.apache.atlas.repository.migration.RelationshipCacheGeneratorTest
Running org.apache.atlas.repository.store.graph.v2.InverseReferenceUpdateV2Test
Running org.apache.atlas.query.DSLQueriesTest
Running org.apache.atlas.repository.impexp.TypeAttributeDifferenceTest
Running org.apache.atlas.repository.migration.PathTest
Running org.apache.atlas.repository.store.graph.v2.InverseReferenceUpdateHardDeleteV2Test
Running org.apache.atlas.repository.userprofile.UserProfileServiceTest
Running org.apache.atlas.repository.impexp.ImportTransformerTest
Running org.apache.atlas.repository.migration.TypesWithCollectionsFinderTest
Running org.apache.atlas.repository.impexp.ImportTransformsTest
Running org.apache.atlas.repository.migration.TypesDefScrubberTest
Running org.apache.atlas.repository.impexp.ImportServiceTest
Running org.apache.atlas.repository.impexp.ZipSourceTest
Running org.apache.atlas.repository.store.graph.v2.InverseReferenceUpdateSoftDeleteV2Test
Running org.apache.atlas.repository.audit.CassandraAuditRepositoryTest
Running org.apache.atlas.repository.migration.HiveStocksTest
Running org.apache.atlas.repository.audit.InMemoryAuditRepositoryTest
Running org.apache.atlas.repository.store.graph.v2.AtlasRelationshipStoreV2Test
Running org.apache.atlas.utils.ObjectUpdateSynchronizerTest
Running org.apache.atlas.repository.migration.HiveParititionTest
Running org.apache.atlas.repository.impexp.ExportServiceTest
Running org.apache.atlas.repository.impexp.ImportTransformerJSONTest
Running org.apache.atlas.repository.store.graph.v2.AtlasEntityStoreV2Test
Running org.apache.atlas.repository.impexp.UniqueListTest
Running org.apache.atlas.repository.impexp.ZipSinkTest
Running org.apache.atlas.repository.migration.MigrationProgressServiceTest
Running org.apache.atlas.repository.store.graph.v2.AtlasRelationshipDefStoreV2Test
Running org.apache.atlas.repository.store.graph.v2.AtlasComplexAttributesTest
Running org.apache.atlas.repository.migration.TypesWithClassificationTest
Running org.apache.atlas.repository.store.graph.v2.AtlasRelationshipStoreHardDeleteV2Test
Running org.apache.atlas.repository.store.graph.v2.AtlasRelationshipStoreSoftDeleteV2Test
Running org.apache.atlas.repository.migration.ComplexAttributesTest
Running org.apache.atlas.repository.tagpropagation.ClassificationPropagationTest
Running org.apache.atlas.repository.store.graph.v2.AtlasEntityStoreV2BulkImportPercentTest
Running org.apache.atlas.TestModules
Running org.apache.atlas.utils.TestResourceFileUtils
Running org.apache.atlas.repository.store.graph.v2.AtlasEntityDefStoreV2Test
Running org.apache.atlas.repository.store.graph.AtlasTypeDefGraphStoreTest
Tests run: 4, Failures: 0, Errors: 0, Skipped: 0, Time elapsed: 2.916 sec - in org.apache.atlas.repository.impexp.UniqueListTest
Tests run: 0, Failures: 0, Errors: 0, Skipped: 0, Time elapsed: 3.047 sec - in org.apache.atlas.repository.store.graph.v2.AtlasRelationshipStoreV2Test
Tests run: 0, Failures: 0, Errors: 0, Skipped: 0, Time elapsed: 3.303 sec - in org.apache.atlas.repository.store.graph.v2.InverseReferenceUpdateV2Test
Tests run: 0, Failures: 0, Errors: 0, Skipped: 0, Time elapsed: 2.575 sec - in org.apache.atlas.utils.TestResourceFileUtils
Tests run: 8, Failures: 0, Errors: 0, Skipped: 0, Time elapsed: 3.494 sec - in org.apache.atlas.repository.impexp.ImportTransformerTest
Tests run: 6, Failures: 0, Errors: 0, Skipped: 0, Time elapsed: 3.319 sec - in org.apache.atlas.repository.audit.InMemoryAuditRepositoryTest
Tests run: 20, Failures: 0, Errors: 0, Skipped: 0, Time elapsed: 3.926 sec - in org.apache.atlas.glossary.PaginationHelperTest
Tests run: 0, Failures: 0, Errors: 0, Skipped: 0, Time elapsed: 2.979 sec - in org.apache.atlas.TestModules
Tests run: 6, Failures: 0, Errors: 0, Skipped: 0, Time elapsed: 4.679 sec - in org.apache.atlas.repository.impexp.TypeAttributeDifferenceTest
Tests run: 8, Failures: 0, Errors: 0, Skipped: 0, Time elapsed: 5.573 sec - in org.apache.atlas.query.DSLParsingTest
Tests run: 9, Failures: 0, Errors: 0, Skipped: 0, Time elapsed: 4.992 sec - in org.apache.atlas.repository.store.graph.v2.AtlasEntityStoreV2BulkImportPercentTest
Tests run: 3, Failures: 0, Errors: 0, Skipped: 0, Time elapsed: 5.738 sec - in org.apache.atlas.repository.impexp.ImportTransformsTest
Tests run: 8, Failures: 0, Errors: 0, Skipped: 0, Time elapsed: 5.551 sec - in org.apache.atlas.repository.impexp.ZipSinkTest
Tests run: 6, Failures: 0, Errors: 0, Skipped: 0, Time elapsed: 6.322 sec - in org.apache.atlas.repository.impexp.AtlasImportRequestTest
Tests run: 1, Failures: 0, Errors: 0, Skipped: 0, Time elapsed: 6.152 sec - in org.apache.atlas.repository.impexp.ImportTransformerJSONTest
Tests run: 9, Failures: 0, Errors: 0, Skipped: 0, Time elapsed: 6.302 sec - in org.apache.atlas.utils.ObjectUpdateSynchronizerTest
Tests run: 1, Failures: 0, Errors: 0, Skipped: 0, Time elapsed: 6.607 sec - in org.apache.atlas.repository.migration.TypesDefScrubberTest
Tests run: 6, Failures: 0, Errors: 0, Skipped: 0, Time elapsed: 6.626 sec - in org.apache.atlas.repository.impexp.ZipSourceTest
Tests run: 4, Failures: 0, Errors: 0, Skipped: 0, Time elapsed: 6.518 sec - in org.apache.atlas.repository.migration.MigrationProgressServiceTest
Tests run: 39, Failures: 3, Errors: 0, Skipped: 0, Time elapsed: 12.468 sec <<< FAILURE! - in org.apache.atlas.query.GremlinQueryComposerTest
classification(org.apache.atlas.query.GremlinQueryComposerTest)  Time elapsed: 0.032 sec  <<< FAILURE!
java.lang.AssertionError: PII expected [g.V().outE('classifiedAs').has('__name', within('PII')).has('__state', 'ACTIVE').outV().dedup().limit(25).toList()] but found [g.V().outE('classifiedAs').has('__name', within('PII')).outV().dedup().limit(25).toList()]
	at org.testng.Assert.fail(Assert.java:94)
	at org.testng.Assert.failNotEquals(Assert.java:496)
	at org.testng.Assert.assertEquals(Assert.java:125)
	at org.testng.Assert.assertEquals(Assert.java:178)
	at org.apache.atlas.query.GremlinQueryComposerTest.verify(GremlinQueryComposerTest.java:354)
	at org.apache.atlas.query.GremlinQueryComposerTest.verify(GremlinQueryComposerTest.java:363)
	at org.apache.atlas.query.GremlinQueryComposerTest.classification(GremlinQueryComposerTest.java:40)

dimension(org.apache.atlas.query.GremlinQueryComposerTest)  Time elapsed: 0.034 sec  <<< FAILURE!
java.lang.AssertionError: Table isa Dimension expected [g.V().has('__typeName', 'Table').outE('classifiedAs').has('__name', within('Dimension')).has('__state', 'ACTIVE').outV().dedup().limit(25).toList()] but found [g.V().has('__typeName', 'Table').outE('classifiedAs').has('__name', within('Dimension')).outV().dedup().limit(25).toList()]
	at org.testng.Assert.fail(Assert.java:94)
	at org.testng.Assert.failNotEquals(Assert.java:496)
	at org.testng.Assert.assertEquals(Assert.java:125)
	at org.testng.Assert.assertEquals(Assert.java:178)
	at org.apache.atlas.query.GremlinQueryComposerTest.verify(GremlinQueryComposerTest.java:354)
	at org.apache.atlas.query.GremlinQueryComposerTest.verify(GremlinQueryComposerTest.java:363)
	at org.apache.atlas.query.GremlinQueryComposerTest.dimension(GremlinQueryComposerTest.java:46)

keywordsInWhereClause(org.apache.atlas.query.GremlinQueryComposerTest)  Time elapsed: 0.027 sec  <<< FAILURE!
java.lang.AssertionError: Table as t where t has name and t isa Dimension expected [g.V().has('__typeName', 'Table').as('t').and(__.has('Table.name'),__.outE('classifiedAs').has('__name', within('Dimension')).has('__state', 'ACTIVE').outV()).dedup().limit(25).toList()] but found [g.V().has('__typeName', 'Table').as('t').and(__.has('Table.name'),__.outE('classifiedAs').has('__name', within('Dimension')).outV()).dedup().limit(25).toList()]
	at org.testng.Assert.fail(Assert.java:94)
	at org.testng.Assert.failNotEquals(Assert.java:496)
	at org.testng.Assert.assertEquals(Assert.java:125)
	at org.testng.Assert.assertEquals(Assert.java:178)
	at org.apache.atlas.query.GremlinQueryComposerTest.verify(GremlinQueryComposerTest.java:354)
	at org.apache.atlas.query.GremlinQueryComposerTest.verify(GremlinQueryComposerTest.java:363)
	at org.apache.atlas.query.GremlinQueryComposerTest.keywordsInWhereClause(GremlinQueryComposerTest.java:297)

Tests run: 6, Failures: 0, Errors: 0, Skipped: 0, Time elapsed: 25.386 sec - in org.apache.atlas.repository.audit.CassandraAuditRepositoryTest
Tests run: 1, Failures: 0, Errors: 0, Skipped: 0, Time elapsed: 31.558 sec - in org.apache.atlas.services.MetricsServiceTest
Tests run: 1, Failures: 0, Errors: 0, Skipped: 0, Time elapsed: 40.403 sec - in org.apache.atlas.repository.store.graph.v2.AtlasEntityDefStoreV2Test
Tests run: 10, Failures: 0, Errors: 0, Skipped: 0, Time elapsed: 45.268 sec - in org.apache.atlas.repository.store.graph.v2.AtlasRelationshipDefStoreV2Test
Tests run: 1, Failures: 0, Errors: 0, Skipped: 0, Time elapsed: 54.929 sec - in org.apache.atlas.repository.migration.TypesWithCollectionsFinderTest
Tests run: 1, Failures: 0, Errors: 0, Skipped: 0, Time elapsed: 57.25 sec - in org.apache.atlas.repository.migration.RelationshipCacheGeneratorTest
Tests run: 4, Failures: 0, Errors: 0, Skipped: 0, Time elapsed: 60.283 sec - in org.apache.atlas.repository.store.graph.v2.AtlasRelationshipStoreHardDeleteV2Test
Tests run: 5, Failures: 0, Errors: 0, Skipped: 0, Time elapsed: 62.614 sec - in org.apache.atlas.repository.store.graph.v2.InverseReferenceUpdateHardDeleteV2Test
Tests run: 5, Failures: 0, Errors: 0, Skipped: 0, Time elapsed: 63.937 sec - in org.apache.atlas.repository.store.graph.v2.InverseReferenceUpdateSoftDeleteV2Test
Tests run: 4, Failures: 0, Errors: 0, Skipped: 0, Time elapsed: 65.067 sec - in org.apache.atlas.repository.store.graph.v2.AtlasRelationshipStoreSoftDeleteV2Test
Tests run: 7, Failures: 0, Errors: 0, Skipped: 0, Time elapsed: 67.342 sec - in org.apache.atlas.repository.store.graph.v2.AtlasComplexAttributesTest
Tests run: 12, Failures: 0, Errors: 0, Skipped: 0, Time elapsed: 69.586 sec - in org.apache.atlas.repository.userprofile.UserProfileServiceTest
Tests run: 12, Failures: 0, Errors: 0, Skipped: 0, Time elapsed: 71.444 sec - in org.apache.atlas.repository.impexp.ExportServiceTest
Tests run: 18, Failures: 0, Errors: 0, Skipped: 0, Time elapsed: 75.808 sec - in org.apache.atlas.repository.store.graph.AtlasTypeDefGraphStoreTest
Tests run: 35, Failures: 0, Errors: 0, Skipped: 0, Time elapsed: 77.965 sec - in org.apache.atlas.glossary.GlossaryServiceTest
Tests run: 16, Failures: 0, Errors: 0, Skipped: 0, Time elapsed: 79.786 sec - in org.apache.atlas.repository.store.graph.v2.AtlasEntityStoreV2Test
Tests run: 1, Failures: 0, Errors: 0, Skipped: 0, Time elapsed: 79.952 sec - in org.apache.atlas.repository.migration.TypesWithClassificationTest
Tests run: 1, Failures: 0, Errors: 0, Skipped: 0, Time elapsed: 83.864 sec - in org.apache.atlas.repository.migration.PathTest
Tests run: 1, Failures: 0, Errors: 0, Skipped: 0, Time elapsed: 84.544 sec - in org.apache.atlas.repository.migration.HiveParititionTest
Tests run: 1, Failures: 0, Errors: 0, Skipped: 0, Time elapsed: 86.921 sec - in org.apache.atlas.repository.migration.HiveStocksTest
Tests run: 1, Failures: 0, Errors: 0, Skipped: 0, Time elapsed: 86.543 sec - in org.apache.atlas.repository.migration.ComplexAttributesTest
Tests run: 14, Failures: 0, Errors: 0, Skipped: 0, Time elapsed: 90.967 sec - in org.apache.atlas.repository.impexp.ImportServiceTest
Tests run: 9, Failures: 0, Errors: 0, Skipped: 0, Time elapsed: 94.494 sec - in org.apache.atlas.repository.tagpropagation.ClassificationPropagationTest
Tests run: 246, Failures: 0, Errors: 0, Skipped: 0, Time elapsed: 149.29 sec - in org.apache.atlas.query.DSLQueriesTest

Results :

Failed tests: 
  GremlinQueryComposerTest.classification:40->verify:363->verify:354 PII expected [g.V().outE('classifiedAs').has('__name', within('PII')).has('__state', 'ACTIVE').outV().dedup().limit(25).toList()] but found [g.V().outE('classifiedAs').has('__name', within('PII')).outV().dedup().limit(25).toList()]
  GremlinQueryComposerTest.dimension:46->verify:363->verify:354 Table isa Dimension expected [g.V().has('__typeName', 'Table').outE('classifiedAs').has('__name', within('Dimension')).has('__state', 'ACTIVE').outV().dedup().limit(25).toList()] but found [g.V().has('__typeName', 'Table').outE('classifiedAs').has('__name', within('Dimension')).outV().dedup().limit(25).toList()]
  GremlinQueryComposerTest.keywordsInWhereClause:297->verify:363->verify:354 Table as t where t has name and t isa Dimension expected [g.V().has('__typeName', 'Table').as('t').and(__.has('Table.name'),__.outE('classifiedAs').has('__name', within('Dimension')).has('__state', 'ACTIVE').outV()).dedup().limit(25).toList()] but found [g.V().has('__typeName', 'Table').as('t').and(__.has('Table.name'),__.outE('classifiedAs').has('__name', within('Dimension')).outV()).dedup().limit(25).toList()]

Tests run: 550, Failures: 3, Errors: 0, Skipped: 0

[INFO] ------------------------------------------------------------------------
[INFO] Reactor Summary:
[INFO] 
[INFO] Apache Atlas Server Build Tools .................... SUCCESS [  0.504 s]
[INFO] apache-atlas ....................................... SUCCESS [  1.885 s]
[INFO] Apache Atlas Test Utility Tools .................... SUCCESS [  4.738 s]
[INFO] Open Connector Framework (OCF) ..................... SUCCESS [  1.569 s]
[INFO] Open Metadata Repository Services (OMRS) ........... SUCCESS [  5.159 s]
[INFO] Open Metadata and Governance (OMAG) Server APIs .... SUCCESS [  0.789 s]
[INFO] Connected Asset Open Metadata Access Service (OMAS)  SUCCESS [  0.819 s]
[INFO] Asset Consumer Open Metadata Access Service (OMAS) . SUCCESS [  0.789 s]
[INFO] Open Metadata and Governance (OMAG) Server ......... SUCCESS [  1.096 s]
[INFO] Apache Atlas Integration ........................... SUCCESS [ 31.514 s]
[INFO] Apache Atlas Common ................................ SUCCESS [  2.339 s]
[INFO] Apache Atlas Client ................................ SUCCESS [  0.114 s]
[INFO] atlas-client-common ................................ SUCCESS [  0.651 s]
[INFO] atlas-client-v1 .................................... SUCCESS [  3.091 s]
[INFO] Apache Atlas Server API ............................ SUCCESS [  0.749 s]
[INFO] Apache Atlas Notification .......................... SUCCESS [ 14.858 s]
[INFO] atlas-client-v2 .................................... SUCCESS [  0.652 s]
[INFO] Apache Atlas Graph Database Projects ............... SUCCESS [  0.072 s]
[INFO] Apache Atlas Graph Database API .................... SUCCESS [  0.522 s]
[INFO] Graph Database Common Code ......................... SUCCESS [  0.650 s]
[INFO] Apache Atlas JanusGraph DB Impl .................... SUCCESS [02:26 min]
[INFO] Apache Atlas Graph Database Implementation Dependencies SUCCESS [  1.648 s]
[INFO] Shaded version of Apache hbase client .............. SUCCESS [  6.805 s]
[INFO] Shaded version of Apache hbase server .............. SUCCESS [ 17.960 s]
[INFO] Apache Atlas Authorization ......................... SUCCESS [  2.432 s]
[INFO] Apache Atlas Repository ............................ FAILURE [02:39 min]
[INFO] Apache Atlas UI .................................... SKIPPED
[INFO] Apache Atlas Web Application ....................... SKIPPED
[INFO] Apache Atlas Documentation ......................... SKIPPED
[INFO] Apache Atlas FileSystem Model ...................... SKIPPED
[INFO] Apache Atlas Plugin Classloader .................... SKIPPED
[INFO] Apache Atlas Hive Bridge Shim ...................... SKIPPED
[INFO] Apache Atlas Hive Bridge ........................... SKIPPED
[INFO] Apache Atlas Falcon Bridge Shim .................... SKIPPED
[INFO] Apache Atlas Falcon Bridge ......................... SKIPPED
[INFO] Apache Atlas Sqoop Bridge Shim ..................... SKIPPED
[INFO] Apache Atlas Sqoop Bridge .......................... SKIPPED
[INFO] Apache Atlas Storm Bridge Shim ..................... SKIPPED
[INFO] Apache Atlas Storm Bridge .......................... SKIPPED
[INFO] Apache Atlas Hbase Bridge Shim ..................... SKIPPED
[INFO] Apache Atlas Hbase Bridge .......................... SKIPPED
[INFO] Apache Atlas Kafka Bridge .......................... SKIPPED
[INFO] Apache Atlas Distribution .......................... SKIPPED
[INFO] ------------------------------------------------------------------------
[INFO] BUILD FAILURE
[INFO] ------------------------------------------------------------------------
[INFO] Total time: 06:49 min
[INFO] Finished at: 2018-06-06T00:32:59Z
[INFO] Final Memory: 144M/1957M
[INFO] ------------------------------------------------------------------------
[ERROR] Failed to execute goal org.apache.maven.plugins:maven-surefire-plugin:2.18.1:test (default-test) on project atlas-repository: There are test failures.
[ERROR] 
[ERROR] Please refer to <https://builds.apache.org/job/Atlas-master-UnitTests/ws/repository/target/surefire-reports> for the individual test results.
[ERROR] -> [Help 1]
[ERROR] 
[ERROR] To see the full stack trace of the errors, re-run Maven with the -e switch.
[ERROR] Re-run Maven using the -X switch to enable full debug logging.
[ERROR] 
[ERROR] For more information about the errors and possible solutions, please read the following articles:
[ERROR] [Help 1] http://cwiki.apache.org/confluence/display/MAVEN/MojoFailureException
[ERROR] 
[ERROR] After correcting the problems, you can resume the build with the command
[ERROR]   mvn <goals> -rf :atlas-repository
Build step 'Execute shell' marked build as failure
[CHECKSTYLE] Collecting checkstyle analysis files...
[CHECKSTYLE] Searching for all files in <https://builds.apache.org/job/Atlas-master-UnitTests/ws/> that match the pattern **/target/checkstyle-result.xml
[CHECKSTYLE] No files found. Configuration error?
<Git Blamer> Using GitBlamer to create author and commit information for all warnings.
<Git Blamer> GIT_COMMIT=595c87808a737374236bc63e0e5ed3c907969f7d, workspace=<https://builds.apache.org/job/Atlas-master-UnitTests/ws/>
[CHECKSTYLE] Computing warning deltas based on reference build #1586
[FINDBUGS] Collecting findbugs analysis files...
[FINDBUGS] Searching for all files in <https://builds.apache.org/job/Atlas-master-UnitTests/ws/> that match the pattern **/target/findbugs.xml
[FINDBUGS] No files found. Configuration error?
<Git Blamer> Using GitBlamer to create author and commit information for all warnings.
<Git Blamer> GIT_COMMIT=595c87808a737374236bc63e0e5ed3c907969f7d, workspace=<https://builds.apache.org/job/Atlas-master-UnitTests/ws/>
[FINDBUGS] Computing warning deltas based on reference build #1586
Archiving artifacts
TestNG Reports Processing: START
Looking for TestNG results report in workspace using pattern: **/target/surefire-reports/testng-results.xml,**/target/failsafe-reports/testng-results.xml
Saving reports...
Processing '/x1/jenkins/jenkins-home/jobs/Atlas-master-UnitTests/builds/1588/testng/testng-results-1.xml'
Processing '/x1/jenkins/jenkins-home/jobs/Atlas-master-UnitTests/builds/1588/testng/testng-results-2.xml'
Processing '/x1/jenkins/jenkins-home/jobs/Atlas-master-UnitTests/builds/1588/testng/testng-results-3.xml'
Processing '/x1/jenkins/jenkins-home/jobs/Atlas-master-UnitTests/builds/1588/testng/testng-results-4.xml'
Processing '/x1/jenkins/jenkins-home/jobs/Atlas-master-UnitTests/builds/1588/testng/testng-results-5.xml'
Processing '/x1/jenkins/jenkins-home/jobs/Atlas-master-UnitTests/builds/1588/testng/testng-results-6.xml'
Processing '/x1/jenkins/jenkins-home/jobs/Atlas-master-UnitTests/builds/1588/testng/testng-results-7.xml'
Processing '/x1/jenkins/jenkins-home/jobs/Atlas-master-UnitTests/builds/1588/testng/testng-results.xml'
TestNG Reports Processing: FINISH

Jenkins build is back to normal : Atlas-master-UnitTests #1589

Posted by Apache Jenkins Server <je...@builds.apache.org>.
See <https://builds.apache.org/job/Atlas-master-UnitTests/1589/display/redirect?page=changes>