You are viewing a plain text version of this content. The canonical link for it is here.
Posted to builds@beam.apache.org by Apache Jenkins Server <je...@builds.apache.org> on 2019/11/05 16:36:09 UTC

Build failed in Jenkins: beam_PostCommit_Py_VR_Dataflow #5001

See <https://builds.apache.org/job/beam_PostCommit_Py_VR_Dataflow/5001/display/redirect?page=changes>

Changes:

[mxm] Use better name for Flink current key supplier

[lgajowy] [BEAM-8558] Fix BigQueryIOIT flakiness (#9995)


------------------------------------------
[...truncated 595.82 KB...]
            "encoding": {
              "@type": "kind:windowed_value",
              "component_encodings": [
                {
                  "@type": "kind:pair",
                  "component_encodings": [
                    {
                      "@type": "kind:bytes"
                    },
                    {
                      "@type": "FastPrimitivesCoder$eNprYE5OLEhMzkiNT0pNzNVLzk9JLSqGUlxuicUlAUWZuZklmWWpxc4gQa5CBs3GQsbaQqYIfgYGhvi0xJycpMTk7HiwlkJ8pgVkJmfnpEJNYQGawlpbyJZUnKQHACYlLgM=",
                      "component_encodings": [
                        {
                          "@type": "FastPrimitivesCoder$eNprYE5OLEhMzkiNT0pNzNVLzk9JLSqGUlxuicUlAUWZuZklmWWpxc4gQa5CBs3GQsbaQqYIfgYGhvi0xJycpMTk7HiwlkJ8pgVkJmfnpEJNYQGawlpbyJZUnKQHACYlLgM=",
                          "component_encodings": [],
                          "pipeline_proto_coder_id": "ref_Coder_FastPrimitivesCoder_3"
                        },
                        {
                          "@type": "FastPrimitivesCoder$eNprYE5OLEhMzkiNT0pNzNVLzk9JLSqGUlxuicUlAUWZuZklmWWpxc4gQa5CBs3GQsbaQqYIfgYGhvi0xJycpMTk7HiwlkJ8pgVkJmfnpEJNYQGawlpbyJZUnKQHACYlLgM=",
                          "component_encodings": [],
                          "pipeline_proto_coder_id": "ref_Coder_FastPrimitivesCoder_3"
                        }
                      ],
                      "is_pair_like": true,
                      "pipeline_proto_coder_id": "ref_Coder_FastPrimitivesCoder_3"
                    }
                  ],
                  "is_pair_like": true
                },
                {
                  "@type": "kind:global_window"
                }
              ],
              "is_wrapper": true
            },
            "output_name": "out",
            "user_name": "Map(<lambda at sideinputs_test.py:238>)/MapToVoidKey1.out"
          }
        ],
        "parallel_input": {
          "@type": "OutputReference",
          "output_name": "out",
          "step_name": "s4"
        },
        "serialized_fn": "ref_AppliedPTransform_Map(<lambda at sideinputs_test.py:238>)/MapToVoidKey1_24",
        "user_name": "Map(<lambda at sideinputs_test.py:238>)/MapToVoidKey1"
      }
    }
  ],
  "type": "JOB_TYPE_STREAMING"
}
root: INFO: Create job: <Job
 createTime: '2019-11-05T16:21:00.870198Z'
 currentStateTime: '1970-01-01T00:00:00Z'
 id: '2019-11-05_08_20_59-17558144775234027111'
 location: 'us-central1'
 name: 'beamapp-jenkins-1105162048-725589'
 projectId: 'apache-beam-testing'
 stageStates: []
 startTime: '2019-11-05T16:21:00.870198Z'
 steps: []
 tempFiles: []
 type: TypeValueValuesEnum(JOB_TYPE_STREAMING, 2)>
root: INFO: Created job with id: [2019-11-05_08_20_59-17558144775234027111]
root: INFO: To access the Dataflow monitoring console, please navigate to https://console.cloud.google.com/dataflow/jobsDetail/locations/us-central1/jobs/2019-11-05_08_20_59-17558144775234027111?project=apache-beam-testing
root: WARNING: Waiting indefinitely for streaming job.
root: INFO: Job 2019-11-05_08_20_59-17558144775234027111 is in state JOB_STATE_RUNNING
root: INFO: 2019-11-05T16:21:03.247Z: JOB_MESSAGE_DETAILED: Checking permissions granted to controller Service Account.
root: INFO: 2019-11-05T16:21:04.012Z: JOB_MESSAGE_BASIC: Worker configuration: n1-standard-4 in us-central1-f.
root: INFO: 2019-11-05T16:21:04.669Z: JOB_MESSAGE_DETAILED: Expanding SplittableParDo operations into optimizable parts.
root: INFO: 2019-11-05T16:21:04.671Z: JOB_MESSAGE_DETAILED: Expanding CollectionToSingleton operations into optimizable parts.
root: INFO: 2019-11-05T16:21:04.684Z: JOB_MESSAGE_DETAILED: Expanding CoGroupByKey operations into optimizable parts.
root: INFO: 2019-11-05T16:21:04.694Z: JOB_MESSAGE_DEBUG: Combiner lifting skipped for step Map(<lambda at sideinputs_test.py:238>)/_UnpickledSideInput(MapToVoidKey1.out.0)/GroupByKey: GroupByKey not followed by a combiner.
root: INFO: 2019-11-05T16:21:04.696Z: JOB_MESSAGE_DEBUG: Combiner lifting skipped for step Map(<lambda at sideinputs_test.py:238>)/_UnpickledSideInput(MapToVoidKey0.out.0)/GroupByKey: GroupByKey not followed by a combiner.
root: INFO: 2019-11-05T16:21:04.706Z: JOB_MESSAGE_DETAILED: Expanding SplittableProcessKeyed operations into optimizable parts.
root: INFO: 2019-11-05T16:21:04.709Z: JOB_MESSAGE_DETAILED: Expanding GroupByKey operations into streaming Read/Write steps
root: INFO: 2019-11-05T16:21:04.729Z: JOB_MESSAGE_DEBUG: Annotating graph with Autotuner information.
root: INFO: 2019-11-05T16:21:04.765Z: JOB_MESSAGE_DETAILED: Fusing adjacent ParDo, Read, Write, and Flatten operations
root: INFO: 2019-11-05T16:21:04.772Z: JOB_MESSAGE_DETAILED: Fusing consumer Map(<lambda at sideinputs_test.py:238>)/MapToVoidKey0 into side list/Decode Values
root: INFO: 2019-11-05T16:21:04.785Z: JOB_MESSAGE_DETAILED: Fusing consumer Map(<lambda at sideinputs_test.py:238>)/MapToVoidKey1 into side list/Decode Values
root: INFO: 2019-11-05T16:21:04.789Z: JOB_MESSAGE_DETAILED: Fusing consumer Map(<lambda at sideinputs_test.py:238>)/MapToVoidKey0 into side list/Decode Values
root: INFO: 2019-11-05T16:21:04.794Z: JOB_MESSAGE_DETAILED: Fusing consumer Map(<lambda at sideinputs_test.py:238>)/MapToVoidKey1 into side list/Decode Values
root: INFO: 2019-11-05T16:21:04.797Z: JOB_MESSAGE_DETAILED: Unzipping flatten s16 for input s14.out
root: INFO: 2019-11-05T16:21:04.802Z: JOB_MESSAGE_DETAILED: Fusing unzipped copy of assert_that/Group/GroupByKey/WriteStream, through flatten assert_that/Group/Flatten, into producer assert_that/Group/pair_with_0
root: INFO: 2019-11-05T16:21:04.807Z: JOB_MESSAGE_DETAILED: Fusing consumer assert_that/Group/GroupByKey/WriteStream into assert_that/Group/pair_with_1
root: INFO: 2019-11-05T16:21:04.811Z: JOB_MESSAGE_DETAILED: Fusing consumer side list/Decode Values into side list/Impulse
root: INFO: 2019-11-05T16:21:04.814Z: JOB_MESSAGE_DETAILED: Fusing consumer Map(<lambda at sideinputs_test.py:238>)/_UnpickledSideInput(MapToVoidKey0.out.0)/PairWithVoidKey into Map(<lambda at sideinputs_test.py:238>)/MapToVoidKey0
root: INFO: 2019-11-05T16:21:04.817Z: JOB_MESSAGE_DETAILED: Fusing consumer Map(<lambda at sideinputs_test.py:238>)/_UnpickledSideInput(MapToVoidKey0.out.0)/GroupByKey/WriteStream into Map(<lambda at sideinputs_test.py:238>)/_UnpickledSideInput(MapToVoidKey0.out.0)/PairWithVoidKey
root: INFO: 2019-11-05T16:21:04.819Z: JOB_MESSAGE_DETAILED: Fusing consumer Map(<lambda at sideinputs_test.py:238>)/_UnpickledSideInput(MapToVoidKey0.out.0)/GroupByKey/MergeBuckets into Map(<lambda at sideinputs_test.py:238>)/_UnpickledSideInput(MapToVoidKey0.out.0)/GroupByKey/ReadStream
root: INFO: 2019-11-05T16:21:04.823Z: JOB_MESSAGE_DETAILED: Fusing consumer Map(<lambda at sideinputs_test.py:238>)/_UnpickledSideInput(MapToVoidKey0.out.0)/Values into Map(<lambda at sideinputs_test.py:238>)/_UnpickledSideInput(MapToVoidKey0.out.0)/GroupByKey/MergeBuckets
root: INFO: 2019-11-05T16:21:04.830Z: JOB_MESSAGE_DETAILED: Fusing consumer Map(<lambda at sideinputs_test.py:238>)/_UnpickledSideInput(MapToVoidKey0.out.0)/StreamingPCollectionViewWriter into Map(<lambda at sideinputs_test.py:238>)/_UnpickledSideInput(MapToVoidKey0.out.0)/Values
root: INFO: 2019-11-05T16:21:04.832Z: JOB_MESSAGE_DETAILED: Fusing consumer Map(<lambda at sideinputs_test.py:238>)/_UnpickledSideInput(MapToVoidKey1.out.0)/PairWithVoidKey into Map(<lambda at sideinputs_test.py:238>)/MapToVoidKey1
root: INFO: 2019-11-05T16:21:04.835Z: JOB_MESSAGE_DETAILED: Fusing consumer Map(<lambda at sideinputs_test.py:238>)/_UnpickledSideInput(MapToVoidKey1.out.0)/GroupByKey/WriteStream into Map(<lambda at sideinputs_test.py:238>)/_UnpickledSideInput(MapToVoidKey1.out.0)/PairWithVoidKey
root: INFO: 2019-11-05T16:21:04.838Z: JOB_MESSAGE_DETAILED: Fusing consumer Map(<lambda at sideinputs_test.py:238>)/_UnpickledSideInput(MapToVoidKey1.out.0)/GroupByKey/MergeBuckets into Map(<lambda at sideinputs_test.py:238>)/_UnpickledSideInput(MapToVoidKey1.out.0)/GroupByKey/ReadStream
root: INFO: 2019-11-05T16:21:04.841Z: JOB_MESSAGE_DETAILED: Fusing consumer Map(<lambda at sideinputs_test.py:238>)/_UnpickledSideInput(MapToVoidKey1.out.0)/Values into Map(<lambda at sideinputs_test.py:238>)/_UnpickledSideInput(MapToVoidKey1.out.0)/GroupByKey/MergeBuckets
root: INFO: 2019-11-05T16:21:04.843Z: JOB_MESSAGE_DETAILED: Fusing consumer Map(<lambda at sideinputs_test.py:238>)/_UnpickledSideInput(MapToVoidKey1.out.0)/StreamingPCollectionViewWriter into Map(<lambda at sideinputs_test.py:238>)/_UnpickledSideInput(MapToVoidKey1.out.0)/Values
root: INFO: 2019-11-05T16:21:04.845Z: JOB_MESSAGE_DETAILED: Fusing consumer main input/Decode Values into main input/Impulse
root: INFO: 2019-11-05T16:21:04.848Z: JOB_MESSAGE_DETAILED: Fusing consumer assert_that/Create/Decode Values into assert_that/Create/Impulse
root: INFO: 2019-11-05T16:21:04.850Z: JOB_MESSAGE_DETAILED: Fusing consumer assert_that/Group/pair_with_0 into assert_that/Create/Decode Values
root: INFO: 2019-11-05T16:21:04.853Z: JOB_MESSAGE_DETAILED: Fusing consumer Map(<lambda at sideinputs_test.py:238>)/Map(<lambda at sideinputs_test.py:238>) into main input/Decode Values
root: INFO: 2019-11-05T16:21:04.855Z: JOB_MESSAGE_DETAILED: Fusing consumer assert_that/WindowInto(WindowIntoFn) into Map(<lambda at sideinputs_test.py:238>)/Map(<lambda at sideinputs_test.py:238>)
root: INFO: 2019-11-05T16:21:04.862Z: JOB_MESSAGE_DETAILED: Fusing consumer assert_that/ToVoidKey into assert_that/WindowInto(WindowIntoFn)
root: INFO: 2019-11-05T16:21:04.865Z: JOB_MESSAGE_DETAILED: Fusing consumer assert_that/Group/pair_with_1 into assert_that/ToVoidKey
root: INFO: 2019-11-05T16:21:04.868Z: JOB_MESSAGE_DETAILED: Fusing consumer assert_that/Group/GroupByKey/MergeBuckets into assert_that/Group/GroupByKey/ReadStream
root: INFO: 2019-11-05T16:21:04.873Z: JOB_MESSAGE_DETAILED: Fusing consumer assert_that/Group/Map(_merge_tagged_vals_under_key) into assert_that/Group/GroupByKey/MergeBuckets
root: INFO: 2019-11-05T16:21:04.875Z: JOB_MESSAGE_DETAILED: Fusing consumer assert_that/Unkey into assert_that/Group/Map(_merge_tagged_vals_under_key)
root: INFO: 2019-11-05T16:21:04.878Z: JOB_MESSAGE_DETAILED: Fusing consumer assert_that/Match into assert_that/Unkey
root: INFO: 2019-11-05T16:21:04.896Z: JOB_MESSAGE_DEBUG: Adding StepResource setup and teardown to workflow graph.
root: INFO: 2019-11-05T16:21:04.918Z: JOB_MESSAGE_DEBUG: Adding workflow start and stop steps.
root: INFO: 2019-11-05T16:21:04.980Z: JOB_MESSAGE_DEBUG: Assigning stage ids.
root: INFO: 2019-11-05T16:21:05.186Z: JOB_MESSAGE_DEBUG: Executing wait step start2
root: INFO: 2019-11-05T16:21:05.199Z: JOB_MESSAGE_DEBUG: Starting worker pool setup.
root: INFO: 2019-11-05T16:21:05.204Z: JOB_MESSAGE_BASIC: Starting 1 workers...
root: INFO: 2019-11-05T16:21:07.422Z: JOB_MESSAGE_BASIC: Executing operation assert_that/Create/Impulse+assert_that/Create/Decode Values+assert_that/Group/pair_with_0+assert_that/Group/GroupByKey/WriteStream
root: INFO: 2019-11-05T16:21:07.424Z: JOB_MESSAGE_BASIC: Executing operation side list/Impulse+side list/Decode Values+Map(<lambda at sideinputs_test.py:238>)/MapToVoidKey0+Map(<lambda at sideinputs_test.py:238>)/MapToVoidKey1+Map(<lambda at sideinputs_test.py:238>)/MapToVoidKey0+Map(<lambda at sideinputs_test.py:238>)/MapToVoidKey1+Map(<lambda at sideinputs_test.py:238>)/_UnpickledSideInput(MapToVoidKey0.out.0)/PairWithVoidKey+Map(<lambda at sideinputs_test.py:238>)/_UnpickledSideInput(MapToVoidKey0.out.0)/GroupByKey/WriteStream+Map(<lambda at sideinputs_test.py:238>)/_UnpickledSideInput(MapToVoidKey1.out.0)/PairWithVoidKey+Map(<lambda at sideinputs_test.py:238>)/_UnpickledSideInput(MapToVoidKey1.out.0)/GroupByKey/WriteStream
root: INFO: 2019-11-05T16:21:07.425Z: JOB_MESSAGE_BASIC: Executing operation Map(<lambda at sideinputs_test.py:238>)/_UnpickledSideInput(MapToVoidKey0.out.0)/GroupByKey/ReadStream+Map(<lambda at sideinputs_test.py:238>)/_UnpickledSideInput(MapToVoidKey0.out.0)/GroupByKey/MergeBuckets+Map(<lambda at sideinputs_test.py:238>)/_UnpickledSideInput(MapToVoidKey0.out.0)/Values+Map(<lambda at sideinputs_test.py:238>)/_UnpickledSideInput(MapToVoidKey0.out.0)/StreamingPCollectionViewWriter
root: INFO: 2019-11-05T16:21:07.425Z: JOB_MESSAGE_BASIC: Executing operation main input/Impulse+main input/Decode Values+Map(<lambda at sideinputs_test.py:238>)/Map(<lambda at sideinputs_test.py:238>)+assert_that/WindowInto(WindowIntoFn)+assert_that/ToVoidKey+assert_that/Group/pair_with_1+assert_that/Group/GroupByKey/WriteStream
root: INFO: 2019-11-05T16:21:07.425Z: JOB_MESSAGE_BASIC: Executing operation Map(<lambda at sideinputs_test.py:238>)/_UnpickledSideInput(MapToVoidKey1.out.0)/GroupByKey/ReadStream+Map(<lambda at sideinputs_test.py:238>)/_UnpickledSideInput(MapToVoidKey1.out.0)/GroupByKey/MergeBuckets+Map(<lambda at sideinputs_test.py:238>)/_UnpickledSideInput(MapToVoidKey1.out.0)/Values+Map(<lambda at sideinputs_test.py:238>)/_UnpickledSideInput(MapToVoidKey1.out.0)/StreamingPCollectionViewWriter
root: INFO: 2019-11-05T16:21:07.484Z: JOB_MESSAGE_BASIC: Executing operation assert_that/Group/GroupByKey/ReadStream+assert_that/Group/GroupByKey/MergeBuckets+assert_that/Group/Map(_merge_tagged_vals_under_key)+assert_that/Unkey+assert_that/Match
root: INFO: 2019-11-05T16:21:39.341Z: JOB_MESSAGE_DEBUG: Executing input step topology_init_attach_disk_input_step
root: INFO: 2019-11-05T16:21:39.342Z: JOB_MESSAGE_DETAILED: Checking permissions granted to controller Service Account.
root: INFO: 2019-11-05T16:21:40.119Z: JOB_MESSAGE_BASIC: Worker configuration: n1-standard-4 in us-central1-f.
root: INFO: 2019-11-05T16:21:45.898Z: JOB_MESSAGE_WARNING: Your project already contains 100 Dataflow-created metric descriptors and Stackdriver will not create new Dataflow custom metrics for this job. Each unique user-defined metric name (independent of the DoFn in which it is defined) produces a new metric descriptor. To delete old / unused metric descriptors see https://developers.google.com/apis-explorer/#p/monitoring/v3/monitoring.projects.metricDescriptors.list and https://developers.google.com/apis-explorer/#p/monitoring/v3/monitoring.projects.metricDescriptors.delete
root: INFO: 2019-11-05T16:21:49.543Z: JOB_MESSAGE_DETAILED: Workers have started successfully.
root: INFO: 2019-11-05T16:24:50.731Z: JOB_MESSAGE_ERROR: Workflow failed.
root: INFO: 2019-11-05T16:24:50.765Z: JOB_MESSAGE_BASIC: Finished operation main input/Impulse+main input/Decode Values+Map(<lambda at sideinputs_test.py:238>)/Map(<lambda at sideinputs_test.py:238>)+assert_that/WindowInto(WindowIntoFn)+assert_that/ToVoidKey+assert_that/Group/pair_with_1+assert_that/Group/GroupByKey/WriteStream
root: INFO: 2019-11-05T16:24:50.765Z: JOB_MESSAGE_BASIC: Finished operation Map(<lambda at sideinputs_test.py:238>)/_UnpickledSideInput(MapToVoidKey1.out.0)/GroupByKey/ReadStream+Map(<lambda at sideinputs_test.py:238>)/_UnpickledSideInput(MapToVoidKey1.out.0)/GroupByKey/MergeBuckets+Map(<lambda at sideinputs_test.py:238>)/_UnpickledSideInput(MapToVoidKey1.out.0)/Values+Map(<lambda at sideinputs_test.py:238>)/_UnpickledSideInput(MapToVoidKey1.out.0)/StreamingPCollectionViewWriter
root: INFO: 2019-11-05T16:24:50.765Z: JOB_MESSAGE_BASIC: Finished operation side list/Impulse+side list/Decode Values+Map(<lambda at sideinputs_test.py:238>)/MapToVoidKey0+Map(<lambda at sideinputs_test.py:238>)/MapToVoidKey1+Map(<lambda at sideinputs_test.py:238>)/MapToVoidKey0+Map(<lambda at sideinputs_test.py:238>)/MapToVoidKey1+Map(<lambda at sideinputs_test.py:238>)/_UnpickledSideInput(MapToVoidKey0.out.0)/PairWithVoidKey+Map(<lambda at sideinputs_test.py:238>)/_UnpickledSideInput(MapToVoidKey0.out.0)/GroupByKey/WriteStream+Map(<lambda at sideinputs_test.py:238>)/_UnpickledSideInput(MapToVoidKey1.out.0)/PairWithVoidKey+Map(<lambda at sideinputs_test.py:238>)/_UnpickledSideInput(MapToVoidKey1.out.0)/GroupByKey/WriteStream
root: INFO: 2019-11-05T16:24:50.765Z: JOB_MESSAGE_BASIC: Finished operation assert_that/Group/GroupByKey/ReadStream+assert_that/Group/GroupByKey/MergeBuckets+assert_that/Group/Map(_merge_tagged_vals_under_key)+assert_that/Unkey+assert_that/Match
root: INFO: 2019-11-05T16:24:50.765Z: JOB_MESSAGE_BASIC: Finished operation assert_that/Create/Impulse+assert_that/Create/Decode Values+assert_that/Group/pair_with_0+assert_that/Group/GroupByKey/WriteStream
root: INFO: 2019-11-05T16:24:50.765Z: JOB_MESSAGE_BASIC: Finished operation Map(<lambda at sideinputs_test.py:238>)/_UnpickledSideInput(MapToVoidKey0.out.0)/GroupByKey/ReadStream+Map(<lambda at sideinputs_test.py:238>)/_UnpickledSideInput(MapToVoidKey0.out.0)/GroupByKey/MergeBuckets+Map(<lambda at sideinputs_test.py:238>)/_UnpickledSideInput(MapToVoidKey0.out.0)/Values+Map(<lambda at sideinputs_test.py:238>)/_UnpickledSideInput(MapToVoidKey0.out.0)/StreamingPCollectionViewWriter
root: INFO: 2019-11-05T16:24:50.942Z: JOB_MESSAGE_DETAILED: Cleaning up.
root: INFO: 2019-11-05T16:24:50.978Z: JOB_MESSAGE_BASIC: Worker pool stopped.
root: INFO: 2019-11-05T16:24:50.983Z: JOB_MESSAGE_DEBUG: Tearing down pending resources...
root: INFO: 2019-11-05T16:24:50.986Z: JOB_MESSAGE_DEBUG: Starting worker pool teardown.
root: INFO: 2019-11-05T16:24:50.991Z: JOB_MESSAGE_BASIC: Stopping worker pool...
root: INFO: 2019-11-05T16:26:59.514Z: JOB_MESSAGE_BASIC: Worker pool stopped.
root: INFO: Job 2019-11-05_08_20_59-17558144775234027111 is in state JOB_STATE_FAILED
--------------------- >> end captured logging << ---------------------
Worker logs: https://console.cloud.google.com/dataflow/jobsDetail/locations/us-central1/jobs/2019-11-05_08_13_14-15504374441596474729?project=apache-beam-testing
Worker logs: https://console.cloud.google.com/dataflow/jobsDetail/locations/us-central1/jobs/2019-11-05_08_20_59-17558144775234027111?project=apache-beam-testing
Worker logs: https://console.cloud.google.com/dataflow/jobsDetail/locations/us-central1/jobs/2019-11-05_08_27_24-4262470970099411852?project=apache-beam-testing
Worker logs: https://console.cloud.google.com/dataflow/jobsDetail/locations/us-central1/jobs/2019-11-05_08_13_12-5054503341101533323?project=apache-beam-testing
Worker logs: https://console.cloud.google.com/dataflow/jobsDetail/locations/us-central1/jobs/2019-11-05_08_21_03-6244623372719450150?project=apache-beam-testing
Worker logs: https://console.cloud.google.com/dataflow/jobsDetail/locations/us-central1/jobs/2019-11-05_08_13_09-10083022992928075516?project=apache-beam-testing
Worker logs: https://console.cloud.google.com/dataflow/jobsDetail/locations/us-central1/jobs/2019-11-05_08_21_19-14087906936106358789?project=apache-beam-testing
Worker logs: https://console.cloud.google.com/dataflow/jobsDetail/locations/us-central1/jobs/2019-11-05_08_13_09-7485298380027035090?project=apache-beam-testing
Worker logs: https://console.cloud.google.com/dataflow/jobsDetail/locations/us-central1/jobs/2019-11-05_08_20_39-12203090815230170035?project=apache-beam-testing
Worker logs: https://console.cloud.google.com/dataflow/jobsDetail/locations/us-central1/jobs/2019-11-05_08_13_11-11789193972090782660?project=apache-beam-testing
Worker logs: https://console.cloud.google.com/dataflow/jobsDetail/locations/us-central1/jobs/2019-11-05_08_21_01-12689228911859819057?project=apache-beam-testing
Worker logs: https://console.cloud.google.com/dataflow/jobsDetail/locations/us-central1/jobs/2019-11-05_08_13_11-8287393720120704347?project=apache-beam-testing
Worker logs: https://console.cloud.google.com/dataflow/jobsDetail/locations/us-central1/jobs/2019-11-05_08_21_32-6066051397382903224?project=apache-beam-testing
Worker logs: https://console.cloud.google.com/dataflow/jobsDetail/locations/us-central1/jobs/2019-11-05_08_13_09-4016796377060778038?project=apache-beam-testing
Worker logs: https://console.cloud.google.com/dataflow/jobsDetail/locations/us-central1/jobs/2019-11-05_08_20_46-2377117318378990016?project=apache-beam-testing
Worker logs: https://console.cloud.google.com/dataflow/jobsDetail/locations/us-central1/jobs/2019-11-05_08_13_09-15439222666675043450?project=apache-beam-testing
Worker logs: https://console.cloud.google.com/dataflow/jobsDetail/locations/us-central1/jobs/2019-11-05_08_21_11-7618805584518602511?project=apache-beam-testing

----------------------------------------------------------------------
XML: nosetests-validatesRunnerStreamingTests-df-py36.xml
----------------------------------------------------------------------
XML: <https://builds.apache.org/job/beam_PostCommit_Py_VR_Dataflow/ws/src/sdks/python/nosetests.xml>
----------------------------------------------------------------------
Ran 17 tests in 1393.283s

FAILED (errors=1)

> Task :sdks:python:test-suites:dataflow:py36:validatesRunnerStreamingTests FAILED

FAILURE: Build completed with 5 failures.

1: Task failed with an exception.
-----------
* Where:
Build file '<https://builds.apache.org/job/beam_PostCommit_Py_VR_Dataflow/ws/src/sdks/python/test-suites/dataflow/py2/build.gradle'> line: 107

* What went wrong:
Execution failed for task ':sdks:python:test-suites:dataflow:py2:validatesRunnerBatchTests'.
> Process 'command 'sh'' finished with non-zero exit value 1

* Try:
Run with --stacktrace option to get the stack trace. Run with --info or --debug option to get more log output. Run with --scan to get full insights.
==============================================================================

2: Task failed with an exception.
-----------
* Where:
Build file '<https://builds.apache.org/job/beam_PostCommit_Py_VR_Dataflow/ws/src/sdks/python/test-suites/dataflow/py36/build.gradle'> line: 78

* What went wrong:
Execution failed for task ':sdks:python:test-suites:dataflow:py36:validatesRunnerBatchTests'.
> Process 'command 'sh'' finished with non-zero exit value 1

* Try:
Run with --stacktrace option to get the stack trace. Run with --info or --debug option to get more log output. Run with --scan to get full insights.
==============================================================================

3: Task failed with an exception.
-----------
* Where:
Build file '<https://builds.apache.org/job/beam_PostCommit_Py_VR_Dataflow/ws/src/sdks/python/test-suites/dataflow/py35/build.gradle'> line: 78

* What went wrong:
Execution failed for task ':sdks:python:test-suites:dataflow:py35:validatesRunnerBatchTests'.
> Process 'command 'sh'' finished with non-zero exit value 1

* Try:
Run with --stacktrace option to get the stack trace. Run with --info or --debug option to get more log output. Run with --scan to get full insights.
==============================================================================

4: Task failed with an exception.
-----------
* Where:
Build file '<https://builds.apache.org/job/beam_PostCommit_Py_VR_Dataflow/ws/src/sdks/python/test-suites/dataflow/py35/build.gradle'> line: 101

* What went wrong:
Execution failed for task ':sdks:python:test-suites:dataflow:py35:validatesRunnerStreamingTests'.
> Process 'command 'sh'' finished with non-zero exit value 1

* Try:
Run with --stacktrace option to get the stack trace. Run with --info or --debug option to get more log output. Run with --scan to get full insights.
==============================================================================

5: Task failed with an exception.
-----------
* Where:
Build file '<https://builds.apache.org/job/beam_PostCommit_Py_VR_Dataflow/ws/src/sdks/python/test-suites/dataflow/py36/build.gradle'> line: 101

* What went wrong:
Execution failed for task ':sdks:python:test-suites:dataflow:py36:validatesRunnerStreamingTests'.
> Process 'command 'sh'' finished with non-zero exit value 1

* Try:
Run with --stacktrace option to get the stack trace. Run with --info or --debug option to get more log output. Run with --scan to get full insights.
==============================================================================

* Get more help at https://help.gradle.org

Deprecated Gradle features were used in this build, making it incompatible with Gradle 6.0.
Use '--warning-mode all' to show the individual deprecation warnings.
See https://docs.gradle.org/5.2.1/userguide/command_line_interface.html#sec:command_line_warnings

BUILD FAILED in 48m 28s
74 actionable tasks: 57 executed, 17 from cache

Publishing build scan...
https://gradle.com/s/oidtjoaaassnu

Build step 'Invoke Gradle script' changed build result to FAILURE
Build step 'Invoke Gradle script' marked build as failure

---------------------------------------------------------------------
To unsubscribe, e-mail: builds-unsubscribe@beam.apache.org
For additional commands, e-mail: builds-help@beam.apache.org


Jenkins build is back to normal : beam_PostCommit_Py_VR_Dataflow #5002

Posted by Apache Jenkins Server <je...@builds.apache.org>.
See <https://builds.apache.org/job/beam_PostCommit_Py_VR_Dataflow/5002/display/redirect?page=changes>


---------------------------------------------------------------------
To unsubscribe, e-mail: builds-unsubscribe@beam.apache.org
For additional commands, e-mail: builds-help@beam.apache.org