You are viewing a plain text version of this content. The canonical link for it is here.
Posted to builds@mesos.apache.org by Apache Jenkins Server <je...@builds.apache.org> on 2017/02/06 21:35:28 UTC
Build failed in Jenkins: Mesos-Buildbot » cmake,gcc,--verbose --enable-libevent --enable-ssl,GLOG_v=1 MESOS_VERBOSE=1,ubuntu:14.04,(docker||Hadoop)&&(!ubuntu-us1)&&(!ubuntu-eu2) #3234
See <https://builds.apache.org/job/Mesos-Buildbot/BUILDTOOL=cmake,COMPILER=gcc,CONFIGURATION=--verbose%20--enable-libevent%20--enable-ssl,ENVIRONMENT=GLOG_v=1%20MESOS_VERBOSE=1,OS=ubuntu%3A14.04,label_exp=(docker%7C%7CHadoop)&&(!ubuntu-us1)&&(!ubuntu-eu2)/3234/changes>
Changes:
[bmahler] Removed an unnecessary copy of operations in the allocator.
------------------------------------------
[...truncated 177502 lines...]
I0206 21:35:21.425716 27137 status_update_manager.cpp:177] Pausing sending status updates
I0206 21:35:21.426049 27130 state.cpp:60] Recovering state from '/tmp/Endpoint_SlaveEndpointTest_AuthorizedRequest_1_yBn79F/meta'
I0206 21:35:21.426194 27130 status_update_manager.cpp:203] Recovering status update manager
I0206 21:35:21.426347 27142 containerizer.cpp:599] Recovering containerizer
I0206 21:35:21.427017 27130 provisioner.cpp:410] Provisioner recovery complete
I0206 21:35:21.427239 27130 slave.cpp:5499] Finished recovery
I0206 21:35:21.427683 27130 slave.cpp:5673] Querying resource estimator for oversubscribable resources
I0206 21:35:21.427870 27145 slave.cpp:5687] Received oversubscribable resources {} from the resource estimator
I0206 21:35:21.428889 27135 process.cpp:3697] Handling HTTP event for process 'slave(691)' with path: '/slave(691)/monitor/statistics.json'
I0206 21:35:21.429433 27138 http.cpp:871] Authorizing principal 'test-principal' to GET the '/monitor/statistics.json' endpoint
I0206 21:35:21.431567 27142 slave.cpp:803] Agent terminating
[ OK ] Endpoint/SlaveEndpointTest.AuthorizedRequest/1 (13 ms)
[ RUN ] Endpoint/SlaveEndpointTest.AuthorizedRequest/2
I0206 21:35:21.436543 27129 containerizer.cpp:220] Using isolation: posix/cpu,posix/mem,filesystem/posix,network/cni
W0206 21:35:21.436823 27129 backend.cpp:76] Failed to create 'aufs' backend: AufsBackend requires root privileges
W0206 21:35:21.436859 27129 backend.cpp:76] Failed to create 'bind' backend: BindBackend requires root privileges
I0206 21:35:21.436875 27129 provisioner.cpp:249] Using default backend 'copy'
I0206 21:35:21.437734 27135 slave.cpp:211] Mesos agent started on (692)@172.17.0.2:56633
I0206 21:35:21.437752 27135 slave.cpp:212] Flags at startup: --acls="" --appc_simple_discovery_uri_prefix="http://" --appc_store_dir="/tmp/mesos/store/appc" --authenticate_http_readonly="true" --authenticate_http_readwrite="true" --authenticatee="crammd5" --authentication_backoff_factor="1secs" --authorizer="local" --cgroups_cpu_enable_pids_and_tids_count="false" --cgroups_enable_cfs="false" --cgroups_hierarchy="/sys/fs/cgroup" --cgroups_limit_swap="false" --cgroups_root="mesos" --container_disk_watch_interval="15secs" --containerizers="mesos" --credential="/tmp/Endpoint_SlaveEndpointTest_AuthorizedRequest_2_1yq6aN/credential" --default_role="*" --disk_watch_interval="1mins" --docker="docker" --docker_kill_orphans="true" --docker_registry="https://registry-1.docker.io" --docker_remove_delay="6hrs" --docker_socket="/var/run/docker.sock" --docker_stop_timeout="0ns" --docker_store_dir="/tmp/mesos/store/docker" --docker_volume_checkpoint_dir="/var/run/mesos/isolators/docker/volume" --enforce_container_disk_quota="false" --executor_registration_timeout="1mins" --executor_shutdown_grace_period="5secs" --fetcher_cache_dir="/tmp/Endpoint_SlaveEndpointTest_AuthorizedRequest_2_1yq6aN/fetch" --fetcher_cache_size="2GB" --frameworks_home="" --gc_delay="1weeks" --gc_disk_headroom="0.1" --hadoop_home="" --help="false" --hostname_lookup="true" --http_authenticators="basic" --http_command_executor="false" --http_credentials="/tmp/Endpoint_SlaveEndpointTest_AuthorizedRequest_2_1yq6aN/http_credentials" --http_heartbeat_interval="30secs" --initialize_driver_logging="true" --isolation="posix/cpu,posix/mem" --launcher="posix" --launcher_dir="/mesos/build/src" --logbufsecs="0" --logging_level="INFO" --max_completed_executors_per_framework="150" --oversubscribed_resources_interval="15secs" --perf_duration="10secs" --perf_interval="1mins" --qos_correction_interval_min="0ns" --quiet="false" --recover="reconnect" --recovery_timeout="15mins" --registration_backoff_factor="10ms" --resources="cpus:2;gpus:0;mem:1024;disk:1024;ports:[31000-32000]" --revocable_cpu_low_priority="true" --runtime_dir="/tmp/Endpoint_SlaveEndpointTest_AuthorizedRequest_2_1yq6aN" --sandbox_directory="/mnt/mesos/sandbox" --strict="true" --switch_user="true" --systemd_enable_support="true" --systemd_runtime_directory="/run/systemd/system" --version="false" --work_dir="/tmp/Endpoint_SlaveEndpointTest_AuthorizedRequest_2_2QcAmz"
I0206 21:35:21.438114 27135 credentials.hpp:86] Loading credential for authentication from '/tmp/Endpoint_SlaveEndpointTest_AuthorizedRequest_2_1yq6aN/credential'
I0206 21:35:21.438217 27135 slave.cpp:354] Agent using credential for: test-principal
I0206 21:35:21.438233 27135 credentials.hpp:37] Loading credentials for authentication from '/tmp/Endpoint_SlaveEndpointTest_AuthorizedRequest_2_1yq6aN/http_credentials'
I0206 21:35:21.438359 27135 http.cpp:919] Using default 'basic' HTTP authenticator for realm 'mesos-agent-readonly'
I0206 21:35:21.438441 27135 http.cpp:919] Using default 'basic' HTTP authenticator for realm 'mesos-agent-readwrite'
I0206 21:35:21.439040 27135 slave.cpp:541] Agent resources: cpus(*):2; mem(*):1024; disk(*):1024; ports(*):[31000-32000]
I0206 21:35:21.439086 27135 slave.cpp:549] Agent attributes: [ ]
I0206 21:35:21.439095 27135 slave.cpp:554] Agent hostname: e53018fcb3fe
I0206 21:35:21.439227 27143 status_update_manager.cpp:177] Pausing sending status updates
I0206 21:35:21.439533 27138 state.cpp:60] Recovering state from '/tmp/Endpoint_SlaveEndpointTest_AuthorizedRequest_2_2QcAmz/meta'
I0206 21:35:21.439689 27135 status_update_manager.cpp:203] Recovering status update manager
I0206 21:35:21.439846 27132 containerizer.cpp:599] Recovering containerizer
I0206 21:35:21.440433 27132 provisioner.cpp:410] Provisioner recovery complete
I0206 21:35:21.440706 27135 slave.cpp:5499] Finished recovery
I0206 21:35:21.441126 27135 slave.cpp:5673] Querying resource estimator for oversubscribable resources
I0206 21:35:21.441262 27141 slave.cpp:5687] Received oversubscribable resources {} from the resource estimator
I0206 21:35:21.441939 27141 process.cpp:3697] Handling HTTP event for process 'slave(692)' with path: '/slave(692)/containers'
I0206 21:35:21.442435 27134 http.cpp:871] Authorizing principal 'test-principal' to GET the '/containers' endpoint
I0206 21:35:21.443732 27142 slave.cpp:803] Agent terminating
[ OK ] Endpoint/SlaveEndpointTest.AuthorizedRequest/2 (12 ms)
[ RUN ] Endpoint/SlaveEndpointTest.UnauthorizedRequest/0
I0206 21:35:21.448822 27129 containerizer.cpp:220] Using isolation: posix/cpu,posix/mem,filesystem/posix,network/cni
W0206 21:35:21.449059 27129 backend.cpp:76] Failed to create 'aufs' backend: AufsBackend requires root privileges
W0206 21:35:21.449093 27129 backend.cpp:76] Failed to create 'bind' backend: BindBackend requires root privileges
I0206 21:35:21.449105 27129 provisioner.cpp:249] Using default backend 'copy'
I0206 21:35:21.449961 27144 slave.cpp:211] Mesos agent started on (693)@172.17.0.2:56633
I0206 21:35:21.449980 27144 slave.cpp:212] Flags at startup: --acls="" --appc_simple_discovery_uri_prefix="http://" --appc_store_dir="/tmp/mesos/store/appc" --authenticate_http_readonly="true" --authenticate_http_readwrite="true" --authenticatee="crammd5" --authentication_backoff_factor="1secs" --authorizer="local" --cgroups_cpu_enable_pids_and_tids_count="false" --cgroups_enable_cfs="false" --cgroups_hierarchy="/sys/fs/cgroup" --cgroups_limit_swap="false" --cgroups_root="mesos" --container_disk_watch_interval="15secs" --containerizers="mesos" --credential="/tmp/Endpoint_SlaveEndpointTest_UnauthorizedRequest_0_JtlSxG/credential" --default_role="*" --disk_watch_interval="1mins" --docker="docker" --docker_kill_orphans="true" --docker_registry="https://registry-1.docker.io" --docker_remove_delay="6hrs" --docker_socket="/var/run/docker.sock" --docker_stop_timeout="0ns" --docker_store_dir="/tmp/mesos/store/docker" --docker_volume_checkpoint_dir="/var/run/mesos/isolators/docker/volume" --enforce_container_disk_quota="false" --executor_registration_timeout="1mins" --executor_shutdown_grace_period="5secs" --fetcher_cache_dir="/tmp/Endpoint_SlaveEndpointTest_UnauthorizedRequest_0_JtlSxG/fetch" --fetcher_cache_size="2GB" --frameworks_home="" --gc_delay="1weeks" --gc_disk_headroom="0.1" --hadoop_home="" --help="false" --hostname_lookup="true" --http_authenticators="basic" --http_command_executor="false" --http_credentials="/tmp/Endpoint_SlaveEndpointTest_UnauthorizedRequest_0_JtlSxG/http_credentials" --http_heartbeat_interval="30secs" --initialize_driver_logging="true" --isolation="posix/cpu,posix/mem" --launcher="posix" --launcher_dir="/mesos/build/src" --logbufsecs="0" --logging_level="INFO" --max_completed_executors_per_framework="150" --oversubscribed_resources_interval="15secs" --perf_duration="10secs" --perf_interval="1mins" --qos_correction_interval_min="0ns" --quiet="false" --recover="reconnect" --recovery_timeout="15mins" --registration_backoff_factor="10ms" --resources="cpus:2;gpus:0;mem:1024;disk:1024;ports:[31000-32000]" --revocable_cpu_low_priority="true" --runtime_dir="/tmp/Endpoint_SlaveEndpointTest_UnauthorizedRequest_0_JtlSxG" --sandbox_directory="/mnt/mesos/sandbox" --strict="true" --switch_user="true" --systemd_enable_support="true" --systemd_runtime_directory="/run/systemd/system" --version="false" --work_dir="/tmp/Endpoint_SlaveEndpointTest_UnauthorizedRequest_0_uFbnHs"
I0206 21:35:21.450305 27144 credentials.hpp:86] Loading credential for authentication from '/tmp/Endpoint_SlaveEndpointTest_UnauthorizedRequest_0_JtlSxG/credential'
I0206 21:35:21.450405 27144 slave.cpp:354] Agent using credential for: test-principal
I0206 21:35:21.450424 27144 credentials.hpp:37] Loading credentials for authentication from '/tmp/Endpoint_SlaveEndpointTest_UnauthorizedRequest_0_JtlSxG/http_credentials'
I0206 21:35:21.450516 27144 http.cpp:919] Using default 'basic' HTTP authenticator for realm 'mesos-agent-readonly'
I0206 21:35:21.450558 27144 http.cpp:919] Using default 'basic' HTTP authenticator for realm 'mesos-agent-readwrite'
I0206 21:35:21.450913 27144 slave.cpp:541] Agent resources: cpus(*):2; mem(*):1024; disk(*):1024; ports(*):[31000-32000]
I0206 21:35:21.450948 27144 slave.cpp:549] Agent attributes: [ ]
I0206 21:35:21.450955 27144 slave.cpp:554] Agent hostname: e53018fcb3fe
I0206 21:35:21.451026 27136 status_update_manager.cpp:177] Pausing sending status updates
I0206 21:35:21.451418 27143 state.cpp:60] Recovering state from '/tmp/Endpoint_SlaveEndpointTest_UnauthorizedRequest_0_uFbnHs/meta'
I0206 21:35:21.451669 27144 status_update_manager.cpp:203] Recovering status update manager
I0206 21:35:21.451841 27131 containerizer.cpp:599] Recovering containerizer
I0206 21:35:21.452375 27132 provisioner.cpp:410] Provisioner recovery complete
I0206 21:35:21.452649 27145 slave.cpp:5499] Finished recovery
I0206 21:35:21.453030 27145 slave.cpp:5673] Querying resource estimator for oversubscribable resources
I0206 21:35:21.453223 27133 slave.cpp:5687] Received oversubscribable resources {} from the resource estimator
I0206 21:35:21.453961 27138 process.cpp:3697] Handling HTTP event for process 'slave(693)' with path: '/slave(693)/monitor/statistics'
I0206 21:35:21.454463 27139 http.cpp:871] Authorizing principal 'test-principal' to GET the '/monitor/statistics' endpoint
I0206 21:35:21.455716 27129 slave.cpp:803] Agent terminating
[ OK ] Endpoint/SlaveEndpointTest.UnauthorizedRequest/0 (12 ms)
[ RUN ] Endpoint/SlaveEndpointTest.UnauthorizedRequest/1
I0206 21:35:21.460583 27129 containerizer.cpp:220] Using isolation: posix/cpu,posix/mem,filesystem/posix,network/cni
W0206 21:35:21.460886 27129 backend.cpp:76] Failed to create 'aufs' backend: AufsBackend requires root privileges
W0206 21:35:21.460922 27129 backend.cpp:76] Failed to create 'bind' backend: BindBackend requires root privileges
I0206 21:35:21.460933 27129 provisioner.cpp:249] Using default backend 'copy'
I0206 21:35:21.462045 27132 slave.cpp:211] Mesos agent started on (694)@172.17.0.2:56633
I0206 21:35:21.462064 27132 slave.cpp:212] Flags at startup: --acls="" --appc_simple_discovery_uri_prefix="http://" --appc_store_dir="/tmp/mesos/store/appc" --authenticate_http_readonly="true" --authenticate_http_readwrite="true" --authenticatee="crammd5" --authentication_backoff_factor="1secs" --authorizer="local" --cgroups_cpu_enable_pids_and_tids_count="false" --cgroups_enable_cfs="false" --cgroups_hierarchy="/sys/fs/cgroup" --cgroups_limit_swap="false" --cgroups_root="mesos" --container_disk_watch_interval="15secs" --containerizers="mesos" --credential="/tmp/Endpoint_SlaveEndpointTest_UnauthorizedRequest_1_pgkk2z/credential" --default_role="*" --disk_watch_interval="1mins" --docker="docker" --docker_kill_orphans="true" --docker_registry="https://registry-1.docker.io" --docker_remove_delay="6hrs" --docker_socket="/var/run/docker.sock" --docker_stop_timeout="0ns" --docker_store_dir="/tmp/mesos/store/docker" --docker_volume_checkpoint_dir="/var/run/mesos/isolators/docker/volume" --enforce_container_disk_quota="false" --executor_registration_timeout="1mins" --executor_shutdown_grace_period="5secs" --fetcher_cache_dir="/tmp/Endpoint_SlaveEndpointTest_UnauthorizedRequest_1_pgkk2z/fetch" --fetcher_cache_size="2GB" --frameworks_home="" --gc_delay="1weeks" --gc_disk_headroom="0.1" --hadoop_home="" --help="false" --hostname_lookup="true" --http_authenticators="basic" --http_command_executor="false" --http_credentials="/tmp/Endpoint_SlaveEndpointTest_UnauthorizedRequest_1_pgkk2z/http_credentials" --http_heartbeat_interval="30secs" --initialize_driver_logging="true" --isolation="posix/cpu,posix/mem" --launcher="posix" --launcher_dir="/mesos/build/src" --logbufsecs="0" --logging_level="INFO" --max_completed_executors_per_framework="150" --oversubscribed_resources_interval="15secs" --perf_duration="10secs" --perf_interval="1mins" --qos_correction_interval_min="0ns" --quiet="false" --recover="reconnect" --recovery_timeout="15mins" --registration_backoff_factor="10ms" --resources="cpus:2;gpus:0;mem:1024;disk:1024;ports:[31000-32000]" --revocable_cpu_low_priority="true" --runtime_dir="/tmp/Endpoint_SlaveEndpointTest_UnauthorizedRequest_1_pgkk2z" --sandbox_directory="/mnt/mesos/sandbox" --strict="true" --switch_user="true" --systemd_enable_support="true" --systemd_runtime_directory="/run/systemd/system" --version="false" --work_dir="/tmp/Endpoint_SlaveEndpointTest_UnauthorizedRequest_1_4JqU9l"
I0206 21:35:21.462450 27132 credentials.hpp:86] Loading credential for authentication from '/tmp/Endpoint_SlaveEndpointTest_UnauthorizedRequest_1_pgkk2z/credential'
I0206 21:35:21.462543 27132 slave.cpp:354] Agent using credential for: test-principal
I0206 21:35:21.462553 27132 credentials.hpp:37] Loading credentials for authentication from '/tmp/Endpoint_SlaveEndpointTest_UnauthorizedRequest_1_pgkk2z/http_credentials'
I0206 21:35:21.462641 27132 http.cpp:919] Using default 'basic' HTTP authenticator for realm 'mesos-agent-readonly'
I0206 21:35:21.462677 27132 http.cpp:919] Using default 'basic' HTTP authenticator for realm 'mesos-agent-readwrite'
I0206 21:35:21.463135 27132 slave.cpp:541] Agent resources: cpus(*):2; mem(*):1024; disk(*):1024; ports(*):[31000-32000]
I0206 21:35:21.463181 27132 slave.cpp:549] Agent attributes: [ ]
I0206 21:35:21.463191 27132 slave.cpp:554] Agent hostname: e53018fcb3fe
I0206 21:35:21.463268 27141 status_update_manager.cpp:177] Pausing sending status updates
I0206 21:35:21.463594 27143 state.cpp:60] Recovering state from '/tmp/Endpoint_SlaveEndpointTest_UnauthorizedRequest_1_4JqU9l/meta'
I0206 21:35:21.463922 27130 status_update_manager.cpp:203] Recovering status update manager
I0206 21:35:21.464040 27144 containerizer.cpp:599] Recovering containerizer
I0206 21:35:21.464705 27134 provisioner.cpp:410] Provisioner recovery complete
I0206 21:35:21.464865 27144 slave.cpp:5499] Finished recovery
I0206 21:35:21.465245 27144 slave.cpp:5673] Querying resource estimator for oversubscribable resources
I0206 21:35:21.465415 27134 slave.cpp:5687] Received oversubscribable resources {} from the resource estimator
I0206 21:35:21.466154 27134 process.cpp:3697] Handling HTTP event for process 'slave(694)' with path: '/slave(694)/monitor/statistics.json'
I0206 21:35:21.466590 27138 http.cpp:871] Authorizing principal 'test-principal' to GET the '/monitor/statistics.json' endpoint
I0206 21:35:21.467654 27144 slave.cpp:803] Agent terminating
[ OK ] Endpoint/SlaveEndpointTest.UnauthorizedRequest/1 (12 ms)
[ RUN ] Endpoint/SlaveEndpointTest.UnauthorizedRequest/2
I0206 21:35:21.474015 27129 containerizer.cpp:220] Using isolation: posix/cpu,posix/mem,filesystem/posix,network/cni
W0206 21:35:21.474416 27129 backend.cpp:76] Failed to create 'aufs' backend: AufsBackend requires root privileges
W0206 21:35:21.474465 27129 backend.cpp:76] Failed to create 'bind' backend: BindBackend requires root privileges
I0206 21:35:21.474489 27129 provisioner.cpp:249] Using default backend 'copy'
I0206 21:35:21.475647 27131 slave.cpp:211] Mesos agent started on (695)@172.17.0.2:56633
I0206 21:35:21.475673 27131 slave.cpp:212] Flags at startup: --acls="" --appc_simple_discovery_uri_prefix="http://" --appc_store_dir="/tmp/mesos/store/appc" --authenticate_http_readonly="true" --authenticate_http_readwrite="true" --authenticatee="crammd5" --authentication_backoff_factor="1secs" --authorizer="local" --cgroups_cpu_enable_pids_and_tids_count="false" --cgroups_enable_cfs="false" --cgroups_hierarchy="/sys/fs/cgroup" --cgroups_limit_swap="false" --cgroups_root="mesos" --container_disk_watch_interval="15secs" --containerizers="mesos" --credential="/tmp/Endpoint_SlaveEndpointTest_UnauthorizedRequest_2_NxYZEt/credential" --default_role="*" --disk_watch_interval="1mins" --docker="docker" --docker_kill_orphans="true" --docker_registry="https://registry-1.docker.io" --docker_remove_delay="6hrs" --docker_socket="/var/run/docker.sock" --docker_stop_timeout="0ns" --docker_store_dir="/tmp/mesos/store/docker" --docker_volume_checkpoint_dir="/var/run/mesos/isolators/docker/volume" --enforce_container_disk_quota="false" --executor_registration_timeout="1mins" --executor_shutdown_grace_period="5secs" --fetcher_cache_dir="/tmp/Endpoint_SlaveEndpointTest_UnauthorizedRequest_2_NxYZEt/fetch" --fetcher_cache_size="2GB" --frameworks_home="" --gc_delay="1weeks" --gc_disk_headroom="0.1" --hadoop_home="" --help="false" --hostname_lookup="true" --http_authenticators="basic" --http_command_executor="false" --http_credentials="/tmp/Endpoint_SlaveEndpointTest_UnauthorizedRequest_2_NxYZEt/http_credentials" --http_heartbeat_interval="30secs" --initialize_driver_logging="true" --isolation="posix/cpu,posix/mem" --launcher="posix" --launcher_dir="/mesos/build/src" --logbufsecs="0" --logging_level="INFO" --max_completed_executors_per_framework="150" --oversubscribed_resources_interval="15secs" --perf_duration="10secs" --perf_interval="1mins" --qos_correction_interval_min="0ns" --quiet="false" --recover="reconnect" --recovery_timeout="15mins" --registration_backoff_factor="10ms" --resources="cpus:2;gpus:0;mem:1024;disk:1024;ports:[31000-32000]" --revocable_cpu_low_priority="true" --runtime_dir="/tmp/Endpoint_SlaveEndpointTest_UnauthorizedRequest_2_NxYZEt" --sandbox_directory="/mnt/mesos/sandbox" --strict="true" --switch_user="true" --systemd_enable_support="true" --systemd_runtime_directory="/run/systemd/system" --version="false" --work_dir="/tmp/Endpoint_SlaveEndpointTest_UnauthorizedRequest_2_fe9tKf"
I0206 21:35:21.476102 27131 credentials.hpp:86] Loading credential for authentication from '/tmp/Endpoint_SlaveEndpointTest_UnauthorizedRequest_2_NxYZEt/credential'
I0206 21:35:21.476212 27131 slave.cpp:354] Agent using credential for: test-principal
I0206 21:35:21.476230 27131 credentials.hpp:37] Loading credentials for authentication from '/tmp/Endpoint_SlaveEndpointTest_UnauthorizedRequest_2_NxYZEt/http_credentials'
I0206 21:35:21.476361 27131 http.cpp:919] Using default 'basic' HTTP authenticator for realm 'mesos-agent-readonly'
I0206 21:35:21.476464 27131 http.cpp:919] Using default 'basic' HTTP authenticator for realm 'mesos-agent-readwrite'
I0206 21:35:21.477053 27131 slave.cpp:541] Agent resources: cpus(*):2; mem(*):1024; disk(*):1024; ports(*):[31000-32000]
I0206 21:35:21.477103 27131 slave.cpp:549] Agent attributes: [ ]
I0206 21:35:21.477116 27131 slave.cpp:554] Agent hostname: e53018fcb3fe
I0206 21:35:21.477216 27132 status_update_manager.cpp:177] Pausing sending status updates
I0206 21:35:21.477643 27134 state.cpp:60] Recovering state from '/tmp/Endpoint_SlaveEndpointTest_UnauthorizedRequest_2_fe9tKf/meta'
I0206 21:35:21.477867 27138 status_update_manager.cpp:203] Recovering status update manager
I0206 21:35:21.478032 27136 containerizer.cpp:599] Recovering containerizer
I0206 21:35:21.478751 27134 provisioner.cpp:410] Provisioner recovery complete
I0206 21:35:21.479157 27135 slave.cpp:5499] Finished recovery
I0206 21:35:21.479647 27135 slave.cpp:5673] Querying resource estimator for oversubscribable resources
I0206 21:35:21.479768 27144 slave.cpp:5687] Received oversubscribable resources {} from the resource estimator
I0206 21:35:21.480681 27144 process.cpp:3697] Handling HTTP event for process 'slave(695)' with path: '/slave(695)/containers'
I0206 21:35:21.481209 27144 http.cpp:871] Authorizing principal 'test-principal' to GET the '/containers' endpoint
I0206 21:35:21.482269 27129 slave.cpp:803] Agent terminating
[ OK ] Endpoint/SlaveEndpointTest.UnauthorizedRequest/2 (13 ms)
[ RUN ] Endpoint/SlaveEndpointTest.NoAuthorizer/0
I0206 21:35:21.487227 27129 containerizer.cpp:220] Using isolation: posix/cpu,posix/mem,filesystem/posix,network/cni
W0206 21:35:21.487475 27129 backend.cpp:76] Failed to create 'aufs' backend: AufsBackend requires root privileges
W0206 21:35:21.487519 27129 backend.cpp:76] Failed to create 'bind' backend: BindBackend requires root privileges
I0206 21:35:21.487534 27129 provisioner.cpp:249] Using default backend 'copy'
I0206 21:35:21.488080 27129 cluster.cpp:446] Creating default 'local' authorizer
I0206 21:35:21.489382 27133 slave.cpp:211] Mesos agent started on (696)@172.17.0.2:56633
I0206 21:35:21.489434 27133 slave.cpp:212] Flags at startup: --acls="" --appc_simple_discovery_uri_prefix="http://" --appc_store_dir="/tmp/mesos/store/appc" --authenticate_http_readonly="true" --authenticate_http_readwrite="true" --authenticatee="crammd5" --authentication_backoff_factor="1secs" --authorizer="local" --cgroups_cpu_enable_pids_and_tids_count="false" --cgroups_enable_cfs="false" --cgroups_hierarchy="/sys/fs/cgroup" --cgroups_limit_swap="false" --cgroups_root="mesos" --container_disk_watch_interval="15secs" --containerizers="mesos" --credential="/tmp/Endpoint_SlaveEndpointTest_NoAuthorizer_0_VQNHqn/credential" --default_role="*" --disk_watch_interval="1mins" --docker="docker" --docker_kill_orphans="true" --docker_registry="https://registry-1.docker.io" --docker_remove_delay="6hrs" --docker_socket="/var/run/docker.sock" --docker_stop_timeout="0ns" --docker_store_dir="/tmp/mesos/store/docker" --docker_volume_checkpoint_dir="/var/run/mesos/isolators/docker/volume" --enforce_container_disk_quota="false" --executor_registration_timeout="1mins" --executor_shutdown_grace_period="5secs" --fetcher_cache_dir="/tmp/Endpoint_SlaveEndpointTest_NoAuthorizer_0_VQNHqn/fetch" --fetcher_cache_size="2GB" --frameworks_home="" --gc_delay="1weeks" --gc_disk_headroom="0.1" --hadoop_home="" --help="false" --hostname_lookup="true" --http_authenticators="basic" --http_command_executor="false" --http_credentials="/tmp/Endpoint_SlaveEndpointTest_NoAuthorizer_0_VQNHqn/http_credentials" --http_heartbeat_interval="30secs" --initialize_driver_logging="true" --isolation="posix/cpu,posix/mem" --launcher="posix" --launcher_dir="/mesos/build/src" --logbufsecs="0" --logging_level="INFO" --max_completed_executors_per_framework="150" --oversubscribed_resources_interval="15secs" --perf_duration="10secs" --perf_interval="1mins" --qos_correction_interval_min="0ns" --quiet="false" --recover="reconnect" --recovery_timeout="15mins" --registration_backoff_factor="10ms" --resources="cpus:2;gpus:0;mem:1024;disk:1024;ports:[31000-32000]" --revocable_cpu_low_priority="true" --runtime_dir="/tmp/Endpoint_SlaveEndpointTest_NoAuthorizer_0_VQNHqn" --sandbox_directory="/mnt/mesos/sandbox" --strict="true" --switch_user="true" --systemd_enable_support="true" --systemd_runtime_directory="/run/systemd/system" --version="false" --work_dir="/tmp/Endpoint_SlaveEndpointTest_NoAuthorizer_0_qqsYt9"
I0206 21:35:21.489931 27133 credentials.hpp:86] Loading credential for authentication from '/tmp/Endpoint_SlaveEndpointTest_NoAuthorizer_0_VQNHqn/credential'
I0206 21:35:21.490099 27133 slave.cpp:354] Agent using credential for: test-principal
I0206 21:35:21.490118 27133 credentials.hpp:37] Loading credentials for authentication from '/tmp/Endpoint_SlaveEndpointTest_NoAuthorizer_0_VQNHqn/http_credentials'
I0206 21:35:21.490262 27133 http.cpp:919] Using default 'basic' HTTP authenticator for realm 'mesos-agent-readonly'
I0206 21:35:21.490324 27133 http.cpp:919] Using default 'basic' HTTP authenticator for realm 'mesos-agent-readwrite'
I0206 21:35:21.490900 27133 slave.cpp:541] Agent resources: cpus(*):2; mem(*):1024; disk(*):1024; ports(*):[31000-32000]
I0206 21:35:21.490967 27133 slave.cpp:549] Agent attributes: [ ]
I0206 21:35:21.490985 27133 slave.cpp:554] Agent hostname: e53018fcb3fe
I0206 21:35:21.491127 27141 status_update_manager.cpp:177] Pausing sending status updates
I0206 21:35:21.491533 27142 state.cpp:60] Recovering state from '/tmp/Endpoint_SlaveEndpointTest_NoAuthorizer_0_qqsYt9/meta'
I0206 21:35:21.491695 27134 status_update_manager.cpp:203] Recovering status update manager
I0206 21:35:21.491844 27142 containerizer.cpp:599] Recovering containerizer
I0206 21:35:21.492584 27138 provisioner.cpp:410] Provisioner recovery complete
I0206 21:35:21.492898 27131 slave.cpp:5499] Finished recovery
I0206 21:35:21.493315 27131 slave.cpp:5673] Querying resource estimator for oversubscribable resources
I0206 21:35:21.493461 27136 slave.cpp:5687] Received oversubscribable resources {} from the resource estimator
I0206 21:35:21.494352 27142 process.cpp:3697] Handling HTTP event for process 'slave(696)' with path: '/slave(696)/monitor/statistics'
I0206 21:35:21.494760 27135 http.cpp:871] Authorizing principal 'test-principal' to GET the '/monitor/statistics' endpoint
I0206 21:35:21.496266 27139 slave.cpp:803] Agent terminating
[ OK ] Endpoint/SlaveEndpointTest.NoAuthorizer/0 (14 ms)
[ RUN ] Endpoint/SlaveEndpointTest.NoAuthorizer/1
I0206 21:35:21.504124 27129 containerizer.cpp:220] Using isolation: posix/cpu,posix/mem,filesystem/posix,network/cni
W0206 21:35:21.504619 27129 backend.cpp:76] Failed to create 'aufs' backend: AufsBackend requires root privileges
W0206 21:35:21.504679 27129 backend.cpp:76] Failed to create 'bind' backend: BindBackend requires root privileges
I0206 21:35:21.504703 27129 provisioner.cpp:249] Using default backend 'copy'
I0206 21:35:21.505259 27129 cluster.cpp:446] Creating default 'local' authorizer
I0206 21:35:21.505820 27141 slave.cpp:211] Mesos agent started on (697)@172.17.0.2:56633
I0206 21:35:21.505841 27141 slave.cpp:212] Flags at startup: --acls="" --appc_simple_discovery_uri_prefix="http://" --appc_store_dir="/tmp/mesos/store/appc" --authenticate_http_readonly="true" --authenticate_http_readwrite="true" --authenticatee="crammd5" --authentication_backoff_factor="1secs" --authorizer="local" --cgroups_cpu_enable_pids_and_tids_count="false" --cgroups_enable_cfs="false" --cgroups_hierarchy="/sys/fs/cgroup" --cgroups_limit_swap="false" --cgroups_root="mesos" --container_disk_watch_interval="15secs" --containerizers="mesos" --credential="/tmp/Endpoint_SlaveEndpointTest_NoAuthorizer_1_57nhmh/credential" --default_role="*" --disk_watch_interval="1mins" --docker="docker" --docker_kill_orphans="true" --docker_registry="https://registry-1.docker.io" --docker_remove_delay="6hrs" --docker_socket="/var/run/docker.sock" --docker_stop_timeout="0ns" --docker_store_dir="/tmp/mesos/store/docker" --docker_volume_checkpoint_dir="/var/run/mesos/isolators/docker/volume" --enforce_container_disk_quota="false" --executor_registration_timeout="1mins" --executor_shutdown_grace_period="5secs" --fetcher_cache_dir="/tmp/Endpoint_SlaveEndpointTest_NoAuthorizer_1_57nhmh/fetch" --fetcher_cache_size="2GB" --frameworks_home="" --gc_delay="1weeks" --gc_disk_headroom="0.1" --hadoop_home="" --help="false" --hostname_lookup="true" --http_authenticators="basic" --http_command_executor="false" --http_credentials="/tmp/Endpoint_SlaveEndpointTest_NoAuthorizer_1_57nhmh/http_credentials" --http_heartbeat_interval="30secs" --initialize_driver_logging="true" --isolation="posix/cpu,posix/mem" --launcher="posix" --launcher_dir="/mesos/build/src" --logbufsecs="0" --logging_level="INFO" --max_completed_executors_per_framework="150" --oversubscribed_resources_interval="15secs" --perf_duration="10secs" --perf_interval="1mins" --qos_correction_interval_min="0ns" --quiet="false" --recover="reconnect" --recovery_timeout="15mins" --registration_backoff_factor="10ms" --resources="cpus:2;gpus:0;mem:1024;disk:1024;ports:[31000-32000]" --revocable_cpu_low_priority="true" --runtime_dir="/tmp/Endpoint_SlaveEndpointTest_NoAuthorizer_1_57nhmh" --sandbox_directory="/mnt/mesos/sandbox" --strict="true" --switch_user="true" --systemd_enable_support="true" --systemd_runtime_directory="/run/systemd/system" --version="false" --work_dir="/tmp/Endpoint_SlaveEndpointTest_NoAuthorizer_1_C4gXm3"
I0206 21:35:21.506207 27141 credentials.hpp:86] Loading credential for authentication from '/tmp/Endpoint_SlaveEndpointTest_NoAuthorizer_1_57nhmh/credential'
I0206 21:35:21.506345 27141 slave.cpp:354] Agent using credential for: test-principal
I0206 21:35:21.506361 27141 credentials.hpp:37] Loading credentials for authentication from '/tmp/Endpoint_SlaveEndpointTest_NoAuthorizer_1_57nhmh/http_credentials'
I0206 21:35:21.506489 27141 http.cpp:919] Using default 'basic' HTTP authenticator for realm 'mesos-agent-readonly'
I0206 21:35:21.506536 27141 http.cpp:919] Using default 'basic' HTTP authenticator for realm 'mesos-agent-readwrite'
I0206 21:35:21.507117 27141 slave.cpp:541] Agent resources: cpus(*):2; mem(*):1024; disk(*):1024; ports(*):[31000-32000]
I0206 21:35:21.507153 27141 slave.cpp:549] Agent attributes: [ ]
I0206 21:35:21.507158 27141 slave.cpp:554] Agent hostname: e53018fcb3fe
I0206 21:35:21.507228 27143 status_update_manager.cpp:177] Pausing sending status updates
I0206 21:35:21.507509 27141 state.cpp:60] Recovering state from '/tmp/Endpoint_SlaveEndpointTest_NoAuthorizer_1_C4gXm3/meta'
I0206 21:35:21.507757 27130 status_update_manager.cpp:203] Recovering status update manager
I0206 21:35:21.507833 27136 containerizer.cpp:599] Recovering containerizer
I0206 21:35:21.508322 27134 provisioner.cpp:410] Provisioner recovery complete
I0206 21:35:21.508466 27142 slave.cpp:5499] Finished recovery
I0206 21:35:21.508817 27142 slave.cpp:5673] Querying resource estimator for oversubscribable resources
I0206 21:35:21.508916 27130 slave.cpp:5687] Received oversubscribable resources {} from the resource estimator
I0206 21:35:21.509639 27135 process.cpp:3697] Handling HTTP event for process 'slave(697)' with path: '/slave(697)/monitor/statistics.json'
I0206 21:35:21.509979 27136 http.cpp:871] Authorizing principal 'test-principal' to GET the '/monitor/statistics.json' endpoint
I0206 21:35:21.510990 27129 slave.cpp:803] Agent terminating
[ OK ] Endpoint/SlaveEndpointTest.NoAuthorizer/1 (12 ms)
[ RUN ] Endpoint/SlaveEndpointTest.NoAuthorizer/2
I0206 21:35:21.515657 27129 containerizer.cpp:220] Using isolation: posix/cpu,posix/mem,filesystem/posix,network/cni
W0206 21:35:21.515920 27129 backend.cpp:76] Failed to create 'aufs' backend: AufsBackend requires root privileges
W0206 21:35:21.515954 27129 backend.cpp:76] Failed to create 'bind' backend: BindBackend requires root privileges
I0206 21:35:21.515964 27129 provisioner.cpp:249] Using default backend 'copy'
I0206 21:35:21.516492 27129 cluster.cpp:446] Creating default 'local' authorizer
I0206 21:35:21.517122 27131 slave.cpp:211] Mesos agent started on (698)@172.17.0.2:56633
I0206 21:35:21.517149 27131 slave.cpp:212] Flags at startup: --acls="" --appc_simple_discovery_uri_prefix="http://" --appc_store_dir="/tmp/mesos/store/appc" --authenticate_http_readonly="true" --authenticate_http_readwrite="true" --authenticatee="crammd5" --authentication_backoff_factor="1secs" --authorizer="local" --cgroups_cpu_enable_pids_and_tids_count="false" --cgroups_enable_cfs="false" --cgroups_hierarchy="/sys/fs/cgroup" --cgroups_limit_swap="false" --cgroups_root="mesos" --container_disk_watch_interval="15secs" --containerizers="mesos" --credential="/tmp/Endpoint_SlaveEndpointTest_NoAuthorizer_2_jGrvqb/credential" --default_role="*" --disk_watch_interval="1mins" --docker="docker" --docker_kill_orphans="true" --docker_registry="https://registry-1.docker.io" --docker_remove_delay="6hrs" --docker_socket="/var/run/docker.sock" --docker_stop_timeout="0ns" --docker_store_dir="/tmp/mesos/store/docker" --docker_volume_checkpoint_dir="/var/run/mesos/isolators/docker/volume" --enforce_container_disk_quota="false" --executor_registration_timeout="1mins" --executor_shutdown_grace_period="5secs" --fetcher_cache_dir="/tmp/Endpoint_SlaveEndpointTest_NoAuthorizer_2_jGrvqb/fetch" --fetcher_cache_size="2GB" --frameworks_home="" --gc_delay="1weeks" --gc_disk_headroom="0.1" --hadoop_home="" --help="false" --hostname_lookup="true" --http_authenticators="basic" --http_command_executor="false" --http_credentials="/tmp/Endpoint_SlaveEndpointTest_NoAuthorizer_2_jGrvqb/http_credentials" --http_heartbeat_interval="30secs" --initialize_driver_logging="true" --isolation="posix/cpu,posix/mem" --launcher="posix" --launcher_dir="/mesos/build/src" --logbufsecs="0" --logging_level="INFO" --max_completed_executors_per_framework="150" --oversubscribed_resources_interval="15secs" --perf_duration="10secs" --perf_interval="1mins" --qos_correction_interval_min="0ns" --quiet="false" --recover="reconnect" --recovery_timeout="15mins" --registration_backoff_factor="10ms" --resources="cpus:2;gpus:0;mem:1024;disk:1024;ports:[31000-32000]" --revocable_cpu_low_priority="true" --runtime_dir="/tmp/Endpoint_SlaveEndpointTest_NoAuthorizer_2_jGrvqb" --sandbox_directory="/mnt/mesos/sandbox" --strict="true" --switch_user="true" --systemd_enable_support="true" --systemd_runtime_directory="/run/systemd/system" --version="false" --work_dir="/tmp/Endpoint_SlaveEndpointTest_NoAuthorizer_2_etQapX"
I0206 21:35:21.517604 27131 credentials.hpp:86] Loading credential for authentication from '/tmp/Endpoint_SlaveEndpointTest_NoAuthorizer_2_jGrvqb/credential'
I0206 21:35:21.517720 27131 slave.cpp:354] Agent using credential for: test-principal
I0206 21:35:21.517740 27131 credentials.hpp:37] Loading credentials for authentication from '/tmp/Endpoint_SlaveEndpointTest_NoAuthorizer_2_jGrvqb/http_credentials'
I0206 21:35:21.517875 27131 http.cpp:919] Using default 'basic' HTTP authenticator for realm 'mesos-agent-readonly'
I0206 21:35:21.517940 27131 http.cpp:919] Using default 'basic' HTTP authenticator for realm 'mesos-agent-readwrite'
I0206 21:35:21.518498 27131 slave.cpp:541] Agent resources: cpus(*):2; mem(*):1024; disk(*):1024; ports(*):[31000-32000]
I0206 21:35:21.518548 27131 slave.cpp:549] Agent attributes: [ ]
I0206 21:35:21.518564 27131 slave.cpp:554] Agent hostname: e53018fcb3fe
I0206 21:35:21.518661 27134 status_update_manager.cpp:177] Pausing sending status updates
I0206 21:35:21.519166 27142 state.cpp:60] Recovering state from '/tmp/Endpoint_SlaveEndpointTest_NoAuthorizer_2_etQapX/meta'
I0206 21:35:21.519357 27145 status_update_manager.cpp:203] Recovering status update manager
I0206 21:35:21.519469 27145 containerizer.cpp:599] Recovering containerizer
I0206 21:35:21.520174 27143 provisioner.cpp:410] Provisioner recovery complete
I0206 21:35:21.520377 27136 slave.cpp:5499] Finished recovery
I0206 21:35:21.520834 27136 slave.cpp:5673] Querying resource estimator for oversubscribable resources
I0206 21:35:21.520992 27133 slave.cpp:5687] Received oversubscribable resources {} from the resource estimator
I0206 21:35:21.521807 27135 process.cpp:3697] Handling HTTP event for process 'slave(698)' with path: '/slave(698)/containers'
I0206 21:35:21.522330 27138 http.cpp:871] Authorizing principal 'test-principal' to GET the '/containers' endpoint
I0206 21:35:21.523639 27132 slave.cpp:803] Agent terminating
[ OK ] Endpoint/SlaveEndpointTest.NoAuthorizer/2 (13 ms)
[----------] 9 tests from Endpoint/SlaveEndpointTest (120 ms total)
[----------] Global test environment tear-down
[==========] 1435 tests from 160 test cases ran. (195481 ms total)
[ PASSED ] 1434 tests.
[ FAILED ] 1 test, listed below:
[ FAILED ] ExamplesTest.PersistentVolumeFramework
1 FAILED TEST
YOU HAVE 11 DISABLED TESTS
make[3]: Leaving directory `/mesos/build'
make[3]: *** [CMakeFiles/check] Error 1
make[2]: Leaving directory `/mesos/build'
make[2]: *** [CMakeFiles/check.dir/all] Error 2
make[1]: *** [CMakeFiles/check.dir/rule] Error 2
make[1]: Leaving directory `/mesos/build'
make: *** [check] Error 2
+ docker rmi mesos-1486413615-13060
Untagged: mesos-1486413615-13060:latest
Deleted: sha256:ef8d98799f4c01d38f0b29cad711576928f5292d7c5a91feb89a6bf1484bf0d9
Deleted: sha256:938692dbd76a9b9969a7f059d0d9bafa117a35578d24d617ea2814a7ebc373c6
Deleted: sha256:9202422960d0c5ae617bd02699c5b8f44bd5298b7b21c7a70dfdb7870d72a311
Deleted: sha256:452010c08d49be8c56584b983fdea9543886b36d2483d85f301cb5d94a7f6c5b
Deleted: sha256:3986fbe0daf322f117106532836ccc54c0a36d6a1b756505447eb88e3341a424
Deleted: sha256:5ff1be60a05cfbbb04f4b84d5005853b707c766e128d897244a990fe56f28dd4
Deleted: sha256:cfa27ab85aa638eeded9d1070857dbd8d66adc09d9dc424bedf912ad3583cca8
Deleted: sha256:6b02f19a8836100a490c1055892532b8c499c37672c0076399269d6802b97158
Deleted: sha256:0009fbf8ffd8a4e85fb9ca25307dc96762a7064a439a800bbcccd952d71e9463
Deleted: sha256:e7aaaedeea3dd50c125a648145e432b6127fa3dc4cc8e3ac2b4a19c65400b1f4
Deleted: sha256:d938699ade4e7268d799808b3367155117797b686a7ea57e7cefd99bce21e560
Deleted: sha256:96d126943367644a0064c7007c5687e7e64bae9ce618e665989edefa7317e8d8
Deleted: sha256:d295737e1cf8507e69084800a270e3670d34f2d8a6eb3d8e60f514262e17ed63
Deleted: sha256:1617f91e5d1df6caf1501752baba46767f413571f9ca2cad6757515017b8001c
Deleted: sha256:f42b0009f3a261a860627080131377f93a5054460d8d271073b80717acab9205
Deleted: sha256:bdd08194ddf715bf0ef217c4ec06d703f20a9e40a302db71e8aafb2997c11b4d
Deleted: sha256:ceeeba54ec1b80444bb2cef58da49d9d7bd4b583c62cb8bd848f860a851ea578
Deleted: sha256:76b7d014611a011ae64daae57e47b078cb386afbec709dfbe6d317bf0d3f00ff
Deleted: sha256:9fd3a730c74d442d09d0c2f3a8262ba3dbeb587436d1bbd6707b263abebd2933
Deleted: sha256:10317f5a0d34f231f6408137f1df90f31e8bd36b25f6432cdf0c3b11d56e33f9
Deleted: sha256:90879d05933f6a7733e7a7cec96cea9b1f6718d777e549543e22157439be1b57
Deleted: sha256:d452b586f3d38f9fa236bb8560ac00a2fcef39205bcca9e9b0bd99b65359d664
Deleted: sha256:42415b2ed749e5f3f989a8e70889a99adb4a6a6c01b404e1efcf47d288b7307b
Deleted: sha256:a9c163526a2e5e9cca7e5b140f30cc59cda324e008a03c203fb5d6ac8cb2749a
Build step 'Execute shell' marked build as failure
Jenkins build is back to normal : Mesos-Buildbot » cmake,gcc,--verbose --enable-libevent --enable-ssl,GLOG_v=1 MESOS_VERBOSE=1,ubuntu:14.04,(docker||Hadoop)&&(!ubuntu-us1)&&(!ubuntu-eu2) #3235
Posted by Apache Jenkins Server <je...@builds.apache.org>.
See <https://builds.apache.org/job/Mesos-Buildbot/BUILDTOOL=cmake,COMPILER=gcc,CONFIGURATION=--verbose%20--enable-libevent%20--enable-ssl,ENVIRONMENT=GLOG_v=1%20MESOS_VERBOSE=1,OS=ubuntu%3A14.04,label_exp=(docker%7C%7CHadoop)&&(!ubuntu-us1)&&(!ubuntu-eu2)/3235/changes>