You are viewing a plain text version of this content. The canonical link for it is here.
Posted to commits@tuscany.apache.org by Apache Hudson Server <hu...@hudson.zones.apache.org> on 2010/06/08 16:51:22 UTC

Build failed in Hudson: Tuscany-2x #718

See <http://hudson.zones.apache.org/hudson/job/Tuscany-2x/718/changes>

Changes:

[kelvingoodson] bump java compiler source and target to java 6

[antelder] Start of the ws binding oasis testsuite for the trunk build

[antelder] Start of the jms binding oasis testsuite for the trunk build

------------------------------------------
[...truncated 5040 lines...]
-------------------------------------------------------
There are no tests to run.

Results :

Tests run: 0, Failures: 0, Errors: 0, Skipped: 0

[HUDSON] Recording test results
[INFO] [jar:jar {execution: default-jar}]
[INFO] Building jar: <http://hudson.zones.apache.org/hudson/job/Tuscany-2x/ws/sca-2x/modules/contribution-osgi/target/tuscany-contribution-osgi-2.0-SNAPSHOT.jar>
[INFO] [install:install {execution: default-install}]
[INFO] Installing <http://hudson.zones.apache.org/hudson/job/Tuscany-2x/ws/sca-2x/modules/contribution-osgi/target/tuscany-contribution-osgi-2.0-SNAPSHOT.jar> to /home/hudson/.m2/repository/org/apache/tuscany/sca/tuscany-contribution-osgi/2.0-SNAPSHOT/tuscany-contribution-osgi-2.0-SNAPSHOT.jar
[HUDSON] Archiving <http://hudson.zones.apache.org/hudson/job/Tuscany-2x/ws/sca-2x/modules/contribution-osgi/pom.xml> to /export/home/hudson/hudson/jobs/Tuscany-2x/modules/org.apache.tuscany.sca$tuscany-contribution-osgi/builds/2010-06-08_14-33-22/archive/org.apache.tuscany.sca/tuscany-contribution-osgi/2.0-SNAPSHOT/pom.xml
[HUDSON] Archiving <http://hudson.zones.apache.org/hudson/job/Tuscany-2x/ws/sca-2x/modules/contribution-osgi/target/tuscany-contribution-osgi-2.0-SNAPSHOT.jar> to /export/home/hudson/hudson/jobs/Tuscany-2x/modules/org.apache.tuscany.sca$tuscany-contribution-osgi/builds/2010-06-08_14-33-22/archive/org.apache.tuscany.sca/tuscany-contribution-osgi/2.0-SNAPSHOT/tuscany-contribution-osgi-2.0-SNAPSHOT.jar
[INFO] ------------------------------------------------------------------------
[INFO] Building Apache Tuscany SCA OSGi Implementation Extension
[INFO]    task-segment: [clean, install]
[INFO] ------------------------------------------------------------------------
[INFO] [clean:clean {execution: default-clean}]
[INFO] Deleting <http://hudson.zones.apache.org/hudson/job/Tuscany-2x/ws/sca-2x/modules/implementation-osgi/target>
[INFO] [enforcer:enforce {execution: enforce-plugin-versions}]
[INFO] [resources:resources {execution: default-resources}]
[INFO] Using 'UTF-8' encoding to copy filtered resources.
[INFO] Copying 7 resources
[INFO] Copying 3 resources
[INFO] [compiler:compile {execution: default-compile}]
[INFO] Compiling 25 source files to <http://hudson.zones.apache.org/hudson/job/Tuscany-2x/ws/sca-2x/modules/implementation-osgi/target/classes>
[INFO] [resources:testResources {execution: default-testResources}]
[INFO] Using 'UTF-8' encoding to copy filtered resources.
[INFO] Copying 3 resources
[INFO] [compiler:testCompile {execution: default-testCompile}]
[INFO] Compiling 10 source files to <http://hudson.zones.apache.org/hudson/job/Tuscany-2x/ws/sca-2x/modules/implementation-osgi/target/test-classes>
[INFO] [surefire:test {execution: default-test}]
[INFO] Surefire report directory: <http://hudson.zones.apache.org/hudson/job/Tuscany-2x/ws/sca-2x/modules/implementation-osgi/target/surefire-reports>

-------------------------------------------------------
 T E S T S
-------------------------------------------------------
Running org.apache.tuscany.sca.implementation.osgi.xml.OSGiReadImplTestCase
Tests run: 4, Failures: 0, Errors: 0, Skipped: 0, Time elapsed: 0.549 sec
Running org.apache.tuscany.sca.implementation.osgi.xml.ServiceDescriptionsTestCase
Jun 8, 2010 2:39:45 PM org.apache.tuscany.sca.contribution.processor.ExtensibleStAXArtifactProcessor [] (ElementCannotBeProcessed)
SEVERE: Element {http://acme.com/defs}config cannot be processed. ([row,col {unknown-source}]: [1,844])
[endpoint-description: {service.imported.configs=org.osgi.sca, service.intents={http://docs.oasis-open.org/ns/opencsa/sca/200912}SOAP {http://docs.oasis-open.org/ns/opencsa/sca/200912}HTTP, objectClass=[Ljava.lang.String;@1cd66ea}, endpoint-description: {com.acme.ws.xml=org.apache.tuscany.sca.assembly.impl.ExtensionImpl@1fbfd6, service.imported.configs=com.acme, service.intents=[{http://www.osgi.org/xmlns/rsa/v1.0.0}SOAP, {http://www.osgi.org/xmlns/rsa/v1.0.0}HTTP], objectClass=[Ljava.lang.String;@6b9c84, endpoint.id=http://ws.acme.com:9000/hello, endpoint.package.version.com.acme=4.2}]
Tests run: 1, Failures: 0, Errors: 0, Skipped: 0, Time elapsed: 0.034 sec
Running org.apache.tuscany.sca.implementation.osgi.xml.BluePrintComponentsProcessorTestCase
Tests run: 1, Failures: 0, Errors: 0, Skipped: 0, Time elapsed: 0.007 sec
Running org.apache.tuscany.sca.implementation.osgi.xml.OSGiComponentProcessorTestCase
Tests run: 1, Failures: 0, Errors: 0, Skipped: 0, Time elapsed: 0.006 sec

Results :

Tests run: 7, Failures: 0, Errors: 0, Skipped: 0

[HUDSON] Recording test results
[INFO] [jar:jar {execution: default-jar}]
[INFO] Building jar: <http://hudson.zones.apache.org/hudson/job/Tuscany-2x/ws/sca-2x/modules/implementation-osgi/target/tuscany-implementation-osgi-2.0-SNAPSHOT.jar>
[INFO] [install:install {execution: default-install}]
[INFO] Installing <http://hudson.zones.apache.org/hudson/job/Tuscany-2x/ws/sca-2x/modules/implementation-osgi/target/tuscany-implementation-osgi-2.0-SNAPSHOT.jar> to /home/hudson/.m2/repository/org/apache/tuscany/sca/tuscany-implementation-osgi/2.0-SNAPSHOT/tuscany-implementation-osgi-2.0-SNAPSHOT.jar
[HUDSON] Archiving <http://hudson.zones.apache.org/hudson/job/Tuscany-2x/ws/sca-2x/modules/implementation-osgi/pom.xml> to /export/home/hudson/hudson/jobs/Tuscany-2x/modules/org.apache.tuscany.sca$tuscany-implementation-osgi/builds/2010-06-08_14-33-22/archive/org.apache.tuscany.sca/tuscany-implementation-osgi/2.0-SNAPSHOT/pom.xml
[HUDSON] Archiving <http://hudson.zones.apache.org/hudson/job/Tuscany-2x/ws/sca-2x/modules/implementation-osgi/target/tuscany-implementation-osgi-2.0-SNAPSHOT.jar> to /export/home/hudson/hudson/jobs/Tuscany-2x/modules/org.apache.tuscany.sca$tuscany-implementation-osgi/builds/2010-06-08_14-33-22/archive/org.apache.tuscany.sca/tuscany-implementation-osgi/2.0-SNAPSHOT/tuscany-implementation-osgi-2.0-SNAPSHOT.jar
[INFO] ------------------------------------------------------------------------
[INFO] Building Apache Tuscany SCA OSGi Implementation Extension Runtime
[INFO]    task-segment: [clean, install]
[INFO] ------------------------------------------------------------------------
[INFO] [clean:clean {execution: default-clean}]
[INFO] Deleting <http://hudson.zones.apache.org/hudson/job/Tuscany-2x/ws/sca-2x/modules/implementation-osgi-runtime/target>
[INFO] [enforcer:enforce {execution: enforce-plugin-versions}]
[INFO] [resources:resources {execution: default-resources}]
[INFO] Using 'UTF-8' encoding to copy filtered resources.
[INFO] Copying 3 resources
[INFO] Copying 3 resources
[INFO] [compiler:compile {execution: default-compile}]
[INFO] Compiling 3 source files to <http://hudson.zones.apache.org/hudson/job/Tuscany-2x/ws/sca-2x/modules/implementation-osgi-runtime/target/classes>
[INFO] [resources:testResources {execution: default-testResources}]
[INFO] Using 'UTF-8' encoding to copy filtered resources.
[INFO] skip non existing resourceDirectory <http://hudson.zones.apache.org/hudson/job/Tuscany-2x/ws/sca-2x/modules/implementation-osgi-runtime/src/test/resources>
[INFO] [compiler:testCompile {execution: default-testCompile}]
[INFO] No sources to compile
[INFO] [surefire:test {execution: default-test}]
[INFO] No tests to run.
[HUDSON] Recording test results
[INFO] [jar:jar {execution: default-jar}]
[INFO] Building jar: <http://hudson.zones.apache.org/hudson/job/Tuscany-2x/ws/sca-2x/modules/implementation-osgi-runtime/target/tuscany-implementation-osgi-runtime-2.0-SNAPSHOT.jar>
[INFO] [install:install {execution: default-install}]
[INFO] Installing <http://hudson.zones.apache.org/hudson/job/Tuscany-2x/ws/sca-2x/modules/implementation-osgi-runtime/target/tuscany-implementation-osgi-runtime-2.0-SNAPSHOT.jar> to /home/hudson/.m2/repository/org/apache/tuscany/sca/tuscany-implementation-osgi-runtime/2.0-SNAPSHOT/tuscany-implementation-osgi-runtime-2.0-SNAPSHOT.jar
[HUDSON] Archiving <http://hudson.zones.apache.org/hudson/job/Tuscany-2x/ws/sca-2x/modules/implementation-osgi-runtime/pom.xml> to /export/home/hudson/hudson/jobs/Tuscany-2x/modules/org.apache.tuscany.sca$tuscany-implementation-osgi-runtime/builds/2010-06-08_14-33-23/archive/org.apache.tuscany.sca/tuscany-implementation-osgi-runtime/2.0-SNAPSHOT/pom.xml
[HUDSON] Archiving <http://hudson.zones.apache.org/hudson/job/Tuscany-2x/ws/sca-2x/modules/implementation-osgi-runtime/target/tuscany-implementation-osgi-runtime-2.0-SNAPSHOT.jar> to /export/home/hudson/hudson/jobs/Tuscany-2x/modules/org.apache.tuscany.sca$tuscany-implementation-osgi-runtime/builds/2010-06-08_14-33-23/archive/org.apache.tuscany.sca/tuscany-implementation-osgi-runtime/2.0-SNAPSHOT/tuscany-implementation-osgi-runtime-2.0-SNAPSHOT.jar
[INFO] ------------------------------------------------------------------------
[INFO] Building Apache Tuscany SCA Extensibility for Eclipse Equinox
[INFO]    task-segment: [clean, install]
[INFO] ------------------------------------------------------------------------
[INFO] [clean:clean {execution: default-clean}]
[INFO] Deleting <http://hudson.zones.apache.org/hudson/job/Tuscany-2x/ws/sca-2x/modules/extensibility-equinox/target>
[INFO] [enforcer:enforce {execution: enforce-plugin-versions}]
[INFO] [resources:resources {execution: default-resources}]
[INFO] Using 'UTF-8' encoding to copy filtered resources.
[INFO] skip non existing resourceDirectory <http://hudson.zones.apache.org/hudson/job/Tuscany-2x/ws/sca-2x/modules/extensibility-equinox/src/main/resources>
[INFO] Copying 3 resources
[INFO] [compiler:compile {execution: default-compile}]
[INFO] Compiling 3 source files to <http://hudson.zones.apache.org/hudson/job/Tuscany-2x/ws/sca-2x/modules/extensibility-equinox/target/classes>
[INFO] [resources:testResources {execution: default-testResources}]
[INFO] Using 'UTF-8' encoding to copy filtered resources.
[INFO] Copying 2 resources
[INFO] [dependency:copy-dependencies {execution: copy-dependencies}]
[INFO] [compiler:testCompile {execution: default-testCompile}]
[INFO] Compiling 3 source files to <http://hudson.zones.apache.org/hudson/job/Tuscany-2x/ws/sca-2x/modules/extensibility-equinox/target/test-classes>
[INFO] [surefire:test {execution: default-test}]
[INFO] Surefire report directory: <http://hudson.zones.apache.org/hudson/job/Tuscany-2x/ws/sca-2x/modules/extensibility-equinox/target/surefire-reports>

-------------------------------------------------------
 T E S T S
-------------------------------------------------------
Running org.apache.tuscany.sca.extensibility.equinox.EquinoxServiceDiscovererTestCase
Done
Tests run: 3, Failures: 0, Errors: 0, Skipped: 0, Time elapsed: 0.761 sec
Running org.apache.tuscany.sca.extensibility.equinox.EquinoxHostTestCase
0 org.eclipse.osgi ACTIVE System Bundle
Tests run: 2, Failures: 0, Errors: 0, Skipped: 0, Time elapsed: 0.774 sec

Results :

Tests run: 5, Failures: 0, Errors: 0, Skipped: 0

[HUDSON] Recording test results
[INFO] [jar:jar {execution: default-jar}]
[INFO] Building jar: <http://hudson.zones.apache.org/hudson/job/Tuscany-2x/ws/sca-2x/modules/extensibility-equinox/target/tuscany-extensibility-equinox-2.0-SNAPSHOT.jar>
[INFO] [install:install {execution: default-install}]
[INFO] Installing <http://hudson.zones.apache.org/hudson/job/Tuscany-2x/ws/sca-2x/modules/extensibility-equinox/target/tuscany-extensibility-equinox-2.0-SNAPSHOT.jar> to /home/hudson/.m2/repository/org/apache/tuscany/sca/tuscany-extensibility-equinox/2.0-SNAPSHOT/tuscany-extensibility-equinox-2.0-SNAPSHOT.jar
[HUDSON] Archiving <http://hudson.zones.apache.org/hudson/job/Tuscany-2x/ws/sca-2x/modules/extensibility-equinox/pom.xml> to /export/home/hudson/hudson/jobs/Tuscany-2x/modules/org.apache.tuscany.sca$tuscany-extensibility-equinox/builds/2010-06-08_14-33-19/archive/org.apache.tuscany.sca/tuscany-extensibility-equinox/2.0-SNAPSHOT/pom.xml
[HUDSON] Archiving <http://hudson.zones.apache.org/hudson/job/Tuscany-2x/ws/sca-2x/modules/extensibility-equinox/target/tuscany-extensibility-equinox-2.0-SNAPSHOT.jar> to /export/home/hudson/hudson/jobs/Tuscany-2x/modules/org.apache.tuscany.sca$tuscany-extensibility-equinox/builds/2010-06-08_14-33-19/archive/org.apache.tuscany.sca/tuscany-extensibility-equinox/2.0-SNAPSHOT/tuscany-extensibility-equinox-2.0-SNAPSHOT.jar
[INFO] ------------------------------------------------------------------------
[INFO] Building Apache Tuscany SCA Node Equinox OSGi Launcher
[INFO]    task-segment: [clean, install]
[INFO] ------------------------------------------------------------------------
[INFO] [clean:clean {execution: default-clean}]
[INFO] Deleting <http://hudson.zones.apache.org/hudson/job/Tuscany-2x/ws/sca-2x/modules/node-launcher-equinox/target>
[INFO] [enforcer:enforce {execution: enforce-plugin-versions}]
[INFO] [resources:resources {execution: default-resources}]
[INFO] Using 'UTF-8' encoding to copy filtered resources.
[INFO] Copying 24 resources
[INFO] Copying 3 resources
[INFO] [compiler:compile {execution: default-compile}]
[INFO] Compiling 12 source files to <http://hudson.zones.apache.org/hudson/job/Tuscany-2x/ws/sca-2x/modules/node-launcher-equinox/target/classes>
[INFO] [resources:testResources {execution: default-testResources}]
[INFO] Using 'UTF-8' encoding to copy filtered resources.
[INFO] skip non existing resourceDirectory <http://hudson.zones.apache.org/hudson/job/Tuscany-2x/ws/sca-2x/modules/node-launcher-equinox/src/test/resources>
[INFO] [compiler:testCompile {execution: default-testCompile}]
[INFO] No sources to compile
[INFO] [surefire:test {execution: default-test}]
[INFO] No tests to run.
[HUDSON] Recording test results
[INFO] [jar:jar {execution: default-jar}]
[INFO] Building jar: <http://hudson.zones.apache.org/hudson/job/Tuscany-2x/ws/sca-2x/modules/node-launcher-equinox/target/tuscany-node-launcher-equinox-2.0-SNAPSHOT.jar>
[INFO] [install:install {execution: default-install}]
[INFO] Installing <http://hudson.zones.apache.org/hudson/job/Tuscany-2x/ws/sca-2x/modules/node-launcher-equinox/target/tuscany-node-launcher-equinox-2.0-SNAPSHOT.jar> to /home/hudson/.m2/repository/org/apache/tuscany/sca/tuscany-node-launcher-equinox/2.0-SNAPSHOT/tuscany-node-launcher-equinox-2.0-SNAPSHOT.jar
[HUDSON] Archiving <http://hudson.zones.apache.org/hudson/job/Tuscany-2x/ws/sca-2x/modules/node-launcher-equinox/pom.xml> to /export/home/hudson/hudson/jobs/Tuscany-2x/modules/org.apache.tuscany.sca$tuscany-node-launcher-equinox/builds/2010-06-08_14-33-22/archive/org.apache.tuscany.sca/tuscany-node-launcher-equinox/2.0-SNAPSHOT/pom.xml
[HUDSON] Archiving <http://hudson.zones.apache.org/hudson/job/Tuscany-2x/ws/sca-2x/modules/node-launcher-equinox/target/tuscany-node-launcher-equinox-2.0-SNAPSHOT.jar> to /export/home/hudson/hudson/jobs/Tuscany-2x/modules/org.apache.tuscany.sca$tuscany-node-launcher-equinox/builds/2010-06-08_14-33-22/archive/org.apache.tuscany.sca/tuscany-node-launcher-equinox/2.0-SNAPSHOT/tuscany-node-launcher-equinox-2.0-SNAPSHOT.jar
[INFO] ------------------------------------------------------------------------
[INFO] Building Apache Tuscany SCA OSGi Node Implementation
[INFO]    task-segment: [clean, install]
[INFO] ------------------------------------------------------------------------
[INFO] [clean:clean {execution: default-clean}]
[INFO] Deleting <http://hudson.zones.apache.org/hudson/job/Tuscany-2x/ws/sca-2x/modules/node-impl-osgi/target>
[INFO] [enforcer:enforce {execution: enforce-plugin-versions}]
[INFO] [resources:resources {execution: default-resources}]
[INFO] Using 'UTF-8' encoding to copy filtered resources.
[INFO] Copying 3 resources
[INFO] Copying 3 resources
[INFO] [compiler:compile {execution: default-compile}]
[INFO] Compiling 32 source files to <http://hudson.zones.apache.org/hudson/job/Tuscany-2x/ws/sca-2x/modules/node-impl-osgi/target/classes>
[INFO] -------------------------------------------------------------
[ERROR] COMPILATION ERROR : 
[INFO] -------------------------------------------------------------
[ERROR] <http://hudson.zones.apache.org/hudson/job/Tuscany-2x/ws/sca-2x/modules/node-impl-osgi/src/main/java/org/apache/tuscany/sca/osgi/remoteserviceadmin/impl/RemoteServiceAdminImpl.java>:[223,20] unmappable character for encoding UTF-8

[ERROR] <http://hudson.zones.apache.org/hudson/job/Tuscany-2x/ws/sca-2x/modules/node-impl-osgi/src/main/java/org/apache/tuscany/sca/osgi/remoteserviceadmin/impl/RemoteServiceAdminImpl.java>:[224,23] unmappable character for encoding UTF-8

[ERROR] <http://hudson.zones.apache.org/hudson/job/Tuscany-2x/ws/sca-2x/modules/node-impl-osgi/src/main/java/org/apache/tuscany/sca/osgi/remoteserviceadmin/impl/RemoteServiceAdminImpl.java>:[225,33] unmappable character for encoding UTF-8

[ERROR] <http://hudson.zones.apache.org/hudson/job/Tuscany-2x/ws/sca-2x/modules/node-impl-osgi/src/main/java/org/apache/tuscany/sca/osgi/remoteserviceadmin/impl/RemoteServiceAdminImpl.java>:[228,19] unmappable character for encoding UTF-8

[ERROR] <http://hudson.zones.apache.org/hudson/job/Tuscany-2x/ws/sca-2x/modules/node-impl-osgi/src/main/java/org/apache/tuscany/sca/osgi/remoteserviceadmin/impl/RemoteServiceAdminImpl.java>:[229,33] unmappable character for encoding UTF-8

[ERROR] <http://hudson.zones.apache.org/hudson/job/Tuscany-2x/ws/sca-2x/modules/node-impl-osgi/src/main/java/org/apache/tuscany/sca/osgi/remoteserviceadmin/impl/RemoteServiceAdminImpl.java>:[230,33] unmappable character for encoding UTF-8

[ERROR] <http://hudson.zones.apache.org/hudson/job/Tuscany-2x/ws/sca-2x/modules/node-impl-osgi/src/main/java/org/apache/tuscany/sca/osgi/remoteserviceadmin/impl/RemoteServiceAdminImpl.java>:[231,31] unmappable character for encoding UTF-8

[ERROR] <http://hudson.zones.apache.org/hudson/job/Tuscany-2x/ws/sca-2x/modules/node-impl-osgi/src/main/java/org/apache/tuscany/sca/osgi/remoteserviceadmin/impl/RemoteServiceAdminImpl.java>:[232,33] unmappable character for encoding UTF-8

[ERROR] <http://hudson.zones.apache.org/hudson/job/Tuscany-2x/ws/sca-2x/modules/node-impl-osgi/src/main/java/org/apache/tuscany/sca/osgi/remoteserviceadmin/impl/RemoteServiceAdminImpl.java>:[233,32] unmappable character for encoding UTF-8

[ERROR] <http://hudson.zones.apache.org/hudson/job/Tuscany-2x/ws/sca-2x/modules/node-impl-osgi/src/main/java/org/apache/tuscany/sca/osgi/remoteserviceadmin/impl/RemoteServiceAdminImpl.java>:[234,25] unmappable character for encoding UTF-8

[ERROR] <http://hudson.zones.apache.org/hudson/job/Tuscany-2x/ws/sca-2x/modules/node-impl-osgi/src/main/java/org/apache/tuscany/sca/osgi/remoteserviceadmin/impl/RemoteServiceAdminImpl.java>:[235,38] unmappable character for encoding UTF-8

[ERROR] <http://hudson.zones.apache.org/hudson/job/Tuscany-2x/ws/sca-2x/modules/node-impl-osgi/src/main/java/org/apache/tuscany/sca/osgi/remoteserviceadmin/impl/RemoteServiceAdminImpl.java>:[237,23] unmappable character for encoding UTF-8

[ERROR] <http://hudson.zones.apache.org/hudson/job/Tuscany-2x/ws/sca-2x/modules/node-impl-osgi/src/main/java/org/apache/tuscany/sca/osgi/remoteserviceadmin/impl/RemoteServiceAdminImpl.java>:[238,19] unmappable character for encoding UTF-8

[ERROR] <http://hudson.zones.apache.org/hudson/job/Tuscany-2x/ws/sca-2x/modules/node-impl-osgi/src/main/java/org/apache/tuscany/sca/osgi/remoteserviceadmin/impl/EndpointIntrospector.java>:[176,77] unmappable character for encoding UTF-8

[INFO] 14 errors 
[INFO] -------------------------------------------------------------
[HUDSON] Archiving <http://hudson.zones.apache.org/hudson/job/Tuscany-2x/ws/sca-2x/modules/node-impl-osgi/pom.xml> to /export/home/hudson/hudson/jobs/Tuscany-2x/modules/org.apache.tuscany.sca$tuscany-node-impl-osgi/builds/2010-06-08_14-33-23/archive/org.apache.tuscany.sca/tuscany-node-impl-osgi/2.0-SNAPSHOT/pom.xml
[INFO] ------------------------------------------------------------------------
[ERROR] BUILD FAILURE
[INFO] ------------------------------------------------------------------------
[INFO] Compilation failure

<http://hudson.zones.apache.org/hudson/job/Tuscany-2x/ws/sca-2x/modules/node-impl-osgi/src/main/java/org/apache/tuscany/sca/osgi/remoteserviceadmin/impl/RemoteServiceAdminImpl.java>:[223,20] unmappable character for encoding UTF-8

<http://hudson.zones.apache.org/hudson/job/Tuscany-2x/ws/sca-2x/modules/node-impl-osgi/src/main/java/org/apache/tuscany/sca/osgi/remoteserviceadmin/impl/RemoteServiceAdminImpl.java>:[224,23] unmappable character for encoding UTF-8

<http://hudson.zones.apache.org/hudson/job/Tuscany-2x/ws/sca-2x/modules/node-impl-osgi/src/main/java/org/apache/tuscany/sca/osgi/remoteserviceadmin/impl/RemoteServiceAdminImpl.java>:[225,33] unmappable character for encoding UTF-8

<http://hudson.zones.apache.org/hudson/job/Tuscany-2x/ws/sca-2x/modules/node-impl-osgi/src/main/java/org/apache/tuscany/sca/osgi/remoteserviceadmin/impl/RemoteServiceAdminImpl.java>:[228,19] unmappable character for encoding UTF-8

<http://hudson.zones.apache.org/hudson/job/Tuscany-2x/ws/sca-2x/modules/node-impl-osgi/src/main/java/org/apache/tuscany/sca/osgi/remoteserviceadmin/impl/RemoteServiceAdminImpl.java>:[229,33] unmappable character for encoding UTF-8

<http://hudson.zones.apache.org/hudson/job/Tuscany-2x/ws/sca-2x/modules/node-impl-osgi/src/main/java/org/apache/tuscany/sca/osgi/remoteserviceadmin/impl/RemoteServiceAdminImpl.java>:[230,33] unmappable character for encoding UTF-8

<http://hudson.zones.apache.org/hudson/job/Tuscany-2x/ws/sca-2x/modules/node-impl-osgi/src/main/java/org/apache/tuscany/sca/osgi/remoteserviceadmin/impl/RemoteServiceAdminImpl.java>:[231,31] unmappable character for encoding UTF-8

<http://hudson.zones.apache.org/hudson/job/Tuscany-2x/ws/sca-2x/modules/node-impl-osgi/src/main/java/org/apache/tuscany/sca/osgi/remoteserviceadmin/impl/RemoteServiceAdminImpl.java>:[232,33] unmappable character for encoding UTF-8

<http://hudson.zones.apache.org/hudson/job/Tuscany-2x/ws/sca-2x/modules/node-impl-osgi/src/main/java/org/apache/tuscany/sca/osgi/remoteserviceadmin/impl/RemoteServiceAdminImpl.java>:[233,32] unmappable character for encoding UTF-8

<http://hudson.zones.apache.org/hudson/job/Tuscany-2x/ws/sca-2x/modules/node-impl-osgi/src/main/java/org/apache/tuscany/sca/osgi/remoteserviceadmin/impl/RemoteServiceAdminImpl.java>:[234,25] unmappable character for encoding UTF-8

<http://hudson.zones.apache.org/hudson/job/Tuscany-2x/ws/sca-2x/modules/node-impl-osgi/src/main/java/org/apache/tuscany/sca/osgi/remoteserviceadmin/impl/RemoteServiceAdminImpl.java>:[235,38] unmappable character for encoding UTF-8

<http://hudson.zones.apache.org/hudson/job/Tuscany-2x/ws/sca-2x/modules/node-impl-osgi/src/main/java/org/apache/tuscany/sca/osgi/remoteserviceadmin/impl/RemoteServiceAdminImpl.java>:[237,23] unmappable character for encoding UTF-8

<http://hudson.zones.apache.org/hudson/job/Tuscany-2x/ws/sca-2x/modules/node-impl-osgi/src/main/java/org/apache/tuscany/sca/osgi/remoteserviceadmin/impl/RemoteServiceAdminImpl.java>:[238,19] unmappable character for encoding UTF-8

<http://hudson.zones.apache.org/hudson/job/Tuscany-2x/ws/sca-2x/modules/node-impl-osgi/src/main/java/org/apache/tuscany/sca/osgi/remoteserviceadmin/impl/EndpointIntrospector.java>:[176,77] unmappable character for encoding UTF-8


[INFO] ------------------------------------------------------------------------
[INFO] For more information, run Maven with the -e switch
[INFO] ------------------------------------------------------------------------
[INFO] Total time: 6 minutes 9 seconds
[INFO] Finished at: Tue Jun 08 14:40:01 UTC 2010
[INFO] Final Memory: 63M/723M
[INFO] ------------------------------------------------------------------------
Waiting for Hudson to finish collecting data
Sending e-mails to: commits@tuscany.apache.org
channel stopped


Build failed in Hudson: Tuscany-2x #719

Posted by Apache Hudson Server <hu...@hudson.zones.apache.org>.
See <http://hudson.zones.apache.org/hudson/job/Tuscany-2x/719/changes>

Changes:

[rfeng] Remove non UTF-8 chars

------------------------------------------
[...truncated 5032 lines...]
Jun 9, 2010 12:44:58 AM org.apache.tuscany.sca.host.rmi.DefaultRMIHost registerService
INFO: RMI service registered: rmi://localhost:8099/HelloWorldRemoteService
Jun 9, 2010 12:44:58 AM org.apache.tuscany.sca.core.assembly.impl.EndpointRegistryImpl addEndpoint
INFO: Add endpoint - (@12578138)Endpoint:  URI = HelloWorldServiceComponent#service-binding(HelloWorldService/HelloWorldService)
Jun 9, 2010 12:44:58 AM org.apache.tuscany.sca.core.assembly.impl.EndpointRegistryImpl addEndpoint
INFO: Add endpoint - (@26564976)Endpoint:  URI = HelloWorldRmiServiceComponent#service-binding(HelloWorldRmiService/HelloWorldRmiService)
Hello from the RMI Service to - Tuscany World! thro the RMI Reference
Hi from Apache World in RMI Service to - Tuscany World! thro the RMI Reference
Expected exception :helloworld.HelloException
Jun 9, 2010 12:44:58 AM org.apache.tuscany.sca.node.impl.NodeImpl stop
INFO: Stopping node: http://tuscany.apache.org/sca/1.1/nodes/default0
Jun 9, 2010 12:44:58 AM org.apache.tuscany.sca.core.assembly.impl.EndpointRegistryImpl removeEndpoint
INFO: Remove endpoint - (@12578138)Endpoint:  URI = HelloWorldServiceComponent#service-binding(HelloWorldService/HelloWorldService)
Jun 9, 2010 12:44:58 AM org.apache.tuscany.sca.host.rmi.DefaultRMIHost unregisterService
INFO: RMI service unregistered: rmi://localhost:8099/HelloWorldRemoteService
Jun 9, 2010 12:44:58 AM org.apache.tuscany.sca.core.assembly.impl.EndpointRegistryImpl removeEndpoint
INFO: Remove endpoint - (@26564976)Endpoint:  URI = HelloWorldRmiServiceComponent#service-binding(HelloWorldRmiService/HelloWorldRmiService)
Tests run: 1, Failures: 0, Errors: 0, Skipped: 0, Time elapsed: 1.178 sec

Results :

Tests run: 1, Failures: 0, Errors: 0, Skipped: 0

[HUDSON] Recording test results
[INFO] [jar:jar {execution: default-jar}]
[INFO] Building jar: <http://hudson.zones.apache.org/hudson/job/Tuscany-2x/ws/sca-2x/modules/binding-rmi-runtime/target/tuscany-binding-rmi-runtime-2.0-SNAPSHOT.jar>
[INFO] [install:install {execution: default-install}]
[INFO] Installing <http://hudson.zones.apache.org/hudson/job/Tuscany-2x/ws/sca-2x/modules/binding-rmi-runtime/target/tuscany-binding-rmi-runtime-2.0-SNAPSHOT.jar> to /export/home/hudson/.m2/repository/org/apache/tuscany/sca/tuscany-binding-rmi-runtime/2.0-SNAPSHOT/tuscany-binding-rmi-runtime-2.0-SNAPSHOT.jar
[HUDSON] Archiving <http://hudson.zones.apache.org/hudson/job/Tuscany-2x/ws/sca-2x/modules/binding-rmi-runtime/pom.xml> to /export/home/hudson/hudson/jobs/Tuscany-2x/modules/org.apache.tuscany.sca$tuscany-binding-rmi-runtime/builds/2010-06-09_00-17-25/archive/org.apache.tuscany.sca/tuscany-binding-rmi-runtime/2.0-SNAPSHOT/pom.xml
[HUDSON] Archiving <http://hudson.zones.apache.org/hudson/job/Tuscany-2x/ws/sca-2x/modules/binding-rmi-runtime/target/tuscany-binding-rmi-runtime-2.0-SNAPSHOT.jar> to /export/home/hudson/hudson/jobs/Tuscany-2x/modules/org.apache.tuscany.sca$tuscany-binding-rmi-runtime/builds/2010-06-09_00-17-25/archive/org.apache.tuscany.sca/tuscany-binding-rmi-runtime/2.0-SNAPSHOT/tuscany-binding-rmi-runtime-2.0-SNAPSHOT.jar
[INFO] ------------------------------------------------------------------------
[INFO] Building Apache Tuscany SCA Contribution OSGi Bundle
[INFO]    task-segment: [clean, install]
[INFO] ------------------------------------------------------------------------
[INFO] [clean:clean {execution: default-clean}]
[INFO] Deleting <http://hudson.zones.apache.org/hudson/job/Tuscany-2x/ws/sca-2x/modules/contribution-osgi/target>
[INFO] [enforcer:enforce {execution: enforce-plugin-versions}]
[INFO] [resources:resources {execution: default-resources}]
[INFO] Using 'UTF-8' encoding to copy filtered resources.
[INFO] Copying 2 resources
[INFO] Copying 3 resources
[INFO] [compiler:compile {execution: default-compile}]
[INFO] Compiling 6 source files to <http://hudson.zones.apache.org/hudson/job/Tuscany-2x/ws/sca-2x/modules/contribution-osgi/target/classes>
[INFO] [resources:testResources {execution: default-testResources}]
[INFO] Using 'UTF-8' encoding to copy filtered resources.
[INFO] Copying 0 resource
[INFO] [compiler:testCompile {execution: default-testCompile}]
[INFO] Nothing to compile - all classes are up to date
[INFO] [surefire:test {execution: default-test}]
[INFO] Surefire report directory: <http://hudson.zones.apache.org/hudson/job/Tuscany-2x/ws/sca-2x/modules/contribution-osgi/target/surefire-reports>

-------------------------------------------------------
 T E S T S
-------------------------------------------------------
There are no tests to run.

Results :

Tests run: 0, Failures: 0, Errors: 0, Skipped: 0

[HUDSON] Recording test results
[INFO] [jar:jar {execution: default-jar}]
[INFO] Building jar: <http://hudson.zones.apache.org/hudson/job/Tuscany-2x/ws/sca-2x/modules/contribution-osgi/target/tuscany-contribution-osgi-2.0-SNAPSHOT.jar>
[INFO] [install:install {execution: default-install}]
[INFO] Installing <http://hudson.zones.apache.org/hudson/job/Tuscany-2x/ws/sca-2x/modules/contribution-osgi/target/tuscany-contribution-osgi-2.0-SNAPSHOT.jar> to /export/home/hudson/.m2/repository/org/apache/tuscany/sca/tuscany-contribution-osgi/2.0-SNAPSHOT/tuscany-contribution-osgi-2.0-SNAPSHOT.jar
[HUDSON] Archiving <http://hudson.zones.apache.org/hudson/job/Tuscany-2x/ws/sca-2x/modules/contribution-osgi/pom.xml> to /export/home/hudson/hudson/jobs/Tuscany-2x/modules/org.apache.tuscany.sca$tuscany-contribution-osgi/builds/2010-06-09_00-17-42/archive/org.apache.tuscany.sca/tuscany-contribution-osgi/2.0-SNAPSHOT/pom.xml
[HUDSON] Archiving <http://hudson.zones.apache.org/hudson/job/Tuscany-2x/ws/sca-2x/modules/contribution-osgi/target/tuscany-contribution-osgi-2.0-SNAPSHOT.jar> to /export/home/hudson/hudson/jobs/Tuscany-2x/modules/org.apache.tuscany.sca$tuscany-contribution-osgi/builds/2010-06-09_00-17-42/archive/org.apache.tuscany.sca/tuscany-contribution-osgi/2.0-SNAPSHOT/tuscany-contribution-osgi-2.0-SNAPSHOT.jar
[INFO] ------------------------------------------------------------------------
[INFO] Building Apache Tuscany SCA OSGi Implementation Extension
[INFO]    task-segment: [clean, install]
[INFO] ------------------------------------------------------------------------
[INFO] [clean:clean {execution: default-clean}]
[INFO] Deleting <http://hudson.zones.apache.org/hudson/job/Tuscany-2x/ws/sca-2x/modules/implementation-osgi/target>
[INFO] [enforcer:enforce {execution: enforce-plugin-versions}]
[INFO] [resources:resources {execution: default-resources}]
[INFO] Using 'UTF-8' encoding to copy filtered resources.
[INFO] Copying 7 resources
[INFO] Copying 3 resources
[INFO] [compiler:compile {execution: default-compile}]
[INFO] Compiling 25 source files to <http://hudson.zones.apache.org/hudson/job/Tuscany-2x/ws/sca-2x/modules/implementation-osgi/target/classes>
[INFO] [resources:testResources {execution: default-testResources}]
[INFO] Using 'UTF-8' encoding to copy filtered resources.
[INFO] Copying 3 resources
[INFO] [compiler:testCompile {execution: default-testCompile}]
[INFO] Compiling 10 source files to <http://hudson.zones.apache.org/hudson/job/Tuscany-2x/ws/sca-2x/modules/implementation-osgi/target/test-classes>
[INFO] [surefire:test {execution: default-test}]
[INFO] Surefire report directory: <http://hudson.zones.apache.org/hudson/job/Tuscany-2x/ws/sca-2x/modules/implementation-osgi/target/surefire-reports>

-------------------------------------------------------
 T E S T S
-------------------------------------------------------
Running org.apache.tuscany.sca.implementation.osgi.xml.OSGiReadImplTestCase
Tests run: 4, Failures: 0, Errors: 0, Skipped: 0, Time elapsed: 0.593 sec
Running org.apache.tuscany.sca.implementation.osgi.xml.ServiceDescriptionsTestCase
Jun 9, 2010 12:46:41 AM org.apache.tuscany.sca.contribution.processor.ExtensibleStAXArtifactProcessor [] (ElementCannotBeProcessed)
SEVERE: Element {http://acme.com/defs}config cannot be processed. ([row,col {unknown-source}]: [1,844])
[endpoint-description: {service.imported.configs=org.osgi.sca, service.intents={http://docs.oasis-open.org/ns/opencsa/sca/200912}SOAP {http://docs.oasis-open.org/ns/opencsa/sca/200912}HTTP, objectClass=[Ljava.lang.String;@1ee2c2c}, endpoint-description: {com.acme.ws.xml=org.apache.tuscany.sca.assembly.impl.ExtensionImpl@1963b3e, service.imported.configs=com.acme, service.intents=[{http://www.osgi.org/xmlns/rsa/v1.0.0}SOAP, {http://www.osgi.org/xmlns/rsa/v1.0.0}HTTP], objectClass=[Ljava.lang.String;@b6548, endpoint.id=http://ws.acme.com:9000/hello, endpoint.package.version.com.acme=4.2}]
Tests run: 1, Failures: 0, Errors: 0, Skipped: 0, Time elapsed: 0.036 sec
Running org.apache.tuscany.sca.implementation.osgi.xml.BluePrintComponentsProcessorTestCase
Tests run: 1, Failures: 0, Errors: 0, Skipped: 0, Time elapsed: 0.006 sec
Running org.apache.tuscany.sca.implementation.osgi.xml.OSGiComponentProcessorTestCase
Tests run: 1, Failures: 0, Errors: 0, Skipped: 0, Time elapsed: 0.007 sec

Results :

Tests run: 7, Failures: 0, Errors: 0, Skipped: 0

[HUDSON] Recording test results
[INFO] [jar:jar {execution: default-jar}]
[INFO] Building jar: <http://hudson.zones.apache.org/hudson/job/Tuscany-2x/ws/sca-2x/modules/implementation-osgi/target/tuscany-implementation-osgi-2.0-SNAPSHOT.jar>
[INFO] [install:install {execution: default-install}]
[INFO] Installing <http://hudson.zones.apache.org/hudson/job/Tuscany-2x/ws/sca-2x/modules/implementation-osgi/target/tuscany-implementation-osgi-2.0-SNAPSHOT.jar> to /export/home/hudson/.m2/repository/org/apache/tuscany/sca/tuscany-implementation-osgi/2.0-SNAPSHOT/tuscany-implementation-osgi-2.0-SNAPSHOT.jar
[HUDSON] Archiving <http://hudson.zones.apache.org/hudson/job/Tuscany-2x/ws/sca-2x/modules/implementation-osgi/pom.xml> to /export/home/hudson/hudson/jobs/Tuscany-2x/modules/org.apache.tuscany.sca$tuscany-implementation-osgi/builds/2010-06-09_00-17-42/archive/org.apache.tuscany.sca/tuscany-implementation-osgi/2.0-SNAPSHOT/pom.xml
[HUDSON] Archiving <http://hudson.zones.apache.org/hudson/job/Tuscany-2x/ws/sca-2x/modules/implementation-osgi/target/tuscany-implementation-osgi-2.0-SNAPSHOT.jar> to /export/home/hudson/hudson/jobs/Tuscany-2x/modules/org.apache.tuscany.sca$tuscany-implementation-osgi/builds/2010-06-09_00-17-42/archive/org.apache.tuscany.sca/tuscany-implementation-osgi/2.0-SNAPSHOT/tuscany-implementation-osgi-2.0-SNAPSHOT.jar
[INFO] ------------------------------------------------------------------------
[INFO] Building Apache Tuscany SCA OSGi Implementation Extension Runtime
[INFO]    task-segment: [clean, install]
[INFO] ------------------------------------------------------------------------
[INFO] [clean:clean {execution: default-clean}]
[INFO] Deleting <http://hudson.zones.apache.org/hudson/job/Tuscany-2x/ws/sca-2x/modules/implementation-osgi-runtime/target>
[INFO] [enforcer:enforce {execution: enforce-plugin-versions}]
[INFO] [resources:resources {execution: default-resources}]
[INFO] Using 'UTF-8' encoding to copy filtered resources.
[INFO] Copying 3 resources
[INFO] Copying 3 resources
[INFO] [compiler:compile {execution: default-compile}]
[INFO] Compiling 3 source files to <http://hudson.zones.apache.org/hudson/job/Tuscany-2x/ws/sca-2x/modules/implementation-osgi-runtime/target/classes>
[INFO] [resources:testResources {execution: default-testResources}]
[INFO] Using 'UTF-8' encoding to copy filtered resources.
[INFO] skip non existing resourceDirectory <http://hudson.zones.apache.org/hudson/job/Tuscany-2x/ws/sca-2x/modules/implementation-osgi-runtime/src/test/resources>
[INFO] [compiler:testCompile {execution: default-testCompile}]
[INFO] No sources to compile
[INFO] [surefire:test {execution: default-test}]
[INFO] No tests to run.
[HUDSON] Recording test results
[INFO] [jar:jar {execution: default-jar}]
[INFO] Building jar: <http://hudson.zones.apache.org/hudson/job/Tuscany-2x/ws/sca-2x/modules/implementation-osgi-runtime/target/tuscany-implementation-osgi-runtime-2.0-SNAPSHOT.jar>
[INFO] [install:install {execution: default-install}]
[INFO] Installing <http://hudson.zones.apache.org/hudson/job/Tuscany-2x/ws/sca-2x/modules/implementation-osgi-runtime/target/tuscany-implementation-osgi-runtime-2.0-SNAPSHOT.jar> to /export/home/hudson/.m2/repository/org/apache/tuscany/sca/tuscany-implementation-osgi-runtime/2.0-SNAPSHOT/tuscany-implementation-osgi-runtime-2.0-SNAPSHOT.jar
[HUDSON] Archiving <http://hudson.zones.apache.org/hudson/job/Tuscany-2x/ws/sca-2x/modules/implementation-osgi-runtime/pom.xml> to /export/home/hudson/hudson/jobs/Tuscany-2x/modules/org.apache.tuscany.sca$tuscany-implementation-osgi-runtime/builds/2010-06-09_00-17-43/archive/org.apache.tuscany.sca/tuscany-implementation-osgi-runtime/2.0-SNAPSHOT/pom.xml
[HUDSON] Archiving <http://hudson.zones.apache.org/hudson/job/Tuscany-2x/ws/sca-2x/modules/implementation-osgi-runtime/target/tuscany-implementation-osgi-runtime-2.0-SNAPSHOT.jar> to /export/home/hudson/hudson/jobs/Tuscany-2x/modules/org.apache.tuscany.sca$tuscany-implementation-osgi-runtime/builds/2010-06-09_00-17-43/archive/org.apache.tuscany.sca/tuscany-implementation-osgi-runtime/2.0-SNAPSHOT/tuscany-implementation-osgi-runtime-2.0-SNAPSHOT.jar
[INFO] ------------------------------------------------------------------------
[INFO] Building Apache Tuscany SCA Extensibility for Eclipse Equinox
[INFO]    task-segment: [clean, install]
[INFO] ------------------------------------------------------------------------
[INFO] [clean:clean {execution: default-clean}]
[INFO] Deleting <http://hudson.zones.apache.org/hudson/job/Tuscany-2x/ws/sca-2x/modules/extensibility-equinox/target>
[INFO] [enforcer:enforce {execution: enforce-plugin-versions}]
[INFO] [resources:resources {execution: default-resources}]
[INFO] Using 'UTF-8' encoding to copy filtered resources.
[INFO] skip non existing resourceDirectory <http://hudson.zones.apache.org/hudson/job/Tuscany-2x/ws/sca-2x/modules/extensibility-equinox/src/main/resources>
[INFO] Copying 3 resources
[INFO] [compiler:compile {execution: default-compile}]
[INFO] Compiling 3 source files to <http://hudson.zones.apache.org/hudson/job/Tuscany-2x/ws/sca-2x/modules/extensibility-equinox/target/classes>
[INFO] [resources:testResources {execution: default-testResources}]
[INFO] Using 'UTF-8' encoding to copy filtered resources.
[INFO] Copying 2 resources
[INFO] [dependency:copy-dependencies {execution: copy-dependencies}]
[INFO] [compiler:testCompile {execution: default-testCompile}]
[INFO] Compiling 3 source files to <http://hudson.zones.apache.org/hudson/job/Tuscany-2x/ws/sca-2x/modules/extensibility-equinox/target/test-classes>
[INFO] [surefire:test {execution: default-test}]
[INFO] Surefire report directory: <http://hudson.zones.apache.org/hudson/job/Tuscany-2x/ws/sca-2x/modules/extensibility-equinox/target/surefire-reports>

-------------------------------------------------------
 T E S T S
-------------------------------------------------------
Running org.apache.tuscany.sca.extensibility.equinox.EquinoxServiceDiscovererTestCase
Done
Tests run: 3, Failures: 0, Errors: 0, Skipped: 0, Time elapsed: 0.643 sec
Running org.apache.tuscany.sca.extensibility.equinox.EquinoxHostTestCase
0 org.eclipse.osgi ACTIVE System Bundle
Tests run: 2, Failures: 0, Errors: 0, Skipped: 0, Time elapsed: 0.654 sec

Results :

Tests run: 5, Failures: 0, Errors: 0, Skipped: 0

[HUDSON] Recording test results
[INFO] [jar:jar {execution: default-jar}]
[INFO] Building jar: <http://hudson.zones.apache.org/hudson/job/Tuscany-2x/ws/sca-2x/modules/extensibility-equinox/target/tuscany-extensibility-equinox-2.0-SNAPSHOT.jar>
[INFO] [install:install {execution: default-install}]
[INFO] Installing <http://hudson.zones.apache.org/hudson/job/Tuscany-2x/ws/sca-2x/modules/extensibility-equinox/target/tuscany-extensibility-equinox-2.0-SNAPSHOT.jar> to /export/home/hudson/.m2/repository/org/apache/tuscany/sca/tuscany-extensibility-equinox/2.0-SNAPSHOT/tuscany-extensibility-equinox-2.0-SNAPSHOT.jar
[HUDSON] Archiving <http://hudson.zones.apache.org/hudson/job/Tuscany-2x/ws/sca-2x/modules/extensibility-equinox/pom.xml> to /export/home/hudson/hudson/jobs/Tuscany-2x/modules/org.apache.tuscany.sca$tuscany-extensibility-equinox/builds/2010-06-09_00-17-33/archive/org.apache.tuscany.sca/tuscany-extensibility-equinox/2.0-SNAPSHOT/pom.xml
[HUDSON] Archiving <http://hudson.zones.apache.org/hudson/job/Tuscany-2x/ws/sca-2x/modules/extensibility-equinox/target/tuscany-extensibility-equinox-2.0-SNAPSHOT.jar> to /export/home/hudson/hudson/jobs/Tuscany-2x/modules/org.apache.tuscany.sca$tuscany-extensibility-equinox/builds/2010-06-09_00-17-33/archive/org.apache.tuscany.sca/tuscany-extensibility-equinox/2.0-SNAPSHOT/tuscany-extensibility-equinox-2.0-SNAPSHOT.jar
[INFO] ------------------------------------------------------------------------
[INFO] Building Apache Tuscany SCA Node Equinox OSGi Launcher
[INFO]    task-segment: [clean, install]
[INFO] ------------------------------------------------------------------------
[INFO] [clean:clean {execution: default-clean}]
[INFO] Deleting <http://hudson.zones.apache.org/hudson/job/Tuscany-2x/ws/sca-2x/modules/node-launcher-equinox/target>
[INFO] [enforcer:enforce {execution: enforce-plugin-versions}]
[INFO] [resources:resources {execution: default-resources}]
[INFO] Using 'UTF-8' encoding to copy filtered resources.
[INFO] Copying 24 resources
[INFO] Copying 3 resources
[INFO] [compiler:compile {execution: default-compile}]
[INFO] Compiling 12 source files to <http://hudson.zones.apache.org/hudson/job/Tuscany-2x/ws/sca-2x/modules/node-launcher-equinox/target/classes>
[INFO] [resources:testResources {execution: default-testResources}]
[INFO] Using 'UTF-8' encoding to copy filtered resources.
[INFO] skip non existing resourceDirectory <http://hudson.zones.apache.org/hudson/job/Tuscany-2x/ws/sca-2x/modules/node-launcher-equinox/src/test/resources>
[INFO] [compiler:testCompile {execution: default-testCompile}]
[INFO] No sources to compile
[INFO] [surefire:test {execution: default-test}]
[INFO] No tests to run.
[HUDSON] Recording test results
[INFO] [jar:jar {execution: default-jar}]
[INFO] Building jar: <http://hudson.zones.apache.org/hudson/job/Tuscany-2x/ws/sca-2x/modules/node-launcher-equinox/target/tuscany-node-launcher-equinox-2.0-SNAPSHOT.jar>
[INFO] [install:install {execution: default-install}]
[INFO] Installing <http://hudson.zones.apache.org/hudson/job/Tuscany-2x/ws/sca-2x/modules/node-launcher-equinox/target/tuscany-node-launcher-equinox-2.0-SNAPSHOT.jar> to /export/home/hudson/.m2/repository/org/apache/tuscany/sca/tuscany-node-launcher-equinox/2.0-SNAPSHOT/tuscany-node-launcher-equinox-2.0-SNAPSHOT.jar
[HUDSON] Archiving <http://hudson.zones.apache.org/hudson/job/Tuscany-2x/ws/sca-2x/modules/node-launcher-equinox/pom.xml> to /export/home/hudson/hudson/jobs/Tuscany-2x/modules/org.apache.tuscany.sca$tuscany-node-launcher-equinox/builds/2010-06-09_00-17-38/archive/org.apache.tuscany.sca/tuscany-node-launcher-equinox/2.0-SNAPSHOT/pom.xml
[HUDSON] Archiving <http://hudson.zones.apache.org/hudson/job/Tuscany-2x/ws/sca-2x/modules/node-launcher-equinox/target/tuscany-node-launcher-equinox-2.0-SNAPSHOT.jar> to /export/home/hudson/hudson/jobs/Tuscany-2x/modules/org.apache.tuscany.sca$tuscany-node-launcher-equinox/builds/2010-06-09_00-17-38/archive/org.apache.tuscany.sca/tuscany-node-launcher-equinox/2.0-SNAPSHOT/tuscany-node-launcher-equinox-2.0-SNAPSHOT.jar
[INFO] ------------------------------------------------------------------------
[INFO] Building Apache Tuscany SCA OSGi Node Implementation
[INFO]    task-segment: [clean, install]
[INFO] ------------------------------------------------------------------------
[INFO] [clean:clean {execution: default-clean}]
[INFO] Deleting <http://hudson.zones.apache.org/hudson/job/Tuscany-2x/ws/sca-2x/modules/node-impl-osgi/target>
[INFO] [enforcer:enforce {execution: enforce-plugin-versions}]
[INFO] [resources:resources {execution: default-resources}]
[INFO] Using 'UTF-8' encoding to copy filtered resources.
[INFO] Copying 3 resources
[INFO] Copying 3 resources
[INFO] [compiler:compile {execution: default-compile}]
[INFO] Compiling 32 source files to <http://hudson.zones.apache.org/hudson/job/Tuscany-2x/ws/sca-2x/modules/node-impl-osgi/target/classes>
[INFO] -------------------------------------------------------------
[ERROR] COMPILATION ERROR : 
[INFO] -------------------------------------------------------------
[ERROR] <http://hudson.zones.apache.org/hudson/job/Tuscany-2x/ws/sca-2x/modules/node-impl-osgi/src/main/java/org/apache/tuscany/sca/osgi/remoteserviceadmin/impl/EndpointIntrospector.java>:[176,77] unmappable character for encoding UTF-8

[INFO] 1error
[INFO] -------------------------------------------------------------
[HUDSON] Archiving <http://hudson.zones.apache.org/hudson/job/Tuscany-2x/ws/sca-2x/modules/node-impl-osgi/pom.xml> to /export/home/hudson/hudson/jobs/Tuscany-2x/modules/org.apache.tuscany.sca$tuscany-node-impl-osgi/builds/2010-06-09_00-17-43/archive/org.apache.tuscany.sca/tuscany-node-impl-osgi/2.0-SNAPSHOT/pom.xml
[INFO] ------------------------------------------------------------------------
[ERROR] BUILD FAILURE
[INFO] ------------------------------------------------------------------------
[INFO] Compilation failure
<http://hudson.zones.apache.org/hudson/job/Tuscany-2x/ws/sca-2x/modules/node-impl-osgi/src/main/java/org/apache/tuscany/sca/osgi/remoteserviceadmin/impl/EndpointIntrospector.java>:[176,77] unmappable character for encoding UTF-8


[INFO] ------------------------------------------------------------------------
[INFO] For more information, run Maven with the -e switch
[INFO] ------------------------------------------------------------------------
[INFO] Total time: 27 minutes 18 seconds
[INFO] Finished at: Wed Jun 09 00:49:51 GMT+00:00 2010
[INFO] Final Memory: 65M/752M
[INFO] ------------------------------------------------------------------------
Waiting for Hudson to finish collecting data
Sending e-mails to: commits@tuscany.apache.org
channel stopped