You are viewing a plain text version of this content. The canonical link for it is here.
Posted to commits@phoenix.apache.org by Apache Jenkins Server <je...@builds.apache.org> on 2015/09/10 01:23:45 UTC
Build failed in Jenkins: Phoenix | 4.x-HBase-0.98 #837
See <https://builds.apache.org/job/Phoenix-4.x-HBase-0.98/837/changes>
Changes:
[maryannxue] PHOENIX-2198 Support correlate variable
------------------------------------------
[...truncated 112629 lines...]
Running org.apache.phoenix.end2end.AlterTableWithViewsIT
Tests run: 4, Failures: 0, Errors: 0, Skipped: 0, Time elapsed: 9.168 sec - in org.apache.phoenix.end2end.UpsertBigValuesIT
Running org.apache.phoenix.end2end.salted.SaltedTableUpsertSelectIT
Tests run: 45, Failures: 5, Errors: 0, Skipped: 0, Time elapsed: 29.984 sec <<< FAILURE! - in org.apache.phoenix.end2end.SortOrderIT
descVarLengthDescPKGT(org.apache.phoenix.end2end.SortOrderIT) Time elapsed: 0.489 sec <<< FAILURE!
org.junit.internal.ArrayComparisonFailure: Unexpected result for query SELECT k1 FROM DescColumnSortOrderTest WHERE k2 > 'b': arrays first differed at element [0]; expected:<3> but was:<5>
at org.junit.Assert.fail(Assert.java:88)
at org.junit.Assert.failNotEquals(Assert.java:834)
at org.junit.Assert.assertEquals(Assert.java:118)
at org.junit.Assert.assertEquals(Assert.java:144)
at org.junit.internal.ExactComparisonCriteria.assertElementsEqual(ExactComparisonCriteria.java:8)
at org.junit.internal.ComparisonCriteria.arrayEquals(ComparisonCriteria.java:53)
at org.junit.Assert.internalArrayEquals(Assert.java:532)
at org.junit.Assert.assertArrayEquals(Assert.java:283)
at org.apache.phoenix.end2end.SortOrderIT.runQuery(SortOrderIT.java:603)
at org.apache.phoenix.end2end.SortOrderIT.runQueryTest(SortOrderIT.java:552)
at org.apache.phoenix.end2end.SortOrderIT.descVarLengthDescPKGT(SortOrderIT.java:383)
descVarLengthDescPKLTE(org.apache.phoenix.end2end.SortOrderIT) Time elapsed: 0.486 sec <<< FAILURE!
org.junit.internal.ArrayComparisonFailure: Unexpected result for query SELECT k1 FROM DescColumnSortOrderTest WHERE k2 <= 'bb': arrays first differed at element [0]; expected:<2> but was:<3>
at org.junit.Assert.fail(Assert.java:88)
at org.junit.Assert.failNotEquals(Assert.java:834)
at org.junit.Assert.assertEquals(Assert.java:118)
at org.junit.Assert.assertEquals(Assert.java:144)
at org.junit.internal.ExactComparisonCriteria.assertElementsEqual(ExactComparisonCriteria.java:8)
at org.junit.internal.ComparisonCriteria.arrayEquals(ComparisonCriteria.java:53)
at org.junit.Assert.internalArrayEquals(Assert.java:532)
at org.junit.Assert.assertArrayEquals(Assert.java:283)
at org.apache.phoenix.end2end.SortOrderIT.runQuery(SortOrderIT.java:603)
at org.apache.phoenix.end2end.SortOrderIT.runQueryTest(SortOrderIT.java:552)
at org.apache.phoenix.end2end.SortOrderIT.descVarLengthDescPKLTE(SortOrderIT.java:392)
testSkipScanCompare(org.apache.phoenix.end2end.SortOrderIT) Time elapsed: 2.795 sec <<< FAILURE!
java.lang.AssertionError: t_null_DECIMAL_DESC
at org.junit.Assert.fail(Assert.java:88)
at org.junit.Assert.assertTrue(Assert.java:41)
at org.apache.phoenix.end2end.SortOrderIT.testCompareCompositeKey(SortOrderIT.java:482)
at org.apache.phoenix.end2end.SortOrderIT.testSkipScanCompare(SortOrderIT.java:456)
descVarLengthAscPKLTE(org.apache.phoenix.end2end.SortOrderIT) Time elapsed: 0.529 sec <<< FAILURE!
org.junit.internal.ArrayComparisonFailure: Unexpected result for query SELECT k1 FROM DescColumnSortOrderTest WHERE 'bb' <= k2: arrays first differed at element [0]; expected:<1> but was:<4>
at org.junit.Assert.fail(Assert.java:88)
at org.junit.Assert.failNotEquals(Assert.java:834)
at org.junit.Assert.assertEquals(Assert.java:118)
at org.junit.Assert.assertEquals(Assert.java:144)
at org.junit.internal.ExactComparisonCriteria.assertElementsEqual(ExactComparisonCriteria.java:8)
at org.junit.internal.ComparisonCriteria.arrayEquals(ComparisonCriteria.java:53)
at org.junit.Assert.internalArrayEquals(Assert.java:532)
at org.junit.Assert.assertArrayEquals(Assert.java:283)
at org.apache.phoenix.end2end.SortOrderIT.runQuery(SortOrderIT.java:603)
at org.apache.phoenix.end2end.SortOrderIT.runQueryTest(SortOrderIT.java:552)
at org.apache.phoenix.end2end.SortOrderIT.descVarLengthAscPKLTE(SortOrderIT.java:401)
testNonPKCompare(org.apache.phoenix.end2end.SortOrderIT) Time elapsed: 0.934 sec <<< FAILURE!
java.lang.AssertionError: t_null_DECIMAL_DESC expected:<2> but was:<3>
at org.junit.Assert.fail(Assert.java:88)
at org.junit.Assert.failNotEquals(Assert.java:834)
at org.junit.Assert.assertEquals(Assert.java:645)
at org.apache.phoenix.end2end.SortOrderIT.testCompareCompositeKey(SortOrderIT.java:483)
at org.apache.phoenix.end2end.SortOrderIT.testNonPKCompare(SortOrderIT.java:440)
Running org.apache.phoenix.end2end.salted.SaltedTableVarLengthRowKeyIT
Tests run: 1, Failures: 0, Errors: 0, Skipped: 0, Time elapsed: 3.235 sec - in org.apache.phoenix.end2end.salted.SaltedTableVarLengthRowKeyIT
Running org.apache.phoenix.end2end.QueryMoreIT
Tests run: 5, Failures: 0, Errors: 0, Skipped: 0, Time elapsed: 7.514 sec - in org.apache.phoenix.end2end.salted.SaltedTableUpsertSelectIT
Running org.apache.phoenix.end2end.ReverseScanIT
Tests run: 3, Failures: 0, Errors: 0, Skipped: 0, Time elapsed: 5.651 sec - in org.apache.phoenix.end2end.ReverseScanIT
Running org.apache.phoenix.end2end.RTrimFunctionIT
Tests run: 2, Failures: 0, Errors: 0, Skipped: 0, Time elapsed: 2.057 sec - in org.apache.phoenix.end2end.RTrimFunctionIT
Running org.apache.phoenix.end2end.StoreNullsIT
Tests run: 21, Failures: 0, Errors: 0, Skipped: 0, Time elapsed: 82.308 sec - in org.apache.phoenix.end2end.SubqueryIT
Running org.apache.phoenix.end2end.PhoenixRuntimeIT
Tests run: 5, Failures: 0, Errors: 0, Skipped: 0, Time elapsed: 18.477 sec - in org.apache.phoenix.end2end.QueryMoreIT
Running org.apache.phoenix.end2end.RegexpSubstrFunctionIT
Tests run: 2, Failures: 0, Errors: 0, Skipped: 0, Time elapsed: 2.746 sec - in org.apache.phoenix.end2end.RegexpSubstrFunctionIT
Running org.apache.phoenix.end2end.ServerExceptionIT
Tests run: 1, Failures: 0, Errors: 0, Skipped: 0, Time elapsed: 2.667 sec - in org.apache.phoenix.end2end.ServerExceptionIT
Tests run: 3, Failures: 0, Errors: 0, Skipped: 0, Time elapsed: 16.343 sec - in org.apache.phoenix.end2end.StoreNullsIT
Running org.apache.phoenix.end2end.ArrayAppendFunctionIT
Running org.apache.phoenix.end2end.ExpFunctionEnd2EndIT
Tests run: 2, Failures: 0, Errors: 0, Skipped: 0, Time elapsed: 14.564 sec - in org.apache.phoenix.end2end.PhoenixRuntimeIT
Running org.apache.phoenix.end2end.AutoCommitIT
Tests run: 1, Failures: 0, Errors: 0, Skipped: 0, Time elapsed: 2.719 sec - in org.apache.phoenix.end2end.AutoCommitIT
Tests run: 3, Failures: 0, Errors: 0, Skipped: 0, Time elapsed: 9.358 sec - in org.apache.phoenix.end2end.ExpFunctionEnd2EndIT
Running org.apache.phoenix.end2end.SortMergeJoinIT
Running org.apache.phoenix.end2end.StddevIT
Tests run: 34, Failures: 0, Errors: 0, Skipped: 0, Time elapsed: 12.635 sec - in org.apache.phoenix.end2end.ArrayAppendFunctionIT
Running org.apache.phoenix.end2end.IsNullIT
Tests run: 4, Failures: 0, Errors: 0, Skipped: 0, Time elapsed: 4.936 sec - in org.apache.phoenix.end2end.StddevIT
Running org.apache.phoenix.end2end.SignFunctionEnd2EndIT
Tests run: 3, Failures: 0, Errors: 0, Skipped: 0, Time elapsed: 4.301 sec - in org.apache.phoenix.end2end.IsNullIT
Running org.apache.phoenix.end2end.LastValueFunctionIT
Tests run: 2, Failures: 0, Errors: 0, Skipped: 0, Time elapsed: 7.02 sec - in org.apache.phoenix.end2end.SignFunctionEnd2EndIT
Tests run: 11, Failures: 0, Errors: 0, Skipped: 0, Time elapsed: 5.813 sec - in org.apache.phoenix.end2end.LastValueFunctionIT
Running org.apache.phoenix.end2end.HashJoinLocalIndexIT
Running org.apache.phoenix.end2end.RoundFloorCeilFunctionsEnd2EndIT
Tests run: 31, Failures: 0, Errors: 0, Skipped: 0, Time elapsed: 11.095 sec - in org.apache.phoenix.end2end.RoundFloorCeilFunctionsEnd2EndIT
Running org.apache.phoenix.end2end.LpadFunctionIT
Tests run: 1, Failures: 0, Errors: 0, Skipped: 0, Time elapsed: 15.04 sec - in org.apache.phoenix.end2end.HashJoinLocalIndexIT
Running org.apache.phoenix.iterate.RoundRobinResultIteratorIT
Tests run: 12, Failures: 0, Errors: 0, Skipped: 0, Time elapsed: 12.095 sec - in org.apache.phoenix.end2end.LpadFunctionIT
Tests run: 9, Failures: 0, Errors: 0, Skipped: 0, Time elapsed: 54.337 sec - in org.apache.phoenix.iterate.RoundRobinResultIteratorIT
Tests run: 15, Failures: 0, Errors: 0, Skipped: 0, Time elapsed: 162.634 sec - in org.apache.phoenix.end2end.AlterTableWithViewsIT
Tests run: 108, Failures: 0, Errors: 0, Skipped: 0, Time elapsed: 292.45 sec - in org.apache.phoenix.end2end.HashJoinIT
Tests run: 108, Failures: 0, Errors: 0, Skipped: 0, Time elapsed: 287.129 sec - in org.apache.phoenix.end2end.SortMergeJoinIT
Results :
Failed tests:
SortOrderIT.descVarLengthAscPKLTE:401->runQueryTest:552->runQuery:603 Unexpected result for query SELECT k1 FROM DescColumnSortOrderTest WHERE 'bb' <= k2: arrays first differed at element [0]; expected:<1> but was:<4>
SortOrderIT.descVarLengthDescPKGT:383->runQueryTest:552->runQuery:603 Unexpected result for query SELECT k1 FROM DescColumnSortOrderTest WHERE k2 > 'b': arrays first differed at element [0]; expected:<3> but was:<5>
SortOrderIT.descVarLengthDescPKLTE:392->runQueryTest:552->runQuery:603 Unexpected result for query SELECT k1 FROM DescColumnSortOrderTest WHERE k2 <= 'bb': arrays first differed at element [0]; expected:<2> but was:<3>
SortOrderIT.testNonPKCompare:440->testCompareCompositeKey:483 t_null_DECIMAL_DESC expected:<2> but was:<3>
SortOrderIT.testSkipScanCompare:456->testCompareCompositeKey:482 t_null_DECIMAL_DESC
Tests run: 1163, Failures: 5, Errors: 0, Skipped: 0
[INFO]
[INFO] --- maven-failsafe-plugin:2.18:integration-test (NeedTheirOwnClusterTests) @ phoenix-core ---
[INFO] Failsafe report directory: <https://builds.apache.org/job/Phoenix-4.x-HBase-0.98/ws/phoenix-core/target/failsafe-reports>
[INFO] parallel='none', perCoreThreadCount=true, threadCount=0, useUnlimitedThreads=false, threadCountSuites=0, threadCountClasses=0, threadCountMethods=0, parallelOptimized=true
-------------------------------------------------------
T E S T S
-------------------------------------------------------
Running org.apache.phoenix.hbase.index.balancer.IndexLoadBalancerIT
Running org.apache.phoenix.hbase.index.covered.example.EndToEndCoveredIndexingIT
Running org.apache.phoenix.rpc.PhoenixServerRpcIT
Running org.apache.phoenix.rpc.PhoenixClientRpcIT
Running org.apache.phoenix.monitoring.PhoenixMetricsIT
Tests run: 2, Failures: 0, Errors: 0, Skipped: 0, Time elapsed: 6.577 sec - in org.apache.phoenix.rpc.PhoenixClientRpcIT
Running org.apache.phoenix.hbase.index.covered.example.FailWithoutRetriesIT
Tests run: 2, Failures: 0, Errors: 0, Skipped: 0, Time elapsed: 16.873 sec - in org.apache.phoenix.rpc.PhoenixServerRpcIT
Tests run: 1, Failures: 0, Errors: 0, Skipped: 0, Time elapsed: 8.473 sec - in org.apache.phoenix.hbase.index.covered.example.FailWithoutRetriesIT
Running org.apache.phoenix.hbase.index.covered.example.EndtoEndIndexingWithCompressionIT
Running org.apache.phoenix.hbase.index.covered.EndToEndCoveredColumnsIndexBuilderIT
Tests run: 11, Failures: 0, Errors: 0, Skipped: 0, Time elapsed: 48.096 sec - in org.apache.phoenix.hbase.index.covered.example.EndToEndCoveredIndexingIT
Running org.apache.phoenix.hbase.index.FailForUnsupportedHBaseVersionsIT
Tests run: 2, Failures: 0, Errors: 0, Skipped: 0, Time elapsed: 8.765 sec - in org.apache.phoenix.hbase.index.covered.EndToEndCoveredColumnsIndexBuilderIT
Tests run: 17, Failures: 0, Errors: 0, Skipped: 0, Time elapsed: 49.174 sec - in org.apache.phoenix.monitoring.PhoenixMetricsIT
Running org.apache.phoenix.end2end.SpillableGroupByIT
Tests run: 2, Failures: 0, Errors: 0, Skipped: 0, Time elapsed: 16.07 sec - in org.apache.phoenix.hbase.index.FailForUnsupportedHBaseVersionsIT
Tests run: 1, Failures: 0, Errors: 0, Skipped: 0, Time elapsed: 11.038 sec - in org.apache.phoenix.end2end.SpillableGroupByIT
Running org.apache.phoenix.end2end.KeyOnlyIT
Running org.apache.phoenix.end2end.ParallelIteratorsIT
Tests run: 3, Failures: 0, Errors: 0, Skipped: 0, Time elapsed: 9.562 sec - in org.apache.phoenix.end2end.KeyOnlyIT
Running org.apache.phoenix.end2end.TenantSpecificTablesDDLIT
Tests run: 11, Failures: 0, Errors: 0, Skipped: 0, Time elapsed: 57.934 sec - in org.apache.phoenix.hbase.index.covered.example.EndtoEndIndexingWithCompressionIT
Running org.apache.phoenix.end2end.index.MutableIndexFailureIT
Tests run: 2, Failures: 0, Errors: 0, Skipped: 0, Time elapsed: 18.202 sec - in org.apache.phoenix.end2end.ParallelIteratorsIT
Tests run: 9, Failures: 0, Errors: 0, Skipped: 0, Time elapsed: 105.224 sec - in org.apache.phoenix.hbase.index.balancer.IndexLoadBalancerIT
Running org.apache.phoenix.end2end.index.MutableIndexReplicationIT
Tests run: 17, Failures: 0, Errors: 0, Skipped: 0, Time elapsed: 21.676 sec - in org.apache.phoenix.end2end.TenantSpecificTablesDDLIT
Running org.apache.phoenix.end2end.index.ImmutableIndexWithStatsIT
Running org.apache.phoenix.end2end.ContextClassloaderIT
Running org.apache.phoenix.end2end.AlterTableIT
Tests run: 1, Failures: 0, Errors: 0, Skipped: 0, Time elapsed: 8.283 sec - in org.apache.phoenix.end2end.index.ImmutableIndexWithStatsIT
Tests run: 1, Failures: 0, Errors: 0, Skipped: 0, Time elapsed: 17.647 sec - in org.apache.phoenix.end2end.index.MutableIndexReplicationIT
Tests run: 3, Failures: 0, Errors: 0, Skipped: 0, Time elapsed: 8.108 sec - in org.apache.phoenix.end2end.ContextClassloaderIT
Running org.apache.phoenix.end2end.ViewIT
Running org.apache.phoenix.end2end.QueryWithLimitIT
Running org.apache.phoenix.end2end.StatsCollectorIT
Tests run: 2, Failures: 0, Errors: 0, Skipped: 0, Time elapsed: 9.168 sec - in org.apache.phoenix.end2end.QueryWithLimitIT
Running org.apache.phoenix.end2end.StatsCollectorWithSplitsAndMultiCFIT
Tests run: 22, Failures: 0, Errors: 0, Skipped: 0, Time elapsed: 50.13 sec - in org.apache.phoenix.end2end.ViewIT
Tests run: 2, Failures: 0, Errors: 0, Skipped: 0, Time elapsed: 27.964 sec - in org.apache.phoenix.end2end.StatsCollectorWithSplitsAndMultiCFIT
Tests run: 4, Failures: 0, Errors: 0, Skipped: 0, Time elapsed: 56.66 sec - in org.apache.phoenix.end2end.StatsCollectorIT
Running org.apache.phoenix.end2end.CountDistinctCompressionIT
Tests run: 1, Failures: 0, Errors: 0, Skipped: 0, Time elapsed: 7.869 sec - in org.apache.phoenix.end2end.CountDistinctCompressionIT
Running org.apache.phoenix.end2end.UserDefinedFunctionsIT
Running org.apache.phoenix.end2end.TenantSpecificTablesDMLIT
Running org.apache.phoenix.end2end.SaltedViewIT
Tests run: 13, Failures: 0, Errors: 0, Skipped: 0, Time elapsed: 13.286 sec - in org.apache.phoenix.end2end.UserDefinedFunctionsIT
Tests run: 3, Failures: 0, Errors: 0, Skipped: 0, Time elapsed: 145.626 sec - in org.apache.phoenix.end2end.index.MutableIndexFailureIT
Tests run: 2, Failures: 0, Errors: 0, Skipped: 0, Time elapsed: 8.433 sec - in org.apache.phoenix.end2end.SaltedViewIT
Running org.apache.phoenix.end2end.QueryTimeoutIT
Tests run: 16, Failures: 0, Errors: 0, Skipped: 0, Time elapsed: 27.109 sec - in org.apache.phoenix.end2end.TenantSpecificTablesDMLIT
Running org.apache.phoenix.end2end.UnionAllIT
Running org.apache.phoenix.end2end.MultiCfQueryExecIT
Tests run: 1, Failures: 0, Errors: 0, Skipped: 0, Time elapsed: 19.497 sec - in org.apache.phoenix.end2end.QueryTimeoutIT
Running org.apache.phoenix.execute.PartialCommitIT
Tests run: 11, Failures: 0, Errors: 0, Skipped: 0, Time elapsed: 21.598 sec - in org.apache.phoenix.end2end.UnionAllIT
Tests run: 7, Failures: 0, Errors: 0, Skipped: 0, Time elapsed: 17.354 sec - in org.apache.phoenix.end2end.MultiCfQueryExecIT
Tests run: 6, Failures: 0, Errors: 0, Skipped: 0, Time elapsed: 5.333 sec - in org.apache.phoenix.execute.PartialCommitIT
Running org.apache.hadoop.hbase.regionserver.wal.WALReplayWithIndexWritesAndCompressedWALIT
Running org.apache.phoenix.iterate.RoundRobinResultIteratorWithStatsIT
Tests run: 1, Failures: 0, Errors: 0, Skipped: 0, Time elapsed: 11.859 sec - in org.apache.hadoop.hbase.regionserver.wal.WALReplayWithIndexWritesAndCompressedWALIT
Running org.apache.hadoop.hbase.regionserver.wal.WALReplayWithIndexWritesAndUncompressedWALInHBase_094_9_IT
Running org.apache.phoenix.mapreduce.IndexToolIT
Tests run: 1, Failures: 0, Errors: 0, Skipped: 0, Time elapsed: 8.821 sec - in org.apache.phoenix.iterate.RoundRobinResultIteratorWithStatsIT
Running org.apache.phoenix.mapreduce.CsvBulkLoadToolIT
Tests run: 1, Failures: 0, Errors: 0, Skipped: 0, Time elapsed: 14.958 sec - in org.apache.hadoop.hbase.regionserver.wal.WALReplayWithIndexWritesAndUncompressedWALInHBase_094_9_IT
Tests run: 51, Failures: 0, Errors: 0, Skipped: 0, Time elapsed: 311.928 sec - in org.apache.phoenix.end2end.AlterTableIT
Tests run: 6, Failures: 0, Errors: 0, Skipped: 0, Time elapsed: 311.62 sec - in org.apache.phoenix.mapreduce.CsvBulkLoadToolIT
Tests run: 9, Failures: 0, Errors: 0, Skipped: 0, Time elapsed: 342.388 sec - in org.apache.phoenix.mapreduce.IndexToolIT
Results :
Tests run: 244, Failures: 0, Errors: 0, Skipped: 0
[INFO]
[INFO] --- maven-failsafe-plugin:2.18:verify (ClientManagedTimeTests) @ phoenix-core ---
[INFO] Failsafe report directory: <https://builds.apache.org/job/Phoenix-4.x-HBase-0.98/ws/phoenix-core/target/failsafe-reports>
[INFO] ------------------------------------------------------------------------
[INFO] Reactor Summary:
[INFO]
[INFO] Apache Phoenix .................................... SUCCESS [3.980s]
[INFO] Phoenix Core ...................................... FAILURE [29:53.340s]
[INFO] Phoenix - Flume ................................... SKIPPED
[INFO] Phoenix - Pig ..................................... SKIPPED
[INFO] Phoenix Query Server Client ....................... SKIPPED
[INFO] Phoenix Query Server .............................. SKIPPED
[INFO] Phoenix - Pherf ................................... SKIPPED
[INFO] Phoenix - Spark ................................... SKIPPED
[INFO] Phoenix Assembly .................................. SKIPPED
[INFO] ------------------------------------------------------------------------
[INFO] BUILD FAILURE
[INFO] ------------------------------------------------------------------------
[INFO] Total time: 29:57.800s
[INFO] Finished at: Wed Sep 09 23:20:32 UTC 2015
[INFO] Final Memory: 55M/1247M
[INFO] ------------------------------------------------------------------------
[ERROR] Failed to execute goal org.apache.maven.plugins:maven-failsafe-plugin:2.18:verify (ClientManagedTimeTests) on project phoenix-core: There are test failures.
[ERROR]
[ERROR] Please refer to <https://builds.apache.org/job/Phoenix-4.x-HBase-0.98/ws/phoenix-core/target/failsafe-reports> for the individual test results.
[ERROR] -> [Help 1]
[ERROR]
[ERROR] To see the full stack trace of the errors, re-run Maven with the -e switch.
[ERROR] Re-run Maven using the -X switch to enable full debug logging.
[ERROR]
[ERROR] For more information about the errors and possible solutions, please read the following articles:
[ERROR] [Help 1] http://cwiki.apache.org/confluence/display/MAVEN/MojoFailureException
[ERROR]
[ERROR] After correcting the problems, you can resume the build with the command
[ERROR] mvn <goals> -rf :phoenix-core
Build step 'Invoke top-level Maven targets' marked build as failure
Archiving artifacts
Sending artifact delta relative to Phoenix | 4.x-HBase-0.98 #835
Archived 1242 artifacts
Archive block size is 32768
Received 13710 blocks and 502659613 bytes
Compression is 47.2%
Took 3 min 7 sec
Recording test results
Jenkins build is back to normal : Phoenix | 4.x-HBase-0.98 #839
Posted by Apache Jenkins Server <je...@builds.apache.org>.
See <https://builds.apache.org/job/Phoenix-4.x-HBase-0.98/839/changes>
Build failed in Jenkins: Phoenix | 4.x-HBase-0.98 #838
Posted by Apache Jenkins Server <je...@builds.apache.org>.
See <https://builds.apache.org/job/Phoenix-4.x-HBase-0.98/838/changes>
Changes:
[ndimiduk] PHOENIX-2186 Creating backend services for the Phoenix Tracing Web App (Nishani)
[ndimiduk] PHOENIX-2187 Creating the front-end application for Phoenix Tracing Web App (Nishani)
[mujtaba] PHOENIX-2247 Fix rat violations in Pherf
[mujtaba] PHOENIX-2240 Duplicate keys generated by performance.py
------------------------------------------
[...truncated 112632 lines...]
Running org.apache.phoenix.end2end.index.DropViewIT
Tests run: 3, Failures: 0, Errors: 0, Skipped: 0, Time elapsed: 10.763 sec - in org.apache.phoenix.end2end.UpsertSelectAutoCommitIT
Running org.apache.phoenix.end2end.index.GlobalIndexOptimizationIT
Tests run: 1, Failures: 0, Errors: 0, Skipped: 0, Time elapsed: 7.084 sec - in org.apache.phoenix.end2end.index.DropViewIT
Running org.apache.phoenix.end2end.index.LocalIndexIT
Tests run: 3, Failures: 0, Errors: 0, Skipped: 0, Time elapsed: 16.623 sec - in org.apache.phoenix.end2end.index.SaltedIndexIT
Running org.apache.phoenix.end2end.index.IndexExpressionIT
Tests run: 6, Failures: 0, Errors: 0, Skipped: 0, Time elapsed: 35.328 sec - in org.apache.phoenix.end2end.index.GlobalIndexOptimizationIT
Running org.apache.phoenix.end2end.index.ViewIndexIT
Tests run: 1, Failures: 0, Errors: 0, Skipped: 0, Time elapsed: 4.068 sec - in org.apache.phoenix.end2end.index.ViewIndexIT
Running org.apache.phoenix.end2end.index.LocalMutableIndexIT
Tests run: 28, Failures: 0, Errors: 0, Skipped: 0, Time elapsed: 121.775 sec - in org.apache.phoenix.end2end.InListIT
Running org.apache.phoenix.end2end.index.ImmutableIndexIT
Tests run: 13, Failures: 0, Errors: 0, Skipped: 0, Time elapsed: 31.588 sec - in org.apache.phoenix.end2end.index.ImmutableIndexIT
Running org.apache.phoenix.end2end.index.IndexMetadataIT
Tests run: 15, Failures: 0, Errors: 0, Skipped: 0, Time elapsed: 53.596 sec - in org.apache.phoenix.end2end.index.LocalMutableIndexIT
Running org.apache.phoenix.end2end.index.GlobalMutableIndexIT
Tests run: 6, Failures: 0, Errors: 0, Skipped: 0, Time elapsed: 36.537 sec - in org.apache.phoenix.end2end.index.IndexMetadataIT
Running org.apache.phoenix.end2end.CSVCommonsLoaderIT
Tests run: 20, Failures: 0, Errors: 0, Skipped: 0, Time elapsed: 124.548 sec - in org.apache.phoenix.end2end.index.LocalIndexIT
Running org.apache.phoenix.end2end.OctetLengthFunctionEnd2EndIT
Tests run: 1, Failures: 0, Errors: 0, Skipped: 0, Time elapsed: 1.755 sec - in org.apache.phoenix.end2end.OctetLengthFunctionEnd2EndIT
Running org.apache.phoenix.end2end.LpadFunctionIT
Tests run: 15, Failures: 0, Errors: 0, Skipped: 0, Time elapsed: 20.133 sec - in org.apache.phoenix.end2end.CSVCommonsLoaderIT
Running org.apache.phoenix.end2end.MinMaxAggregateFunctionIT
Tests run: 1, Failures: 0, Errors: 0, Skipped: 0, Time elapsed: 2.683 sec - in org.apache.phoenix.end2end.MinMaxAggregateFunctionIT
Running org.apache.phoenix.end2end.TimezoneOffsetFunctionIT
Tests run: 12, Failures: 0, Errors: 0, Skipped: 0, Time elapsed: 11.064 sec - in org.apache.phoenix.end2end.LpadFunctionIT
Running org.apache.phoenix.end2end.RegexpSubstrFunctionIT
Tests run: 7, Failures: 0, Errors: 0, Skipped: 0, Time elapsed: 6.6 sec - in org.apache.phoenix.end2end.TimezoneOffsetFunctionIT
Running org.apache.phoenix.end2end.BinaryRowKeyIT
Tests run: 2, Failures: 0, Errors: 0, Skipped: 0, Time elapsed: 2.54 sec - in org.apache.phoenix.end2end.RegexpSubstrFunctionIT
Running org.apache.phoenix.end2end.SignFunctionEnd2EndIT
Tests run: 15, Failures: 0, Errors: 0, Skipped: 0, Time elapsed: 52.925 sec - in org.apache.phoenix.end2end.index.GlobalMutableIndexIT
Running org.apache.phoenix.end2end.SortMergeJoinIT
Tests run: 3, Failures: 0, Errors: 0, Skipped: 0, Time elapsed: 3.219 sec - in org.apache.phoenix.end2end.BinaryRowKeyIT
Running org.apache.phoenix.end2end.DecodeFunctionIT
Tests run: 2, Failures: 0, Errors: 0, Skipped: 0, Time elapsed: 3.65 sec - in org.apache.phoenix.end2end.SignFunctionEnd2EndIT
Running org.apache.phoenix.end2end.RTrimFunctionIT
Tests run: 2, Failures: 0, Errors: 0, Skipped: 0, Time elapsed: 2.526 sec - in org.apache.phoenix.end2end.RTrimFunctionIT
Tests run: 108, Failures: 0, Errors: 0, Skipped: 0, Time elapsed: 276.101 sec - in org.apache.phoenix.end2end.SpooledSortMergeJoinIT
Running org.apache.phoenix.end2end.DisableLocalIndexIT
Running org.apache.phoenix.end2end.HashJoinIT
Tests run: 6, Failures: 0, Errors: 0, Skipped: 0, Time elapsed: 4.577 sec - in org.apache.phoenix.end2end.DecodeFunctionIT
Running org.apache.phoenix.end2end.HashJoinLocalIndexIT
Tests run: 1, Failures: 0, Errors: 0, Skipped: 0, Time elapsed: 3.822 sec - in org.apache.phoenix.end2end.DisableLocalIndexIT
Running org.apache.phoenix.end2end.ModulusExpressionIT
Tests run: 11, Failures: 0, Errors: 0, Skipped: 0, Time elapsed: 4.55 sec - in org.apache.phoenix.end2end.ModulusExpressionIT
Running org.apache.phoenix.end2end.ArrayToStringFunctionIT
Tests run: 58, Failures: 0, Errors: 0, Skipped: 0, Time elapsed: 157.369 sec - in org.apache.phoenix.end2end.index.IndexExpressionIT
Running org.apache.phoenix.end2end.StoreNullsIT
Tests run: 1, Failures: 0, Errors: 0, Skipped: 0, Time elapsed: 15.195 sec - in org.apache.phoenix.end2end.HashJoinLocalIndexIT
Running org.apache.phoenix.end2end.EvaluationOfORIT
Tests run: 2, Failures: 0, Errors: 0, Skipped: 0, Time elapsed: 2.84 sec - in org.apache.phoenix.end2end.EvaluationOfORIT
Running org.apache.phoenix.end2end.ExecuteStatementsIT
Tests run: 36, Failures: 0, Errors: 0, Skipped: 0, Time elapsed: 11.691 sec - in org.apache.phoenix.end2end.ArrayToStringFunctionIT
Running org.apache.phoenix.end2end.ConvertTimezoneFunctionIT
Tests run: 7, Failures: 0, Errors: 0, Skipped: 0, Time elapsed: 2.698 sec - in org.apache.phoenix.end2end.ConvertTimezoneFunctionIT
Running org.apache.phoenix.end2end.ExpFunctionEnd2EndIT
Tests run: 3, Failures: 0, Errors: 0, Skipped: 0, Time elapsed: 5.731 sec - in org.apache.phoenix.end2end.ExpFunctionEnd2EndIT
Running org.apache.phoenix.end2end.PowerFunctionEnd2EndIT
Tests run: 3, Failures: 0, Errors: 0, Skipped: 0, Time elapsed: 16.971 sec - in org.apache.phoenix.end2end.StoreNullsIT
Running org.apache.phoenix.end2end.StddevIT
Tests run: 1, Failures: 0, Errors: 0, Skipped: 0, Time elapsed: 4.571 sec - in org.apache.phoenix.end2end.PowerFunctionEnd2EndIT
Running org.apache.phoenix.end2end.TenantSpecificViewIndexSaltedIT
Tests run: 2, Failures: 0, Errors: 0, Skipped: 0, Time elapsed: 14.719 sec - in org.apache.phoenix.end2end.ExecuteStatementsIT
Running org.apache.phoenix.end2end.FirstValueFunctionIT
Tests run: 4, Failures: 0, Errors: 0, Skipped: 0, Time elapsed: 4.25 sec - in org.apache.phoenix.end2end.StddevIT
Running org.apache.phoenix.end2end.SkipScanAfterManualSplitIT
Tests run: 7, Failures: 0, Errors: 0, Skipped: 0, Time elapsed: 5.15 sec - in org.apache.phoenix.end2end.FirstValueFunctionIT
Running org.apache.phoenix.end2end.ArrayAppendFunctionIT
Tests run: 4, Failures: 0, Errors: 0, Skipped: 0, Time elapsed: 9.174 sec - in org.apache.phoenix.end2end.TenantSpecificViewIndexSaltedIT
Running org.apache.phoenix.end2end.TenantSpecificViewIndexIT
Tests run: 8, Failures: 0, Errors: 0, Skipped: 0, Time elapsed: 12.569 sec - in org.apache.phoenix.end2end.TenantSpecificViewIndexIT
Running org.apache.phoenix.end2end.GetSetByteBitFunctionEnd2EndIT
Tests run: 1, Failures: 0, Errors: 0, Skipped: 0, Time elapsed: 1.814 sec - in org.apache.phoenix.end2end.GetSetByteBitFunctionEnd2EndIT
Running org.apache.phoenix.end2end.UpgradeIT
Tests run: 3, Failures: 0, Errors: 0, Skipped: 0, Time elapsed: 25.658 sec - in org.apache.phoenix.end2end.SkipScanAfterManualSplitIT
Running org.apache.phoenix.end2end.LnLogFunctionEnd2EndIT
Tests run: 34, Failures: 0, Errors: 0, Skipped: 0, Time elapsed: 23.865 sec - in org.apache.phoenix.end2end.ArrayAppendFunctionIT
Running org.apache.phoenix.end2end.SpooledTmpFileDeleteIT
Tests run: 1, Failures: 0, Errors: 0, Skipped: 0, Time elapsed: 2.707 sec - in org.apache.phoenix.end2end.SpooledTmpFileDeleteIT
Tests run: 1, Failures: 0, Errors: 0, Skipped: 0, Time elapsed: 4.164 sec - in org.apache.phoenix.end2end.LnLogFunctionEnd2EndIT
Running org.apache.phoenix.end2end.SkipScanQueryIT
Running org.apache.phoenix.end2end.ArrayConcatFunctionIT
Tests run: 9, Failures: 0, Errors: 0, Skipped: 0, Time elapsed: 16.013 sec - in org.apache.phoenix.end2end.SkipScanQueryIT
Running org.apache.phoenix.end2end.DateTimeIT
Tests run: 6, Failures: 0, Errors: 0, Skipped: 0, Time elapsed: 32.018 sec - in org.apache.phoenix.end2end.UpgradeIT
Running org.apache.phoenix.end2end.ArrayFillFunctionIT
Tests run: 30, Failures: 0, Errors: 0, Skipped: 0, Time elapsed: 22.378 sec - in org.apache.phoenix.end2end.ArrayConcatFunctionIT
Running org.apache.phoenix.end2end.QueryExecWithoutSCNIT
Tests run: 1, Failures: 0, Errors: 0, Skipped: 0, Time elapsed: 3.311 sec - in org.apache.phoenix.end2end.QueryExecWithoutSCNIT
Running org.apache.phoenix.end2end.SubqueryIT
Tests run: 108, Failures: 0, Errors: 0, Skipped: 0, Time elapsed: 107.597 sec - in org.apache.phoenix.end2end.SortMergeJoinIT
Tests run: 26, Failures: 0, Errors: 0, Skipped: 0, Time elapsed: 11.237 sec - in org.apache.phoenix.end2end.ArrayFillFunctionIT
Running org.apache.phoenix.trace.PhoenixTraceReaderIT
Tests run: 2, Failures: 0, Errors: 0, Skipped: 0, Time elapsed: 0.646 sec - in org.apache.phoenix.trace.PhoenixTraceReaderIT
Running org.apache.phoenix.trace.PhoenixTableMetricsWriterIT
Running org.apache.phoenix.trace.PhoenixTracingEndToEndIT
Tests run: 2, Failures: 0, Errors: 0, Skipped: 0, Time elapsed: 0.424 sec - in org.apache.phoenix.trace.PhoenixTableMetricsWriterIT
Tests run: 19, Failures: 0, Errors: 0, Skipped: 0, Time elapsed: 18.69 sec - in org.apache.phoenix.end2end.DateTimeIT
Tests run: 21, Failures: 0, Errors: 0, Skipped: 0, Time elapsed: 81.293 sec - in org.apache.phoenix.end2end.SubqueryIT
Tests run: 6, Failures: 0, Errors: 0, Skipped: 0, Time elapsed: 83.729 sec - in org.apache.phoenix.trace.PhoenixTracingEndToEndIT
Tests run: 108, Failures: 0, Errors: 0, Skipped: 0, Time elapsed: 286.64 sec - in org.apache.phoenix.end2end.HashJoinIT
Results :
Failed tests:
SortOrderIT.descVarLengthAscPKLTE:401->runQueryTest:552->runQuery:603 Unexpected result for query SELECT k1 FROM DescColumnSortOrderTest WHERE 'bb' <= k2: arrays first differed at element [0]; expected:<1> but was:<4>
SortOrderIT.descVarLengthDescPKGT:383->runQueryTest:552->runQuery:603 Unexpected result for query SELECT k1 FROM DescColumnSortOrderTest WHERE k2 > 'b': arrays first differed at element [0]; expected:<3> but was:<5>
SortOrderIT.descVarLengthDescPKLTE:392->runQueryTest:552->runQuery:603 Unexpected result for query SELECT k1 FROM DescColumnSortOrderTest WHERE k2 <= 'bb': arrays first differed at element [0]; expected:<2> but was:<3>
SortOrderIT.testNonPKCompare:440->testCompareCompositeKey:483 t_null_DECIMAL_DESC expected:<2> but was:<3>
SortOrderIT.testSkipScanCompare:456->testCompareCompositeKey:482 t_null_DECIMAL_DESC
Tests run: 1163, Failures: 5, Errors: 0, Skipped: 0
[INFO]
[INFO] --- maven-failsafe-plugin:2.18:integration-test (NeedTheirOwnClusterTests) @ phoenix-core ---
[INFO] Failsafe report directory: <https://builds.apache.org/job/Phoenix-4.x-HBase-0.98/ws/phoenix-core/target/failsafe-reports>
[INFO] parallel='none', perCoreThreadCount=true, threadCount=0, useUnlimitedThreads=false, threadCountSuites=0, threadCountClasses=0, threadCountMethods=0, parallelOptimized=true
-------------------------------------------------------
T E S T S
-------------------------------------------------------
Running org.apache.phoenix.rpc.PhoenixServerRpcIT
Running org.apache.phoenix.rpc.PhoenixClientRpcIT
Running org.apache.phoenix.monitoring.PhoenixMetricsIT
Running org.apache.phoenix.iterate.RoundRobinResultIteratorWithStatsIT
Running org.apache.phoenix.mapreduce.CsvBulkLoadToolIT
Tests run: 2, Failures: 0, Errors: 0, Skipped: 0, Time elapsed: 6.719 sec - in org.apache.phoenix.rpc.PhoenixClientRpcIT
Tests run: 1, Failures: 0, Errors: 0, Skipped: 0, Time elapsed: 15.361 sec - in org.apache.phoenix.iterate.RoundRobinResultIteratorWithStatsIT
Tests run: 2, Failures: 0, Errors: 0, Skipped: 0, Time elapsed: 16.94 sec - in org.apache.phoenix.rpc.PhoenixServerRpcIT
Running org.apache.phoenix.mapreduce.IndexToolIT
Running org.apache.phoenix.end2end.ViewIT
Running org.apache.phoenix.end2end.MultiCfQueryExecIT
Tests run: 17, Failures: 0, Errors: 0, Skipped: 0, Time elapsed: 39.947 sec - in org.apache.phoenix.monitoring.PhoenixMetricsIT
Tests run: 7, Failures: 0, Errors: 0, Skipped: 0, Time elapsed: 19.022 sec - in org.apache.phoenix.end2end.MultiCfQueryExecIT
Running org.apache.phoenix.end2end.SaltedViewIT
Running org.apache.phoenix.end2end.StatsCollectorIT
Tests run: 2, Failures: 0, Errors: 0, Skipped: 0, Time elapsed: 10.243 sec - in org.apache.phoenix.end2end.SaltedViewIT
Running org.apache.phoenix.end2end.ParallelIteratorsIT
Tests run: 2, Failures: 0, Errors: 0, Skipped: 0, Time elapsed: 11.409 sec - in org.apache.phoenix.end2end.ParallelIteratorsIT
Tests run: 22, Failures: 0, Errors: 0, Skipped: 0, Time elapsed: 61.124 sec - in org.apache.phoenix.end2end.ViewIT
Running org.apache.phoenix.end2end.QueryWithLimitIT
Running org.apache.phoenix.end2end.QueryTimeoutIT
Tests run: 4, Failures: 0, Errors: 0, Skipped: 0, Time elapsed: 50.934 sec - in org.apache.phoenix.end2end.StatsCollectorIT
Tests run: 2, Failures: 0, Errors: 0, Skipped: 0, Time elapsed: 12.17 sec - in org.apache.phoenix.end2end.QueryWithLimitIT
Tests run: 1, Failures: 0, Errors: 0, Skipped: 0, Time elapsed: 18.555 sec - in org.apache.phoenix.end2end.QueryTimeoutIT
Running org.apache.phoenix.end2end.index.MutableIndexFailureIT
Running org.apache.phoenix.end2end.index.ImmutableIndexWithStatsIT
Running org.apache.phoenix.end2end.ContextClassloaderIT
Tests run: 1, Failures: 0, Errors: 0, Skipped: 0, Time elapsed: 11.243 sec - in org.apache.phoenix.end2end.index.ImmutableIndexWithStatsIT
Tests run: 3, Failures: 0, Errors: 0, Skipped: 0, Time elapsed: 7.076 sec - in org.apache.phoenix.end2end.ContextClassloaderIT
Running org.apache.phoenix.end2end.UserDefinedFunctionsIT
Running org.apache.phoenix.end2end.index.MutableIndexReplicationIT
Tests run: 13, Failures: 0, Errors: 0, Skipped: 0, Time elapsed: 12.962 sec - in org.apache.phoenix.end2end.UserDefinedFunctionsIT
Tests run: 1, Failures: 0, Errors: 0, Skipped: 0, Time elapsed: 16.604 sec - in org.apache.phoenix.end2end.index.MutableIndexReplicationIT
Running org.apache.phoenix.end2end.AlterTableIT
Running org.apache.phoenix.end2end.UnionAllIT
Tests run: 11, Failures: 0, Errors: 0, Skipped: 0, Time elapsed: 21.021 sec - in org.apache.phoenix.end2end.UnionAllIT
Running org.apache.phoenix.end2end.TenantSpecificTablesDDLIT
Tests run: 17, Failures: 0, Errors: 0, Skipped: 0, Time elapsed: 41.667 sec - in org.apache.phoenix.end2end.TenantSpecificTablesDDLIT
Tests run: 3, Failures: 0, Errors: 0, Skipped: 0, Time elapsed: 146.76 sec - in org.apache.phoenix.end2end.index.MutableIndexFailureIT
Running org.apache.phoenix.end2end.KeyOnlyIT
Tests run: 6, Failures: 0, Errors: 0, Skipped: 0, Time elapsed: 281.02 sec - in org.apache.phoenix.mapreduce.CsvBulkLoadToolIT
Running org.apache.phoenix.end2end.CountDistinctCompressionIT
Tests run: 3, Failures: 0, Errors: 0, Skipped: 0, Time elapsed: 11.754 sec - in org.apache.phoenix.end2end.KeyOnlyIT
Tests run: 1, Failures: 0, Errors: 0, Skipped: 0, Time elapsed: 9.079 sec - in org.apache.phoenix.end2end.CountDistinctCompressionIT
Running org.apache.phoenix.end2end.SpillableGroupByIT
Running org.apache.phoenix.end2end.TenantSpecificTablesDMLIT
Tests run: 1, Failures: 0, Errors: 0, Skipped: 0, Time elapsed: 6.834 sec - in org.apache.phoenix.end2end.SpillableGroupByIT
Running org.apache.phoenix.hbase.index.FailForUnsupportedHBaseVersionsIT
Running org.apache.phoenix.end2end.StatsCollectorWithSplitsAndMultiCFIT
Tests run: 9, Failures: 0, Errors: 0, Skipped: 0, Time elapsed: 302.526 sec - in org.apache.phoenix.mapreduce.IndexToolIT
Tests run: 2, Failures: 0, Errors: 0, Skipped: 0, Time elapsed: 15.636 sec - in org.apache.phoenix.hbase.index.FailForUnsupportedHBaseVersionsIT
Running org.apache.phoenix.hbase.index.covered.EndToEndCoveredColumnsIndexBuilderIT
Running org.apache.phoenix.hbase.index.covered.example.FailWithoutRetriesIT
Tests run: 2, Failures: 0, Errors: 0, Skipped: 0, Time elapsed: 8.611 sec - in org.apache.phoenix.hbase.index.covered.EndToEndCoveredColumnsIndexBuilderIT
Tests run: 2, Failures: 0, Errors: 0, Skipped: 0, Time elapsed: 29.356 sec - in org.apache.phoenix.end2end.StatsCollectorWithSplitsAndMultiCFIT
Tests run: 1, Failures: 0, Errors: 0, Skipped: 0, Time elapsed: 8.706 sec - in org.apache.phoenix.hbase.index.covered.example.FailWithoutRetriesIT
Running org.apache.phoenix.hbase.index.covered.example.EndtoEndIndexingWithCompressionIT
Running org.apache.phoenix.hbase.index.covered.example.EndToEndCoveredIndexingIT
Tests run: 16, Failures: 0, Errors: 0, Skipped: 0, Time elapsed: 41.493 sec - in org.apache.phoenix.end2end.TenantSpecificTablesDMLIT
Running org.apache.phoenix.hbase.index.balancer.IndexLoadBalancerIT
Running org.apache.phoenix.execute.PartialCommitIT
Tests run: 6, Failures: 0, Errors: 0, Skipped: 0, Time elapsed: 7.471 sec - in org.apache.phoenix.execute.PartialCommitIT
Running org.apache.hadoop.hbase.regionserver.wal.WALReplayWithIndexWritesAndUncompressedWALInHBase_094_9_IT
Tests run: 1, Failures: 0, Errors: 0, Skipped: 0, Time elapsed: 14.89 sec - in org.apache.hadoop.hbase.regionserver.wal.WALReplayWithIndexWritesAndUncompressedWALInHBase_094_9_IT
Running org.apache.hadoop.hbase.regionserver.wal.WALReplayWithIndexWritesAndCompressedWALIT
Tests run: 11, Failures: 0, Errors: 0, Skipped: 0, Time elapsed: 48.918 sec - in org.apache.phoenix.hbase.index.covered.example.EndtoEndIndexingWithCompressionIT
Tests run: 11, Failures: 0, Errors: 0, Skipped: 0, Time elapsed: 48.275 sec - in org.apache.phoenix.hbase.index.covered.example.EndToEndCoveredIndexingIT
Tests run: 1, Failures: 0, Errors: 0, Skipped: 0, Time elapsed: 14.761 sec - in org.apache.hadoop.hbase.regionserver.wal.WALReplayWithIndexWritesAndCompressedWALIT
Tests run: 9, Failures: 0, Errors: 0, Skipped: 0, Time elapsed: 111.329 sec - in org.apache.phoenix.hbase.index.balancer.IndexLoadBalancerIT
Tests run: 51, Failures: 0, Errors: 0, Skipped: 0, Time elapsed: 298.302 sec - in org.apache.phoenix.end2end.AlterTableIT
Results :
Tests run: 244, Failures: 0, Errors: 0, Skipped: 0
[INFO]
[INFO] --- maven-failsafe-plugin:2.18:verify (ClientManagedTimeTests) @ phoenix-core ---
[INFO] Failsafe report directory: <https://builds.apache.org/job/Phoenix-4.x-HBase-0.98/ws/phoenix-core/target/failsafe-reports>
[INFO] ------------------------------------------------------------------------
[INFO] Reactor Summary:
[INFO]
[INFO] Apache Phoenix .................................... SUCCESS [5.654s]
[INFO] Phoenix Core ...................................... FAILURE [26:47.715s]
[INFO] Phoenix - Flume ................................... SKIPPED
[INFO] Phoenix - Pig ..................................... SKIPPED
[INFO] Phoenix Query Server Client ....................... SKIPPED
[INFO] Phoenix Query Server .............................. SKIPPED
[INFO] Phoenix - Pherf ................................... SKIPPED
[INFO] Phoenix - Spark ................................... SKIPPED
[INFO] Phoenix Assembly .................................. SKIPPED
[INFO] Phoenix - Tracing Web Application ................. SKIPPED
[INFO] ------------------------------------------------------------------------
[INFO] BUILD FAILURE
[INFO] ------------------------------------------------------------------------
[INFO] Total time: 26:54.012s
[INFO] Finished at: Thu Sep 10 20:55:21 UTC 2015
[INFO] Final Memory: 54M/909M
[INFO] ------------------------------------------------------------------------
[ERROR] Failed to execute goal org.apache.maven.plugins:maven-failsafe-plugin:2.18:verify (ClientManagedTimeTests) on project phoenix-core: There are test failures.
[ERROR]
[ERROR] Please refer to <https://builds.apache.org/job/Phoenix-4.x-HBase-0.98/ws/phoenix-core/target/failsafe-reports> for the individual test results.
[ERROR] -> [Help 1]
[ERROR]
[ERROR] To see the full stack trace of the errors, re-run Maven with the -e switch.
[ERROR] Re-run Maven using the -X switch to enable full debug logging.
[ERROR]
[ERROR] For more information about the errors and possible solutions, please read the following articles:
[ERROR] [Help 1] http://cwiki.apache.org/confluence/display/MAVEN/MojoFailureException
[ERROR]
[ERROR] After correcting the problems, you can resume the build with the command
[ERROR] mvn <goals> -rf :phoenix-core
Build step 'Invoke top-level Maven targets' marked build as failure
Archiving artifacts
Sending artifact delta relative to Phoenix | 4.x-HBase-0.98 #835
Archived 1375 artifacts
Archive block size is 32768
Received 21845 blocks and 511594604 bytes
Compression is 58.3%
Took 2 min 59 sec
Recording test results