You are viewing a plain text version of this content. The canonical link for it is here.
Posted to yarn-dev@hadoop.apache.org by Apache Jenkins Server <je...@builds.apache.org> on 2015/03/26 07:13:30 UTC
Failed: YARN-3395 PreCommit Build #7114
Jira: https://issues.apache.org/jira/browse/YARN-3395
Build: https://builds.apache.org/job/PreCommit-YARN-Build/7114/
###################################################################################
########################## LAST 60 LINES OF THE CONSOLE ###########################
[...truncated 3618 lines...]
{color:green}+1 @author{color}. The patch does not contain any @author tags.
{color:green}+1 tests included{color}. The patch appears to include 1 new or modified test files.
{color:green}+1 javac{color}. The applied patch does not increase the total number of javac compiler warnings.
{color:green}+1 javadoc{color}. There were no new javadoc warning messages.
{color:green}+1 eclipse:eclipse{color}. The patch built with eclipse:eclipse.
{color:green}+1 findbugs{color}. The patch does not introduce any new Findbugs (version 2.0.3) warnings.
{color:green}+1 release audit{color}. The applied patch does not increase the total number of release audit warnings.
{color:red}-1 core tests{color}. The patch failed these unit tests in hadoop-yarn-project/hadoop-yarn/hadoop-yarn-server/hadoop-yarn-server-resourcemanager:
org.apache.hadoop.yarn.server.resourcemanager.TestRMHA
org.apache.hadoop.yarn.server.resourcemanager.TestRMAdminService
org.apache.hadoop.yarn.server.resourcemanager.webapp.TestRMWebappAuthentication
org.apache.hadoop.yarn.server.resourcemanager.TestMoveApplication
org.apache.hadoop.yarn.server.resourcemanager.recovery.TestZKRMStateStore
Test results: https://builds.apache.org/job/PreCommit-YARN-Build/7114//testReport/
Console output: https://builds.apache.org/job/PreCommit-YARN-Build/7114//console
This message is automatically generated.
======================================================================
======================================================================
Adding comment to Jira.
======================================================================
======================================================================
Comment added.
c66780884dc7fce56502e1f0b299aac0e5354354 logged out
======================================================================
======================================================================
Finished build.
======================================================================
======================================================================
Build step 'Execute shell' marked build as failure
Archiving artifacts
Sending artifact delta relative to PreCommit-YARN-Build #7113
Archived 15 artifacts
Archive block size is 32768
Received 69 blocks and 6821771 bytes
Compression is 24.9%
Took 2.8 sec
[description-setter] Could not determine description.
Recording test results
Email was triggered for: Failure
Sending email for trigger: Failure
###################################################################################
############################## FAILED TESTS (if any) ##############################
16 tests failed.
FAILED: org.apache.hadoop.yarn.server.resourcemanager.TestMoveApplication.testMoveTooLate
Error Message:
Error starting http server
Stack Trace:
org.apache.hadoop.yarn.webapp.WebAppException: Error starting http server
at org.apache.hadoop.http.HttpServer2.start(HttpServer2.java:785)
at org.apache.hadoop.yarn.webapp.WebApps$Builder.start(WebApps.java:274)
at org.apache.hadoop.yarn.server.resourcemanager.ResourceManager.startWepApp(ResourceManager.java:974)
at org.apache.hadoop.yarn.server.resourcemanager.ResourceManager.serviceStart(ResourceManager.java:1074)
at org.apache.hadoop.service.AbstractService.start(AbstractService.java:193)
at org.apache.hadoop.yarn.server.resourcemanager.TestMoveApplication.setUp(TestMoveApplication.java:59)
FAILED: org.apache.hadoop.yarn.server.resourcemanager.TestMoveApplication.testMoveRejectedByPermissions
Error Message:
Error starting http server
Stack Trace:
org.apache.hadoop.yarn.webapp.WebAppException: Error starting http server
at sun.nio.ch.Net.bind0(Native Method)
at sun.nio.ch.Net.bind(Net.java:444)
at sun.nio.ch.Net.bind(Net.java:436)
at sun.nio.ch.ServerSocketChannelImpl.bind(ServerSocketChannelImpl.java:214)
at sun.nio.ch.ServerSocketAdaptor.bind(ServerSocketAdaptor.java:74)
at org.mortbay.jetty.nio.SelectChannelConnector.open(SelectChannelConnector.java:216)
at org.apache.hadoop.http.HttpServer2.openListeners(HttpServer2.java:830)
at org.apache.hadoop.http.HttpServer2.start(HttpServer2.java:772)
at org.apache.hadoop.yarn.webapp.WebApps$Builder.start(WebApps.java:274)
at org.apache.hadoop.yarn.server.resourcemanager.ResourceManager.startWepApp(ResourceManager.java:974)
at org.apache.hadoop.yarn.server.resourcemanager.ResourceManager.serviceStart(ResourceManager.java:1074)
at org.apache.hadoop.service.AbstractService.start(AbstractService.java:193)
at org.apache.hadoop.yarn.server.resourcemanager.TestMoveApplication.setUp(TestMoveApplication.java:59)
FAILED: org.apache.hadoop.yarn.server.resourcemanager.TestMoveApplication.testMoveSuccessful
Error Message:
Error starting http server
Stack Trace:
org.apache.hadoop.yarn.webapp.WebAppException: Error starting http server
at sun.nio.ch.Net.bind0(Native Method)
at sun.nio.ch.Net.bind(Net.java:444)
at sun.nio.ch.Net.bind(Net.java:436)
at sun.nio.ch.ServerSocketChannelImpl.bind(ServerSocketChannelImpl.java:214)
at sun.nio.ch.ServerSocketAdaptor.bind(ServerSocketAdaptor.java:74)
at org.mortbay.jetty.nio.SelectChannelConnector.open(SelectChannelConnector.java:216)
at org.apache.hadoop.http.HttpServer2.openListeners(HttpServer2.java:830)
at org.apache.hadoop.http.HttpServer2.start(HttpServer2.java:772)
at org.apache.hadoop.yarn.webapp.WebApps$Builder.start(WebApps.java:274)
at org.apache.hadoop.yarn.server.resourcemanager.ResourceManager.startWepApp(ResourceManager.java:974)
at org.apache.hadoop.yarn.server.resourcemanager.ResourceManager.serviceStart(ResourceManager.java:1074)
at org.apache.hadoop.service.AbstractService.start(AbstractService.java:193)
at org.apache.hadoop.yarn.server.resourcemanager.TestMoveApplication.setUp(TestMoveApplication.java:59)
FAILED: org.apache.hadoop.yarn.server.resourcemanager.TestMoveApplication.testMoveRejectedByScheduler
Error Message:
Error starting http server
Stack Trace:
org.apache.hadoop.yarn.webapp.WebAppException: Error starting http server
at sun.nio.ch.Net.bind0(Native Method)
at sun.nio.ch.Net.bind(Net.java:444)
at sun.nio.ch.Net.bind(Net.java:436)
at sun.nio.ch.ServerSocketChannelImpl.bind(ServerSocketChannelImpl.java:214)
at sun.nio.ch.ServerSocketAdaptor.bind(ServerSocketAdaptor.java:74)
at org.mortbay.jetty.nio.SelectChannelConnector.open(SelectChannelConnector.java:216)
at org.apache.hadoop.http.HttpServer2.openListeners(HttpServer2.java:830)
at org.apache.hadoop.http.HttpServer2.start(HttpServer2.java:772)
at org.apache.hadoop.yarn.webapp.WebApps$Builder.start(WebApps.java:274)
at org.apache.hadoop.yarn.server.resourcemanager.ResourceManager.startWepApp(ResourceManager.java:974)
at org.apache.hadoop.yarn.server.resourcemanager.ResourceManager.serviceStart(ResourceManager.java:1074)
at org.apache.hadoop.service.AbstractService.start(AbstractService.java:193)
at org.apache.hadoop.yarn.server.resourcemanager.TestMoveApplication.setUp(TestMoveApplication.java:59)
FAILED: org.apache.hadoop.yarn.server.resourcemanager.TestRMAdminService.testServiceAclsRefreshWithLocalConfigurationProvider
Error Message:
Using localConfigurationProvider. Should not get any exception.
Stack Trace:
java.lang.AssertionError: Using localConfigurationProvider. Should not get any exception.
at org.junit.Assert.fail(Assert.java:88)
at org.apache.hadoop.yarn.server.resourcemanager.TestRMAdminService.testServiceAclsRefreshWithLocalConfigurationProvider(TestRMAdminService.java:219)
FAILED: org.apache.hadoop.yarn.server.resourcemanager.TestRMAdminService.testServiceAclsRefreshWithFileSystemBasedConfigurationProvider
Error Message:
Should not get any exceptions
Stack Trace:
java.lang.AssertionError: Should not get any exceptions
at org.junit.Assert.fail(Assert.java:88)
at org.apache.hadoop.yarn.server.resourcemanager.TestRMAdminService.testServiceAclsRefreshWithFileSystemBasedConfigurationProvider(TestRMAdminService.java:248)
FAILED: org.apache.hadoop.yarn.server.resourcemanager.TestRMAdminService.testRMInitialsWithFileSystemBasedConfigurationProvider
Error Message:
Should not get any exceptions
Stack Trace:
java.lang.AssertionError: Should not get any exceptions
at org.junit.Assert.fail(Assert.java:88)
at org.apache.hadoop.yarn.server.resourcemanager.TestRMAdminService.testRMInitialsWithFileSystemBasedConfigurationProvider(TestRMAdminService.java:674)
FAILED: org.apache.hadoop.yarn.server.resourcemanager.TestRMHA.testRMDispatcherForHA
Error Message:
Error starting http server
Stack Trace:
org.apache.hadoop.yarn.webapp.WebAppException: Error starting http server
at org.apache.hadoop.http.HttpServer2.start(HttpServer2.java:785)
at org.apache.hadoop.yarn.webapp.WebApps$Builder.start(WebApps.java:274)
at org.apache.hadoop.yarn.server.resourcemanager.ResourceManager.startWepApp(ResourceManager.java:974)
at org.apache.hadoop.yarn.server.resourcemanager.MockRM.startWepApp(MockRM.java:635)
at org.apache.hadoop.yarn.server.resourcemanager.ResourceManager.serviceStart(ResourceManager.java:1074)
at org.apache.hadoop.service.AbstractService.start(AbstractService.java:193)
at org.apache.hadoop.yarn.server.resourcemanager.TestRMHA.testRMDispatcherForHA(TestRMHA.java:330)
FAILED: org.apache.hadoop.yarn.server.resourcemanager.TestRMHA.testFailoverClearsRMContext
Error Message:
Error starting http server
Stack Trace:
org.apache.hadoop.yarn.webapp.WebAppException: Error starting http server
at org.apache.hadoop.http.HttpServer2.start(HttpServer2.java:785)
at org.apache.hadoop.yarn.webapp.WebApps$Builder.start(WebApps.java:274)
at org.apache.hadoop.yarn.server.resourcemanager.ResourceManager.startWepApp(ResourceManager.java:974)
at org.apache.hadoop.yarn.server.resourcemanager.MockRM.startWepApp(MockRM.java:635)
at org.apache.hadoop.yarn.server.resourcemanager.ResourceManager.serviceStart(ResourceManager.java:1074)
at org.apache.hadoop.service.AbstractService.start(AbstractService.java:193)
at org.apache.hadoop.yarn.server.resourcemanager.TestRMHA.testFailoverClearsRMContext(TestRMHA.java:530)
FAILED: org.apache.hadoop.yarn.server.resourcemanager.TestRMHA.testTransitionedToStandbyShouldNotHang
Error Message:
Error starting http server
Stack Trace:
org.apache.hadoop.yarn.webapp.WebAppException: Error starting http server
at org.apache.hadoop.http.HttpServer2.start(HttpServer2.java:785)
at org.apache.hadoop.yarn.webapp.WebApps$Builder.start(WebApps.java:274)
at org.apache.hadoop.yarn.server.resourcemanager.ResourceManager.startWepApp(ResourceManager.java:974)
at org.apache.hadoop.yarn.server.resourcemanager.MockRM.startWepApp(MockRM.java:635)
at org.apache.hadoop.yarn.server.resourcemanager.ResourceManager.serviceStart(ResourceManager.java:1074)
at org.apache.hadoop.service.AbstractService.start(AbstractService.java:193)
at org.apache.hadoop.yarn.server.resourcemanager.TestRMHA.testTransitionedToStandbyShouldNotHang(TestRMHA.java:487)
FAILED: org.apache.hadoop.yarn.server.resourcemanager.TestRMHA.testTransitionsWhenAutomaticFailoverEnabled
Error Message:
Error starting http server
Stack Trace:
org.apache.hadoop.yarn.webapp.WebAppException: Error starting http server
at org.apache.hadoop.http.HttpServer2.start(HttpServer2.java:785)
at org.apache.hadoop.yarn.webapp.WebApps$Builder.start(WebApps.java:274)
at org.apache.hadoop.yarn.server.resourcemanager.ResourceManager.startWepApp(ResourceManager.java:974)
at org.apache.hadoop.yarn.server.resourcemanager.MockRM.startWepApp(MockRM.java:635)
at org.apache.hadoop.yarn.server.resourcemanager.ResourceManager.serviceStart(ResourceManager.java:1074)
at org.apache.hadoop.service.AbstractService.start(AbstractService.java:193)
at org.apache.hadoop.yarn.server.resourcemanager.TestRMHA.testTransitionsWhenAutomaticFailoverEnabled(TestRMHA.java:254)
FAILED: org.apache.hadoop.yarn.server.resourcemanager.TestRMHA.testFailoverWhenTransitionToActiveThrowException
Error Message:
Error starting http server
Stack Trace:
org.apache.hadoop.yarn.webapp.WebAppException: Error starting http server
at org.apache.hadoop.http.HttpServer2.start(HttpServer2.java:785)
at org.apache.hadoop.yarn.webapp.WebApps$Builder.start(WebApps.java:274)
at org.apache.hadoop.yarn.server.resourcemanager.ResourceManager.startWepApp(ResourceManager.java:974)
at org.apache.hadoop.yarn.server.resourcemanager.MockRM.startWepApp(MockRM.java:635)
at org.apache.hadoop.yarn.server.resourcemanager.ResourceManager.serviceStart(ResourceManager.java:1074)
at org.apache.hadoop.service.AbstractService.start(AbstractService.java:193)
at org.apache.hadoop.yarn.server.resourcemanager.TestRMHA.testFailoverWhenTransitionToActiveThrowException(TestRMHA.java:437)
FAILED: org.apache.hadoop.yarn.server.resourcemanager.TestRMHA.testFailoverAndTransitions
Error Message:
Error starting http server
Stack Trace:
org.apache.hadoop.yarn.webapp.WebAppException: Error starting http server
at org.apache.hadoop.http.HttpServer2.start(HttpServer2.java:785)
at org.apache.hadoop.yarn.webapp.WebApps$Builder.start(WebApps.java:274)
at org.apache.hadoop.yarn.server.resourcemanager.ResourceManager.startWepApp(ResourceManager.java:974)
at org.apache.hadoop.yarn.server.resourcemanager.MockRM.startWepApp(MockRM.java:635)
at org.apache.hadoop.yarn.server.resourcemanager.ResourceManager.serviceStart(ResourceManager.java:1074)
at org.apache.hadoop.service.AbstractService.start(AbstractService.java:193)
at org.apache.hadoop.yarn.server.resourcemanager.TestRMHA.testFailoverAndTransitions(TestRMHA.java:198)
FAILED: org.apache.hadoop.yarn.server.resourcemanager.recovery.TestZKRMStateStore.testFencing
Error Message:
Error starting http server
Stack Trace:
org.apache.hadoop.yarn.webapp.WebAppException: Error starting http server
at org.apache.hadoop.http.HttpServer2.start(HttpServer2.java:785)
at org.apache.hadoop.yarn.webapp.WebApps$Builder.start(WebApps.java:274)
at org.apache.hadoop.yarn.server.resourcemanager.ResourceManager.startWepApp(ResourceManager.java:974)
at org.apache.hadoop.yarn.server.resourcemanager.ResourceManager.serviceStart(ResourceManager.java:1074)
at org.apache.hadoop.service.AbstractService.start(AbstractService.java:193)
at org.apache.hadoop.yarn.server.resourcemanager.recovery.TestZKRMStateStore.testFencing(TestZKRMStateStore.java:229)
FAILED: org.apache.hadoop.yarn.server.resourcemanager.webapp.TestRMWebappAuthentication.testSimpleAuth[0]
Error Message:
Error starting http server
Stack Trace:
org.apache.hadoop.yarn.webapp.WebAppException: Error starting http server
at org.apache.hadoop.http.HttpServer2.start(HttpServer2.java:785)
at org.apache.hadoop.yarn.webapp.WebApps$Builder.start(WebApps.java:274)
at org.apache.hadoop.yarn.server.resourcemanager.ResourceManager.startWepApp(ResourceManager.java:974)
at org.apache.hadoop.yarn.server.resourcemanager.MockRM.startWepApp(MockRM.java:635)
at org.apache.hadoop.yarn.server.resourcemanager.ResourceManager.serviceStart(ResourceManager.java:1074)
at org.apache.hadoop.service.AbstractService.start(AbstractService.java:193)
at org.apache.hadoop.yarn.server.resourcemanager.webapp.TestRMWebappAuthentication.testSimpleAuth(TestRMWebappAuthentication.java:147)
FAILED: org.apache.hadoop.yarn.server.resourcemanager.webapp.TestRMWebappAuthentication.testSimpleAuth[1]
Error Message:
Error starting http server
Stack Trace:
org.apache.hadoop.yarn.webapp.WebAppException: Error starting http server
at sun.nio.ch.Net.bind0(Native Method)
at sun.nio.ch.Net.bind(Net.java:444)
at sun.nio.ch.Net.bind(Net.java:436)
at sun.nio.ch.ServerSocketChannelImpl.bind(ServerSocketChannelImpl.java:214)
at sun.nio.ch.ServerSocketAdaptor.bind(ServerSocketAdaptor.java:74)
at org.mortbay.jetty.nio.SelectChannelConnector.open(SelectChannelConnector.java:216)
at org.apache.hadoop.http.HttpServer2.openListeners(HttpServer2.java:830)
at org.apache.hadoop.http.HttpServer2.start(HttpServer2.java:772)
at org.apache.hadoop.yarn.webapp.WebApps$Builder.start(WebApps.java:274)
at org.apache.hadoop.yarn.server.resourcemanager.ResourceManager.startWepApp(ResourceManager.java:974)
at org.apache.hadoop.yarn.server.resourcemanager.MockRM.startWepApp(MockRM.java:635)
at org.apache.hadoop.yarn.server.resourcemanager.ResourceManager.serviceStart(ResourceManager.java:1074)
at org.apache.hadoop.service.AbstractService.start(AbstractService.java:193)
at org.apache.hadoop.yarn.server.resourcemanager.webapp.TestRMWebappAuthentication.testSimpleAuth(TestRMWebappAuthentication.java:147)
Success: YARN-3304 PreCommit Build #7115
Posted by Apache Jenkins Server <je...@builds.apache.org>.
Jira: https://issues.apache.org/jira/browse/YARN-3304
Build: https://builds.apache.org/job/PreCommit-YARN-Build/7115/
###################################################################################
########################## LAST 60 LINES OF THE CONSOLE ###########################
[...truncated 3654 lines...]
{color:green}+1 overall{color}. Here are the results of testing the latest attachment
http://issues.apache.org/jira/secure/attachment/12707398/YARN-3304-v3.patch
against trunk revision b4b4fe9.
{color:green}+1 @author{color}. The patch does not contain any @author tags.
{color:green}+1 tests included{color}. The patch appears to include 3 new or modified test files.
{color:green}+1 javac{color}. The applied patch does not increase the total number of javac compiler warnings.
{color:green}+1 javadoc{color}. There were no new javadoc warning messages.
{color:green}+1 eclipse:eclipse{color}. The patch built with eclipse:eclipse.
{color:green}+1 findbugs{color}. The patch does not introduce any new Findbugs (version 2.0.3) warnings.
{color:green}+1 release audit{color}. The applied patch does not increase the total number of release audit warnings.
{color:green}+1 core tests{color}. The patch passed unit tests in hadoop-yarn-project/hadoop-yarn/hadoop-yarn-common hadoop-yarn-project/hadoop-yarn/hadoop-yarn-server/hadoop-yarn-server-nodemanager.
Test results: https://builds.apache.org/job/PreCommit-YARN-Build/7115//testReport/
Console output: https://builds.apache.org/job/PreCommit-YARN-Build/7115//console
This message is automatically generated.
======================================================================
======================================================================
Adding comment to Jira.
======================================================================
======================================================================
Comment added.
2cf38be134eb7d3c8ccbd14ef4e39fcee57491c9 logged out
======================================================================
======================================================================
Finished build.
======================================================================
======================================================================
Archiving artifacts
Sending artifact delta relative to PreCommit-YARN-Build #7113
Archived 20 artifacts
Archive block size is 32768
Received 73 blocks and 6899979 bytes
Compression is 25.7%
Took 10 sec
Description set: YARN-3304
Recording test results
Email was triggered for: Success
Sending email for trigger: Success
###################################################################################
############################## FAILED TESTS (if any) ##############################
All tests passed