You are viewing a plain text version of this content. The canonical link for it is here.
Posted to commits@beam.apache.org by Apache Jenkins Server <je...@builds.apache.org> on 2018/10/17 20:39:36 UTC
Build failed in Jenkins: beam_PostCommit_Python_VR_Flink #405
See <https://builds.apache.org/job/beam_PostCommit_Python_VR_Flink/405/display/redirect?page=changes>
Changes:
[migryz] Add Jira data to Beam Metrics dashboard.
------------------------------------------
[...truncated 232.22 KB...]
Task has not declared any outputs despite executing actions.
Cache <https://builds.apache.org/job/beam_PostCommit_Python_VR_Flink/ws/src/sdks/go/.gogradle/cache/VendorSnapshot-0.10.bin> not found, skip.
Skip updating cloud.google.com/go#4f6c921ec566a33844f4e7879b31cd8575a6982d in /home/jenkins/.gradle/go/repo/cloud.google.com/go/625660c387d9403fde4d73cacaf2d2ac.
Skip updating github.com/Shopify/sarama#541689b9f4212043471eb537fa72da507025d3ea in /home/jenkins/.gradle/go/repo/github.com/Shopify/sarama/7336385073f137bd7c8024a1cb2f8fec.
Skip updating github.com/armon/consul-api#eb2c6b5be1b66bab83016e0b05f01b8d5496ffbd in /home/jenkins/.gradle/go/repo/github.com/armon/consul-api/6699c6c5a593d66cb984f84ff9b5dd81.
Skip updating github.com/coreos/etcd#11214aa33bf5a47d3d9d8dafe0f6b97237dfe921 in /home/jenkins/.gradle/go/repo/github.com/coreos/etcd/e07ad470c42c48737a8fdaa60abf6316.
Skip updating github.com/coreos/etcd#11214aa33bf5a47d3d9d8dafe0f6b97237dfe921 in /home/jenkins/.gradle/go/repo/github.com/coreos/etcd/e07ad470c42c48737a8fdaa60abf6316.
Skip updating github.com/coreos/etcd#11214aa33bf5a47d3d9d8dafe0f6b97237dfe921 in /home/jenkins/.gradle/go/repo/github.com/coreos/etcd/e07ad470c42c48737a8fdaa60abf6316.
Skip updating github.com/coreos/etcd#11214aa33bf5a47d3d9d8dafe0f6b97237dfe921 in /home/jenkins/.gradle/go/repo/github.com/coreos/etcd/e07ad470c42c48737a8fdaa60abf6316.
Skip updating github.com/coreos/etcd#11214aa33bf5a47d3d9d8dafe0f6b97237dfe921 in /home/jenkins/.gradle/go/repo/github.com/coreos/etcd/e07ad470c42c48737a8fdaa60abf6316.
Skip updating github.com/coreos/etcd#11214aa33bf5a47d3d9d8dafe0f6b97237dfe921 in /home/jenkins/.gradle/go/repo/github.com/coreos/etcd/e07ad470c42c48737a8fdaa60abf6316.
Skip updating github.com/coreos/etcd#11214aa33bf5a47d3d9d8dafe0f6b97237dfe921 in /home/jenkins/.gradle/go/repo/github.com/coreos/etcd/e07ad470c42c48737a8fdaa60abf6316.
Skip updating github.com/cpuguy83/go-md2man#dc9f53734905c233adfc09fd4f063dce63ce3daf in /home/jenkins/.gradle/go/repo/github.com/cpuguy83/go-md2man/12e5b04f5fe32bdd05573f005036f2c6.
Skip updating github.com/davecgh/go-spew#87df7c60d5820d0f8ae11afede5aa52325c09717 in /home/jenkins/.gradle/go/repo/github.com/davecgh/go-spew/dc7a7e75773510b5a0d478397f61513b.
Skip updating github.com/coreos/etcd#11214aa33bf5a47d3d9d8dafe0f6b97237dfe921 in /home/jenkins/.gradle/go/repo/github.com/coreos/etcd/e07ad470c42c48737a8fdaa60abf6316.
Skip updating github.com/coreos/etcd#11214aa33bf5a47d3d9d8dafe0f6b97237dfe921 in /home/jenkins/.gradle/go/repo/github.com/coreos/etcd/e07ad470c42c48737a8fdaa60abf6316.
Skip updating github.com/eapache/go-resiliency#ef9aaa7ea8bd2448429af1a77cf41b2b3b34bdd6 in /home/jenkins/.gradle/go/repo/github.com/eapache/go-resiliency/cc8793056d7f271a549d69e70047ea4a.
Skip updating github.com/eapache/go-xerial-snappy#bb955e01b9346ac19dc29eb16586c90ded99a98c in /home/jenkins/.gradle/go/repo/github.com/eapache/go-xerial-snappy/f52f47f5cb2601626dc0aa72fc11554a.
Skip updating github.com/eapache/queue#44cc805cf13205b55f69e14bcb69867d1ae92f98 in /home/jenkins/.gradle/go/repo/github.com/eapache/queue/ce6b67da091d976a2973a2423a8383c8.
Skip updating github.com/fsnotify/fsnotify#c2828203cd70a50dcccfb2761f8b1f8ceef9a8e9 in /home/jenkins/.gradle/go/repo/github.com/fsnotify/fsnotify/19efc65ffbc0ec17575ab18d504e8c91.
Skip updating github.com/coreos/etcd#11214aa33bf5a47d3d9d8dafe0f6b97237dfe921 in /home/jenkins/.gradle/go/repo/github.com/coreos/etcd/e07ad470c42c48737a8fdaa60abf6316.
Skip updating github.com/coreos/etcd#11214aa33bf5a47d3d9d8dafe0f6b97237dfe921 in /home/jenkins/.gradle/go/repo/github.com/coreos/etcd/e07ad470c42c48737a8fdaa60abf6316.
Skip updating github.com/golang/glog#23def4e6c14b4da8ac2ed8007337bc5eb5007998 in /home/jenkins/.gradle/go/repo/github.com/golang/glog/c359ae0c52cbded42897d83346c85981.
Skip updating github.com/coreos/etcd#11214aa33bf5a47d3d9d8dafe0f6b97237dfe921 in /home/jenkins/.gradle/go/repo/github.com/coreos/etcd/e07ad470c42c48737a8fdaa60abf6316.
Skip updating github.com/golang/mock#b3e60bcdc577185fce3cf625fc96b62857ce5574 in /home/jenkins/.gradle/go/repo/github.com/golang/mock/a5aba77edff874e2e3d9ad331994556c.
Skip updating github.com/golang/protobuf#3a3da3a4e26776cc22a79ef46d5d58477532dede in /home/jenkins/.gradle/go/repo/github.com/golang/protobuf/76cd502133aa2c5520c2b3e1debe630b.
Skip updating github.com/golang/snappy#553a641470496b2327abcac10b36396bd98e45c9 in /home/jenkins/.gradle/go/repo/github.com/golang/snappy/96c568bbd0eca3e3f6a41e15a438261a.
Skip updating github.com/coreos/etcd#11214aa33bf5a47d3d9d8dafe0f6b97237dfe921 in /home/jenkins/.gradle/go/repo/github.com/coreos/etcd/e07ad470c42c48737a8fdaa60abf6316.
Skip updating github.com/google/go-cmp#3af367b6b30c263d47e8895973edcca9a49cf029 in /home/jenkins/.gradle/go/repo/github.com/google/go-cmp/0e30ce638fec37a4c0a4040d380290b4.
Skip updating github.com/google/pprof#a8f279b7952b27edbcb72e5a6c69ee9be4c8ad93 in /home/jenkins/.gradle/go/repo/github.com/google/pprof/580224cd7b76319263fe32ca011a0650.
Skip updating github.com/googleapis/gax-go#317e0006254c44a0ac427cc52a0e083ff0b9622f in /home/jenkins/.gradle/go/repo/github.com/googleapis/gax-go/cfbdb0eaeda3f1ea6b48e4ebedd6b7ac.
Skip updating github.com/coreos/etcd#11214aa33bf5a47d3d9d8dafe0f6b97237dfe921 in /home/jenkins/.gradle/go/repo/github.com/coreos/etcd/e07ad470c42c48737a8fdaa60abf6316.
Skip updating github.com/coreos/etcd#11214aa33bf5a47d3d9d8dafe0f6b97237dfe921 in /home/jenkins/.gradle/go/repo/github.com/coreos/etcd/e07ad470c42c48737a8fdaa60abf6316.
Skip updating github.com/coreos/etcd#11214aa33bf5a47d3d9d8dafe0f6b97237dfe921 in /home/jenkins/.gradle/go/repo/github.com/coreos/etcd/e07ad470c42c48737a8fdaa60abf6316.
Skip updating github.com/hashicorp/hcl#23c074d0eceb2b8a5bfdbb271ab780cde70f05a8 in /home/jenkins/.gradle/go/repo/github.com/hashicorp/hcl/37e0bb8b36d14da77f9f8c5babf91e48.
Skip updating github.com/ianlancetaylor/demangle#4883227f66371e02c4948937d3e2be1664d9be38 in /home/jenkins/.gradle/go/repo/github.com/ianlancetaylor/demangle/da9250878eadca7fe1a997f2c1e465b3.
Skip updating github.com/coreos/etcd#11214aa33bf5a47d3d9d8dafe0f6b97237dfe921 in /home/jenkins/.gradle/go/repo/github.com/coreos/etcd/e07ad470c42c48737a8fdaa60abf6316.
Skip updating github.com/coreos/etcd#11214aa33bf5a47d3d9d8dafe0f6b97237dfe921 in /home/jenkins/.gradle/go/repo/github.com/coreos/etcd/e07ad470c42c48737a8fdaa60abf6316.
Skip updating github.com/kr/fs#2788f0dbd16903de03cb8186e5c7d97b69ad387b in /home/jenkins/.gradle/go/repo/github.com/kr/fs/ef69c46d4366e9d326896066a4b027d4.
Skip updating github.com/coreos/etcd#11214aa33bf5a47d3d9d8dafe0f6b97237dfe921 in /home/jenkins/.gradle/go/repo/github.com/coreos/etcd/e07ad470c42c48737a8fdaa60abf6316.
Skip updating github.com/magiconair/properties#49d762b9817ba1c2e9d0c69183c2b4a8b8f1d934 in /home/jenkins/.gradle/go/repo/github.com/magiconair/properties/34883f6c3f37cca1c4582d137f9fc020.
Skip updating github.com/coreos/etcd#11214aa33bf5a47d3d9d8dafe0f6b97237dfe921 in /home/jenkins/.gradle/go/repo/github.com/coreos/etcd/e07ad470c42c48737a8fdaa60abf6316.
Skip updating github.com/coreos/etcd#11214aa33bf5a47d3d9d8dafe0f6b97237dfe921 in /home/jenkins/.gradle/go/repo/github.com/coreos/etcd/e07ad470c42c48737a8fdaa60abf6316.
Skip updating github.com/mitchellh/go-homedir#b8bc1bf767474819792c23f32d8286a45736f1c6 in /home/jenkins/.gradle/go/repo/github.com/mitchellh/go-homedir/11e21d791561444efcbd8f83f3617926.
Skip updating github.com/mitchellh/mapstructure#a4e142e9c047c904fa2f1e144d9a84e6133024bc in /home/jenkins/.gradle/go/repo/github.com/mitchellh/mapstructure/8f497225aea52894fde79ad66bc0eb05.
Skip updating github.com/coreos/etcd#11214aa33bf5a47d3d9d8dafe0f6b97237dfe921 in /home/jenkins/.gradle/go/repo/github.com/coreos/etcd/e07ad470c42c48737a8fdaa60abf6316.
Skip updating github.com/openzipkin/zipkin-go#3741243b287094fda649c7f0fa74bd51f37dc122 in /home/jenkins/.gradle/go/repo/github.com/openzipkin/zipkin-go/e53ea28b1632f7d2624f50816a45fa4e.
Skip updating github.com/pelletier/go-toml#acdc4509485b587f5e675510c4f2c63e90ff68a8 in /home/jenkins/.gradle/go/repo/github.com/pelletier/go-toml/fcb4bcb69fca9eab0a7b3cb341106167.
Skip updating github.com/coreos/etcd#11214aa33bf5a47d3d9d8dafe0f6b97237dfe921 in /home/jenkins/.gradle/go/repo/github.com/coreos/etcd/e07ad470c42c48737a8fdaa60abf6316.
Skip updating github.com/pierrec/lz4#ed8d4cc3b461464e69798080a0092bd028910298 in /home/jenkins/.gradle/go/repo/github.com/pierrec/lz4/83deb6b4d9e1d60342f2e0141ef3372c.
Skip updating github.com/pierrec/xxHash#a0006b13c722f7f12368c00a3d3c2ae8a999a0c6 in /home/jenkins/.gradle/go/repo/github.com/pierrec/xxHash/0aff276981c744f632693880472ff35f.
Skip updating github.com/pkg/errors#30136e27e2ac8d167177e8a583aa4c3fea5be833 in /home/jenkins/.gradle/go/repo/github.com/pkg/errors/2e4e7e2f9086007efa2e7bd2b4aac96d.
Skip updating github.com/pkg/sftp#22e9c1ccc02fc1b9fa3264572e49109b68a86947 in /home/jenkins/.gradle/go/repo/github.com/pkg/sftp/a97d32b473b1b771dd73590d425c6efa.
Skip updating github.com/prometheus/client_golang#9bb6ab929dcbe1c8393cd9ef70387cb69811bd1c in /home/jenkins/.gradle/go/repo/github.com/prometheus/client_golang/e47e9fc2682ee532aab4f916e0ba7067.
Skip updating github.com/coreos/etcd#11214aa33bf5a47d3d9d8dafe0f6b97237dfe921 in /home/jenkins/.gradle/go/repo/github.com/coreos/etcd/e07ad470c42c48737a8fdaa60abf6316.
Skip updating github.com/coreos/etcd#11214aa33bf5a47d3d9d8dafe0f6b97237dfe921 in /home/jenkins/.gradle/go/repo/github.com/coreos/etcd/e07ad470c42c48737a8fdaa60abf6316.
Skip updating github.com/prometheus/procfs#cb4147076ac75738c9a7d279075a253c0cc5acbd in /home/jenkins/.gradle/go/repo/github.com/prometheus/procfs/520728c921fed5d680688350f35d5741.
Skip updating github.com/rcrowley/go-metrics#8732c616f52954686704c8645fe1a9d59e9df7c1 in /home/jenkins/.gradle/go/repo/github.com/rcrowley/go-metrics/f0d8dabece2ef254f6ec08366c62d08e.
Skip updating github.com/cpuguy83/go-md2man#dc9f53734905c233adfc09fd4f063dce63ce3daf in /home/jenkins/.gradle/go/repo/github.com/cpuguy83/go-md2man/12e5b04f5fe32bdd05573f005036f2c6.
Skip updating github.com/cpuguy83/go-md2man#dc9f53734905c233adfc09fd4f063dce63ce3daf in /home/jenkins/.gradle/go/repo/github.com/cpuguy83/go-md2man/12e5b04f5fe32bdd05573f005036f2c6.
Skip updating github.com/coreos/etcd#11214aa33bf5a47d3d9d8dafe0f6b97237dfe921 in /home/jenkins/.gradle/go/repo/github.com/coreos/etcd/e07ad470c42c48737a8fdaa60abf6316.
Skip updating github.com/coreos/etcd#11214aa33bf5a47d3d9d8dafe0f6b97237dfe921 in /home/jenkins/.gradle/go/repo/github.com/coreos/etcd/e07ad470c42c48737a8fdaa60abf6316.
Skip updating github.com/spf13/afero#bb8f1927f2a9d3ab41c9340aa034f6b803f4359c in /home/jenkins/.gradle/go/repo/github.com/spf13/afero/0d5b43f5d5a0d64c660c5f7f85c69eba.
Skip updating github.com/spf13/cast#acbeb36b902d72a7a4c18e8f3241075e7ab763e4 in /home/jenkins/.gradle/go/repo/github.com/spf13/cast/517542251c45d58331ec1dd452bb121b.
Skip updating github.com/spf13/cobra#93959269ad99e80983c9ba742a7e01203a4c0e4f in /home/jenkins/.gradle/go/repo/github.com/spf13/cobra/e71e66962e88c28e97f1d24435dc7be4.
Skip updating github.com/spf13/jwalterweatherman#7c0cea34c8ece3fbeb2b27ab9b59511d360fb394 in /home/jenkins/.gradle/go/repo/github.com/spf13/jwalterweatherman/330c1f6608327a4a7166e17f6e499144.
Skip updating github.com/coreos/etcd#11214aa33bf5a47d3d9d8dafe0f6b97237dfe921 in /home/jenkins/.gradle/go/repo/github.com/coreos/etcd/e07ad470c42c48737a8fdaa60abf6316.
Skip updating github.com/spf13/viper#aafc9e6bc7b7bb53ddaa75a5ef49a17d6e654be5 in /home/jenkins/.gradle/go/repo/github.com/spf13/viper/0646b428d96e964862ed970f8f3b1b0d.
Skip updating github.com/stathat/go#74669b9f388d9d788c97399a0824adbfee78400e in /home/jenkins/.gradle/go/repo/github.com/stathat/go/50bfc833dbb8ee4dc51ab0c7cc9cdadc.
Skip updating github.com/coreos/etcd#11214aa33bf5a47d3d9d8dafe0f6b97237dfe921 in /home/jenkins/.gradle/go/repo/github.com/coreos/etcd/e07ad470c42c48737a8fdaa60abf6316.
Skip updating github.com/coreos/etcd#11214aa33bf5a47d3d9d8dafe0f6b97237dfe921 in /home/jenkins/.gradle/go/repo/github.com/coreos/etcd/e07ad470c42c48737a8fdaa60abf6316.
Skip updating github.com/coreos/etcd#11214aa33bf5a47d3d9d8dafe0f6b97237dfe921 in /home/jenkins/.gradle/go/repo/github.com/coreos/etcd/e07ad470c42c48737a8fdaa60abf6316.
Skip updating github.com/coreos/etcd#11214aa33bf5a47d3d9d8dafe0f6b97237dfe921 in /home/jenkins/.gradle/go/repo/github.com/coreos/etcd/e07ad470c42c48737a8fdaa60abf6316.
Skip updating github.com/xordataexchange/crypt#b2862e3d0a775f18c7cfe02273500ae307b61218 in /home/jenkins/.gradle/go/repo/github.com/xordataexchange/crypt/8e109341273400bea10f5f0413dcdd9f.
Skip updating go.opencensus.io#aa2b39d1618ef56ba156f27cfcdae9042f68f0bc in /home/jenkins/.gradle/go/repo/go.opencensus.io/fec515add58c7d1c6457c89d887bb2cd.
Skip updating golang.org/x/crypto#d9133f5469342136e669e85192a26056b587f503 in /home/jenkins/.gradle/go/repo/golang.org/x/crypto/2aba65426fb5ce67509b4db7a8dec732.
Skip updating golang.org/x/debug#95515998a8a4bd7448134b2cb5971dbeb12e0b77 in /home/jenkins/.gradle/go/repo/golang.org/x/debug/9043712fb350d6971269000e35dcbfbe.
Skip updating golang.org/x/net#2fb46b16b8dda405028c50f7c7f0f9dd1fa6bfb1 in /home/jenkins/.gradle/go/repo/golang.org/x/net/f47324d5ea8156d76c2bbb6ec5ebfdb6.
Skip updating golang.org/x/oauth2#a032972e28060ca4f5644acffae3dfc268cc09db in /home/jenkins/.gradle/go/repo/golang.org/x/oauth2/b0090736c2a63258c64df39f8d8a4b28.
Skip updating golang.org/x/sync#fd80eb99c8f653c847d294a001bdf2a3a6f768f5 in /home/jenkins/.gradle/go/repo/golang.org/x/sync/bb244395f28c52df3e99060750ebb26d.
Skip updating golang.org/x/sys#37707fdb30a5b38865cfb95e5aab41707daec7fd in /home/jenkins/.gradle/go/repo/golang.org/x/sys/c019fea3f060e6ac3a7ba229face9b20.
Skip updating github.com/coreos/etcd#11214aa33bf5a47d3d9d8dafe0f6b97237dfe921 in /home/jenkins/.gradle/go/repo/github.com/coreos/etcd/e07ad470c42c48737a8fdaa60abf6316.
Skip updating github.com/coreos/etcd#11214aa33bf5a47d3d9d8dafe0f6b97237dfe921 in /home/jenkins/.gradle/go/repo/github.com/coreos/etcd/e07ad470c42c48737a8fdaa60abf6316.
Skip updating google.golang.org/api#386d4e5f4f92f86e6aec85985761bba4b938a2d5 in /home/jenkins/.gradle/go/repo/google.golang.org/api/e28049fb85a1109eef37826e4bbdd908.
Skip updating google.golang.org/genproto#2b5a72b8730b0b16380010cfe5286c42108d88e7 in /home/jenkins/.gradle/go/repo/google.golang.org/genproto/d671e773e8f05b7375b87bbe0b61b2ce.
Skip updating google.golang.org/grpc#7646b5360d049a7ca31e9133315db43456f39e2e in /home/jenkins/.gradle/go/repo/google.golang.org/grpc/f8a4497e5e07f775c7d9e343b98b7521.
Skip updating github.com/coreos/etcd#11214aa33bf5a47d3d9d8dafe0f6b97237dfe921 in /home/jenkins/.gradle/go/repo/github.com/coreos/etcd/e07ad470c42c48737a8fdaa60abf6316.
Skip updating github.com/coreos/etcd#11214aa33bf5a47d3d9d8dafe0f6b97237dfe921 in /home/jenkins/.gradle/go/repo/github.com/coreos/etcd/e07ad470c42c48737a8fdaa60abf6316.
:beam-sdks-go:installDependencies (Thread[Task worker for ':' Thread 7,5,main]) completed. Took 2.299 secs.
:beam-sdks-go:buildLinuxAmd64 (Thread[Task worker for ':' Thread 7,5,main]) started.
go tool compile: fork/exec /home/jenkins/.gradle/go/binary/1.10/go/pkg/tool/linux_amd64/compile: resource temporarily unavailable
go tool compile: fork/exec /home/jenkins/.gradle/go/binary/1.10/go/pkg/tool/linux_amd64/compile: resource temporarily unavailable
go tool compile: fork/exec /home/jenkins/.gradle/go/binary/1.10/go/pkg/tool/linux_amd64/compile: resource temporarily unavailable
> Task :beam-sdks-go:buildLinuxAmd64 FAILED
Caching disabled for task ':beam-sdks-go:buildLinuxAmd64': Caching has not been enabled for the task
Task ':beam-sdks-go:buildLinuxAmd64' is not up-to-date because:
Task has not declared any outputs despite executing actions.
:beam-sdks-go:buildLinuxAmd64 (Thread[Task worker for ':' Thread 7,5,main]) completed. Took 0.262 secs.
:beam-sdks-python-container:installDependencies (Thread[Task worker for ':' Thread 7,5,main]) started.
> Task :beam-sdks-python-container:installDependencies
Caching disabled for task ':beam-sdks-python-container:installDependencies': Caching has not been enabled for the task
Task ':beam-sdks-python-container:installDependencies' is not up-to-date because:
Task has not declared any outputs despite executing actions.
Cache <https://builds.apache.org/job/beam_PostCommit_Python_VR_Flink/ws/src/sdks/python/container/.gogradle/cache/VendorSnapshot-0.10.bin> not found, skip.
:beam-sdks-python-container:installDependencies (Thread[Task worker for ':' Thread 7,5,main]) completed. Took 0.003 secs.
> Task :beam-sdks-java-harness:shadowJar
*******************
GRADLE SHADOW STATS
Total Jars: 43 (includes project)
Total Time: 36.339s [36339ms]
Average Time/Jar: 0.8450930232557999s [845.0930232558ms]
*******************
:beam-sdks-java-harness:shadowJar (Thread[Task worker for ':' Thread 10,5,main]) completed. Took 36.847 secs.
:beam-runners-java-fn-execution:compileJava (Thread[Task worker for ':' Thread 10,5,main]) started.
> Task :beam-runners-java-fn-execution:compileJava
Build cache key for task ':beam-runners-java-fn-execution:compileJava' is 6703376866291bf47f9867415dfbce55
Task ':beam-runners-java-fn-execution:compileJava' is not up-to-date because:
No history is available.
Custom actions are attached to task ':beam-runners-java-fn-execution:compileJava'.
All input files are considered out-of-date for incremental task ':beam-runners-java-fn-execution:compileJava'.
Full recompilation is required because no incremental change information is available. This is usually caused by clean builds or changing compiler arguments.
Compiling with error-prone compiler
Note: <https://builds.apache.org/job/beam_PostCommit_Python_VR_Flink/ws/src/runners/java-fn-execution/src/main/java/org/apache/beam/runners/fnexecution/ServerFactory.java> uses or overrides a deprecated API.
Note: Recompile with -Xlint:deprecation for details.
Note: Some input files use unchecked or unsafe operations.
Note: Recompile with -Xlint:unchecked for details.
Created classpath snapshot for incremental compilation in 3.616 secs. 26885 duplicate classes found in classpath (see all with --debug).
Packing task ':beam-runners-java-fn-execution:compileJava'
:beam-runners-java-fn-execution:compileJava (Thread[Task worker for ':' Thread 10,5,main]) completed. Took 14.296 secs.
:beam-runners-java-fn-execution:classes (Thread[Task worker for ':' Thread 10,5,main]) started.
> Task :beam-runners-java-fn-execution:classes
Skipping task ':beam-runners-java-fn-execution:classes' as it has no actions.
:beam-runners-java-fn-execution:classes (Thread[Task worker for ':' Thread 10,5,main]) completed. Took 0.0 secs.
:beam-runners-java-fn-execution:shadowJar (Thread[Task worker for ':' Thread 10,5,main]) started.
> Task :beam-runners-java-fn-execution:shadowJar
Build cache key for task ':beam-runners-java-fn-execution:shadowJar' is 4d3c510de9bd27331c5350f32b47a9d8
Caching disabled for task ':beam-runners-java-fn-execution:shadowJar': Caching has not been enabled for the task
Task ':beam-runners-java-fn-execution:shadowJar' is not up-to-date because:
No history is available.
*******************
GRADLE SHADOW STATS
Total Jars: 2 (includes project)
Total Time: 2.078s [2078ms]
Average Time/Jar: 1.039s [1039.0ms]
*******************
:beam-runners-java-fn-execution:shadowJar (Thread[Task worker for ':' Thread 10,5,main]) completed. Took 2.249 secs.
:beam-runners-flink_2.11:compileJava (Thread[Task worker for ':' Thread 10,5,main]) started.
> Task :beam-runners-flink_2.11:compileJava
Build cache key for task ':beam-runners-flink_2.11:compileJava' is fd7e2381e1b3ad2e73915e9395eb60fe
Task ':beam-runners-flink_2.11:compileJava' is not up-to-date because:
No history is available.
Custom actions are attached to task ':beam-runners-flink_2.11:compileJava'.
All input files are considered out-of-date for incremental task ':beam-runners-flink_2.11:compileJava'.
Full recompilation is required because no incremental change information is available. This is usually caused by clean builds or changing compiler arguments.
Compiling with error-prone compiler
Note: Some input files use or override a deprecated API.
Note: Recompile with -Xlint:deprecation for details.
Note: Some input files use unchecked or unsafe operations.
Note: Recompile with -Xlint:unchecked for details.
Created classpath snapshot for incremental compilation in 1.281 secs. 6714 duplicate classes found in classpath (see all with --debug).
Packing task ':beam-runners-flink_2.11:compileJava'
:beam-runners-flink_2.11:compileJava (Thread[Task worker for ':' Thread 10,5,main]) completed. Took 12.106 secs.
:beam-runners-flink_2.11:classes (Thread[Task worker for ':' Thread 10,5,main]) started.
> Task :beam-runners-flink_2.11:classes
Skipping task ':beam-runners-flink_2.11:classes' as it has no actions.
:beam-runners-flink_2.11:classes (Thread[Task worker for ':' Thread 10,5,main]) completed. Took 0.0 secs.
:beam-runners-flink_2.11:shadowJar (Thread[Task worker for ':' Thread 10,5,main]) started.
> Task :beam-runners-flink_2.11:shadowJar
Build cache key for task ':beam-runners-flink_2.11:shadowJar' is 69e47ffea46104df0a0522df9b784d03
Caching disabled for task ':beam-runners-flink_2.11:shadowJar': Caching has not been enabled for the task
Task ':beam-runners-flink_2.11:shadowJar' is not up-to-date because:
No history is available.
*******************
GRADLE SHADOW STATS
Total Jars: 2 (includes project)
Total Time: 2.132s [2132ms]
Average Time/Jar: 1.066s [1066.0ms]
*******************
:beam-runners-flink_2.11:shadowJar (Thread[Task worker for ':' Thread 10,5,main]) completed. Took 2.469 secs.
:beam-runners-flink_2.11-job-server:compileJava (Thread[Task worker for ':' Thread 10,5,main]) started.
> Task :beam-runners-flink_2.11-job-server:compileJava NO-SOURCE
file or directory '<https://builds.apache.org/job/beam_PostCommit_Python_VR_Flink/ws/src/runners/flink/job-server/src/main/java',> not found
Skipping task ':beam-runners-flink_2.11-job-server:compileJava' as it has no source files and no previous output files.
:beam-runners-flink_2.11-job-server:compileJava (Thread[Task worker for ':' Thread 10,5,main]) completed. Took 0.001 secs.
:beam-runners-flink_2.11-job-server:classes (Thread[Task worker for ':' Thread 10,5,main]) started.
> Task :beam-runners-flink_2.11-job-server:classes UP-TO-DATE
Skipping task ':beam-runners-flink_2.11-job-server:classes' as it has no actions.
:beam-runners-flink_2.11-job-server:classes (Thread[Task worker for ':' Thread 10,5,main]) completed. Took 0.0 secs.
:beam-runners-flink_2.11-job-server:shadowJar (Thread[Task worker for ':' Thread 10,5,main]) started.
> Task :beam-runners-flink_2.11-job-server:shadowJar
Build cache key for task ':beam-runners-flink_2.11-job-server:shadowJar' is 27c1827a99a48d58a5c1ef559a050ade
Caching disabled for task ':beam-runners-flink_2.11-job-server:shadowJar': Caching has not been enabled for the task
Task ':beam-runners-flink_2.11-job-server:shadowJar' is not up-to-date because:
No history is available.
*******************
GRADLE SHADOW STATS
Total Jars: 85 (includes project)
Total Time: 16.012s [16012ms]
Average Time/Jar: 0.1883764705882s [188.3764705882ms]
*******************
:beam-runners-flink_2.11-job-server:shadowJar (Thread[Task worker for ':' Thread 10,5,main]) completed. Took 17.164 secs.
FAILURE: Build failed with an exception.
* What went wrong:
Execution failed for task ':beam-sdks-go:buildLinuxAmd64'.
> Build failed due to return code 1 of:
Command:
/home/jenkins/.gradle/go/binary/1.10/go/bin/go build -o ./build/bin/beamctl github.com/apache/beam/sdks/go/cmd/beamctl
Env:
GOEXE=
GOPATH=<https://builds.apache.org/job/beam_PostCommit_Python_VR_Flink/ws/src/sdks/go/.gogradle/project_gopath>
GOROOT=/home/jenkins/.gradle/go/binary/1.10/go
GOOS=linux
GOARCH=amd64
* Try:
Run with --stacktrace option to get the stack trace. Run with --debug option to get more log output. Run with --scan to get full insights.
* Get more help at https://help.gradle.org
Deprecated Gradle features were used in this build, making it incompatible with Gradle 5.0.
Use '--warning-mode all' to show the individual deprecation warnings.
See https://docs.gradle.org/4.10.2/userguide/command_line_interface.html#sec:command_line_warnings
BUILD FAILED in 2m 48s
50 actionable tasks: 45 executed, 4 from cache, 1 up-to-date
Publishing build scan...
https://gradle.com/s/epoixnnrpcnus
Build step 'Invoke Gradle script' changed build result to FAILURE
Build step 'Invoke Gradle script' marked build as failure
Jenkins build is back to normal : beam_PostCommit_Python_VR_Flink
#410
Posted by Apache Jenkins Server <je...@builds.apache.org>.
See <https://builds.apache.org/job/beam_PostCommit_Python_VR_Flink/410/display/redirect>
Build failed in Jenkins: beam_PostCommit_Python_VR_Flink #409
Posted by Apache Jenkins Server <je...@builds.apache.org>.
See <https://builds.apache.org/job/beam_PostCommit_Python_VR_Flink/409/display/redirect?page=changes>
Changes:
[plovytsimon] [BEAM-5315] Fix 23 well-documented errors and 1 failed test while
------------------------------------------
[...truncated 243.74 KB...]
Skip updating github.com/cpuguy83/go-md2man#dc9f53734905c233adfc09fd4f063dce63ce3daf in /home/jenkins/.gradle/go/repo/github.com/cpuguy83/go-md2man/12e5b04f5fe32bdd05573f005036f2c6.
Skip updating github.com/coreos/etcd#11214aa33bf5a47d3d9d8dafe0f6b97237dfe921 in /home/jenkins/.gradle/go/repo/github.com/coreos/etcd/e07ad470c42c48737a8fdaa60abf6316.
Skip updating github.com/coreos/etcd#11214aa33bf5a47d3d9d8dafe0f6b97237dfe921 in /home/jenkins/.gradle/go/repo/github.com/coreos/etcd/e07ad470c42c48737a8fdaa60abf6316.
Skip updating github.com/spf13/afero#bb8f1927f2a9d3ab41c9340aa034f6b803f4359c in /home/jenkins/.gradle/go/repo/github.com/spf13/afero/0d5b43f5d5a0d64c660c5f7f85c69eba.
Skip updating github.com/spf13/cast#acbeb36b902d72a7a4c18e8f3241075e7ab763e4 in /home/jenkins/.gradle/go/repo/github.com/spf13/cast/517542251c45d58331ec1dd452bb121b.
Skip updating github.com/spf13/cobra#93959269ad99e80983c9ba742a7e01203a4c0e4f in /home/jenkins/.gradle/go/repo/github.com/spf13/cobra/e71e66962e88c28e97f1d24435dc7be4.
Skip updating github.com/spf13/jwalterweatherman#7c0cea34c8ece3fbeb2b27ab9b59511d360fb394 in /home/jenkins/.gradle/go/repo/github.com/spf13/jwalterweatherman/330c1f6608327a4a7166e17f6e499144.
Skip updating github.com/coreos/etcd#11214aa33bf5a47d3d9d8dafe0f6b97237dfe921 in /home/jenkins/.gradle/go/repo/github.com/coreos/etcd/e07ad470c42c48737a8fdaa60abf6316.
Skip updating github.com/spf13/viper#aafc9e6bc7b7bb53ddaa75a5ef49a17d6e654be5 in /home/jenkins/.gradle/go/repo/github.com/spf13/viper/0646b428d96e964862ed970f8f3b1b0d.
Skip updating github.com/stathat/go#74669b9f388d9d788c97399a0824adbfee78400e in /home/jenkins/.gradle/go/repo/github.com/stathat/go/50bfc833dbb8ee4dc51ab0c7cc9cdadc.
Skip updating github.com/coreos/etcd#11214aa33bf5a47d3d9d8dafe0f6b97237dfe921 in /home/jenkins/.gradle/go/repo/github.com/coreos/etcd/e07ad470c42c48737a8fdaa60abf6316.
Skip updating github.com/coreos/etcd#11214aa33bf5a47d3d9d8dafe0f6b97237dfe921 in /home/jenkins/.gradle/go/repo/github.com/coreos/etcd/e07ad470c42c48737a8fdaa60abf6316.
Skip updating github.com/coreos/etcd#11214aa33bf5a47d3d9d8dafe0f6b97237dfe921 in /home/jenkins/.gradle/go/repo/github.com/coreos/etcd/e07ad470c42c48737a8fdaa60abf6316.
Skip updating github.com/coreos/etcd#11214aa33bf5a47d3d9d8dafe0f6b97237dfe921 in /home/jenkins/.gradle/go/repo/github.com/coreos/etcd/e07ad470c42c48737a8fdaa60abf6316.
Skip updating github.com/xordataexchange/crypt#b2862e3d0a775f18c7cfe02273500ae307b61218 in /home/jenkins/.gradle/go/repo/github.com/xordataexchange/crypt/8e109341273400bea10f5f0413dcdd9f.
Skip updating go.opencensus.io#aa2b39d1618ef56ba156f27cfcdae9042f68f0bc in /home/jenkins/.gradle/go/repo/go.opencensus.io/fec515add58c7d1c6457c89d887bb2cd.
Skip updating golang.org/x/crypto#d9133f5469342136e669e85192a26056b587f503 in /home/jenkins/.gradle/go/repo/golang.org/x/crypto/2aba65426fb5ce67509b4db7a8dec732.
Skip updating golang.org/x/debug#95515998a8a4bd7448134b2cb5971dbeb12e0b77 in /home/jenkins/.gradle/go/repo/golang.org/x/debug/9043712fb350d6971269000e35dcbfbe.
Skip updating golang.org/x/net#2fb46b16b8dda405028c50f7c7f0f9dd1fa6bfb1 in /home/jenkins/.gradle/go/repo/golang.org/x/net/f47324d5ea8156d76c2bbb6ec5ebfdb6.
Skip updating golang.org/x/oauth2#a032972e28060ca4f5644acffae3dfc268cc09db in /home/jenkins/.gradle/go/repo/golang.org/x/oauth2/b0090736c2a63258c64df39f8d8a4b28.
Skip updating golang.org/x/sync#fd80eb99c8f653c847d294a001bdf2a3a6f768f5 in /home/jenkins/.gradle/go/repo/golang.org/x/sync/bb244395f28c52df3e99060750ebb26d.
Skip updating golang.org/x/sys#37707fdb30a5b38865cfb95e5aab41707daec7fd in /home/jenkins/.gradle/go/repo/golang.org/x/sys/c019fea3f060e6ac3a7ba229face9b20.
Skip updating github.com/coreos/etcd#11214aa33bf5a47d3d9d8dafe0f6b97237dfe921 in /home/jenkins/.gradle/go/repo/github.com/coreos/etcd/e07ad470c42c48737a8fdaa60abf6316.
Skip updating github.com/coreos/etcd#11214aa33bf5a47d3d9d8dafe0f6b97237dfe921 in /home/jenkins/.gradle/go/repo/github.com/coreos/etcd/e07ad470c42c48737a8fdaa60abf6316.
Skip updating google.golang.org/api#386d4e5f4f92f86e6aec85985761bba4b938a2d5 in /home/jenkins/.gradle/go/repo/google.golang.org/api/e28049fb85a1109eef37826e4bbdd908.
Skip updating google.golang.org/genproto#2b5a72b8730b0b16380010cfe5286c42108d88e7 in /home/jenkins/.gradle/go/repo/google.golang.org/genproto/d671e773e8f05b7375b87bbe0b61b2ce.
Skip updating google.golang.org/grpc#7646b5360d049a7ca31e9133315db43456f39e2e in /home/jenkins/.gradle/go/repo/google.golang.org/grpc/f8a4497e5e07f775c7d9e343b98b7521.
Skip updating github.com/coreos/etcd#11214aa33bf5a47d3d9d8dafe0f6b97237dfe921 in /home/jenkins/.gradle/go/repo/github.com/coreos/etcd/e07ad470c42c48737a8fdaa60abf6316.
Skip updating github.com/coreos/etcd#11214aa33bf5a47d3d9d8dafe0f6b97237dfe921 in /home/jenkins/.gradle/go/repo/github.com/coreos/etcd/e07ad470c42c48737a8fdaa60abf6316.
:beam-sdks-go:installDependencies (Thread[Task worker for ':' Thread 3,5,main]) completed. Took 2.278 secs.
:beam-sdks-go:buildLinuxAmd64 (Thread[Task worker for ':' Thread 3,5,main]) started.
> Task :beam-sdks-go:buildLinuxAmd64
Caching disabled for task ':beam-sdks-go:buildLinuxAmd64': Caching has not been enabled for the task
Task ':beam-sdks-go:buildLinuxAmd64' is not up-to-date because:
Task has not declared any outputs despite executing actions.
:beam-sdks-go:buildLinuxAmd64 (Thread[Task worker for ':' Thread 3,5,main]) completed. Took 3.967 secs.
:beam-sdks-go:build (Thread[Task worker for ':' Thread 3,5,main]) started.
> Task :beam-sdks-go:build
Caching disabled for task ':beam-sdks-go:build': Caching has not been enabled for the task
Task ':beam-sdks-go:build' is not up-to-date because:
Task has not declared any outputs despite executing actions.
:beam-sdks-go:build (Thread[Task worker for ':' Thread 3,5,main]) completed. Took 0.0 secs.
:beam-sdks-python-container:resolveBuildDependencies (Thread[Task worker for ':' Thread 3,5,main]) started.
> Task :beam-sdks-python-container:resolveBuildDependencies
Build cache key for task ':beam-sdks-python-container:resolveBuildDependencies' is f73434e17c6b092659ce18605f928eb1
Caching disabled for task ':beam-sdks-python-container:resolveBuildDependencies': Caching has not been enabled for the task
Task ':beam-sdks-python-container:resolveBuildDependencies' is not up-to-date because:
No history is available.
Cache <https://builds.apache.org/job/beam_PostCommit_Python_VR_Flink/ws/src/sdks/python/container/.gogradle/cache/PersistenceNotationToResolvedCache-0.10.bin> not found, skip.
Cache <https://builds.apache.org/job/beam_PostCommit_Python_VR_Flink/ws/src/sdks/python/container/.gogradle/cache/PersistenceResolvedToDependenciesCache-0.10.bin> not found, skip.
Resolving ./github.com/apache/beam/sdks/go@<https://builds.apache.org/job/beam_PostCommit_Python_VR_Flink/ws/src/sdks/go>
:beam-sdks-python-container:resolveBuildDependencies (Thread[Task worker for ':' Thread 3,5,main]) completed. Took 0.477 secs.
:beam-sdks-python-container:installDependencies (Thread[Task worker for ':' Thread 3,5,main]) started.
> Task :beam-sdks-python-container:installDependencies
Caching disabled for task ':beam-sdks-python-container:installDependencies': Caching has not been enabled for the task
Task ':beam-sdks-python-container:installDependencies' is not up-to-date because:
Task has not declared any outputs despite executing actions.
Cache <https://builds.apache.org/job/beam_PostCommit_Python_VR_Flink/ws/src/sdks/python/container/.gogradle/cache/VendorSnapshot-0.10.bin> not found, skip.
:beam-sdks-python-container:installDependencies (Thread[Task worker for ':' Thread 3,5,main]) completed. Took 0.573 secs.
:beam-sdks-python-container:buildLinuxAmd64 (Thread[Task worker for ':' Thread 3,5,main]) started.
> Task :beam-sdks-python-container:buildLinuxAmd64
Build cache key for task ':beam-sdks-python-container:buildLinuxAmd64' is 26b7bb59941067f441283cccdd7f52f8
Caching disabled for task ':beam-sdks-python-container:buildLinuxAmd64': Caching has not been enabled for the task
Task ':beam-sdks-python-container:buildLinuxAmd64' is not up-to-date because:
No history is available.
:beam-sdks-python-container:buildLinuxAmd64 (Thread[Task worker for ':' Thread 3,5,main]) completed. Took 2.947 secs.
:beam-sdks-python-container:build (Thread[Task worker for ':' Thread 3,5,main]) started.
> Task :beam-sdks-python-container:build
Caching disabled for task ':beam-sdks-python-container:build': Caching has not been enabled for the task
Task ':beam-sdks-python-container:build' is not up-to-date because:
Task has not declared any outputs despite executing actions.
:beam-sdks-python-container:build (Thread[Task worker for ':' Thread 3,5,main]) completed. Took 0.001 secs.
:beam-sdks-python-container:copyDockerfileDependencies (Thread[Task worker for ':' Thread 3,5,main]) started.
> Task :beam-sdks-python-container:copyDockerfileDependencies
Build cache key for task ':beam-sdks-python-container:copyDockerfileDependencies' is 94998bd1158669c9d6018a4650920185
Caching disabled for task ':beam-sdks-python-container:copyDockerfileDependencies': Caching has not been enabled for the task
Task ':beam-sdks-python-container:copyDockerfileDependencies' is not up-to-date because:
No history is available.
:beam-sdks-python-container:copyDockerfileDependencies (Thread[Task worker for ':' Thread 3,5,main]) completed. Took 0.031 secs.
:beam-sdks-python-container:dockerPrepare (Thread[Task worker for ':' Thread 3,5,main]) started.
> Task :beam-sdks-python-container:dockerPrepare
Build cache key for task ':beam-sdks-python-container:dockerPrepare' is fb5e3355d37f2d4182a6a65fa920f2c5
Caching disabled for task ':beam-sdks-python-container:dockerPrepare': Caching has not been enabled for the task
Task ':beam-sdks-python-container:dockerPrepare' is not up-to-date because:
No history is available.
:beam-sdks-python-container:dockerPrepare (Thread[Task worker for ':' Thread 3,5,main]) completed. Took 0.096 secs.
:beam-sdks-python-container:docker (Thread[Task worker for ':' Thread 3,5,main]) started.
> Task :beam-sdks-java-harness:shadowJar
*******************
GRADLE SHADOW STATS
Total Jars: 43 (includes project)
Total Time: 36.311s [36311ms]
Average Time/Jar: 0.8444418604651001s [844.4418604651ms]
*******************
:beam-sdks-java-harness:shadowJar (Thread[Task worker for ':' Thread 7,5,main]) completed. Took 36.86 secs.
:beam-runners-java-fn-execution:compileJava (Thread[Task worker for ':' Thread 7,5,main]) started.
> Task :beam-sdks-python-container:docker
Caching disabled for task ':beam-sdks-python-container:docker': Caching has not been enabled for the task
Task ':beam-sdks-python-container:docker' is not up-to-date because:
Task has not declared any outputs despite executing actions.
Starting process 'command 'docker''. Working directory: <https://builds.apache.org/job/beam_PostCommit_Python_VR_Flink/ws/src/sdks/python/container/build/docker> Command: docker build --no-cache -t jenkins-docker-apache.bintray.io/beam/python:latest .
Successfully started process 'command 'docker''
Sending build context to Docker daemon 17.64MB
Step 1/9 : FROM python:2-stretch
---> 3c43a5d4034a
Step 2/9 : MAINTAINER "Apache Beam <de...@beam.apache.org>"
---> Running in 3f173741adc4
---> 87bd451bbad1
Removing intermediate container 3f173741adc4
Step 3/9 : RUN apt-get update && apt-get install -y libsnappy-dev libyaml-dev && rm -rf /var/lib/apt/lists/*
---> Running in f75039f9aa63
grpc: the connection is unavailable
> Task :beam-sdks-python-container:docker FAILED
:beam-sdks-python-container:docker (Thread[Task worker for ':' Thread 3,5,main]) completed. Took 4.366 secs.
> Task :beam-runners-java-fn-execution:compileJava
Build cache key for task ':beam-runners-java-fn-execution:compileJava' is a12a54f7987dbc6d9edefb82197ed95b
Task ':beam-runners-java-fn-execution:compileJava' is not up-to-date because:
No history is available.
Custom actions are attached to task ':beam-runners-java-fn-execution:compileJava'.
All input files are considered out-of-date for incremental task ':beam-runners-java-fn-execution:compileJava'.
Full recompilation is required because no incremental change information is available. This is usually caused by clean builds or changing compiler arguments.
Compiling with error-prone compiler
Note: <https://builds.apache.org/job/beam_PostCommit_Python_VR_Flink/ws/src/runners/java-fn-execution/src/main/java/org/apache/beam/runners/fnexecution/ServerFactory.java> uses or overrides a deprecated API.
Note: Recompile with -Xlint:deprecation for details.
Note: Some input files use unchecked or unsafe operations.
Note: Recompile with -Xlint:unchecked for details.
Created classpath snapshot for incremental compilation in 4.088 secs. 26885 duplicate classes found in classpath (see all with --debug).
Packing task ':beam-runners-java-fn-execution:compileJava'
:beam-runners-java-fn-execution:compileJava (Thread[Task worker for ':' Thread 7,5,main]) completed. Took 15.017 secs.
:beam-runners-java-fn-execution:classes (Thread[Task worker for ':' Thread 7,5,main]) started.
> Task :beam-runners-java-fn-execution:classes
Skipping task ':beam-runners-java-fn-execution:classes' as it has no actions.
:beam-runners-java-fn-execution:classes (Thread[Task worker for ':' Thread 7,5,main]) completed. Took 0.0 secs.
:beam-runners-java-fn-execution:shadowJar (Thread[Task worker for ':' Thread 8,5,main]) started.
> Task :beam-runners-java-fn-execution:shadowJar
Build cache key for task ':beam-runners-java-fn-execution:shadowJar' is f4325394d928fc0aa3f789c33497875a
Caching disabled for task ':beam-runners-java-fn-execution:shadowJar': Caching has not been enabled for the task
Task ':beam-runners-java-fn-execution:shadowJar' is not up-to-date because:
No history is available.
*******************
GRADLE SHADOW STATS
Total Jars: 2 (includes project)
Total Time: 2.298s [2298ms]
Average Time/Jar: 1.149s [1149.0ms]
*******************
:beam-runners-java-fn-execution:shadowJar (Thread[Task worker for ':' Thread 8,5,main]) completed. Took 2.507 secs.
:beam-runners-flink_2.11:compileJava (Thread[Task worker for ':' Thread 8,5,main]) started.
> Task :beam-runners-flink_2.11:compileJava
Build cache key for task ':beam-runners-flink_2.11:compileJava' is 2e620918ab4d0468ebf735d321392c3c
Task ':beam-runners-flink_2.11:compileJava' is not up-to-date because:
No history is available.
Custom actions are attached to task ':beam-runners-flink_2.11:compileJava'.
All input files are considered out-of-date for incremental task ':beam-runners-flink_2.11:compileJava'.
Full recompilation is required because no incremental change information is available. This is usually caused by clean builds or changing compiler arguments.
Compiling with error-prone compiler
Note: Some input files use or override a deprecated API.
Note: Recompile with -Xlint:deprecation for details.
Note: Some input files use unchecked or unsafe operations.
Note: Recompile with -Xlint:unchecked for details.
Created classpath snapshot for incremental compilation in 1.479 secs. 6714 duplicate classes found in classpath (see all with --debug).
Packing task ':beam-runners-flink_2.11:compileJava'
:beam-runners-flink_2.11:compileJava (Thread[Task worker for ':' Thread 8,5,main]) completed. Took 13.991 secs.
:beam-runners-flink_2.11:classes (Thread[Task worker for ':' Thread 8,5,main]) started.
> Task :beam-runners-flink_2.11:classes
Skipping task ':beam-runners-flink_2.11:classes' as it has no actions.
:beam-runners-flink_2.11:classes (Thread[Task worker for ':' Thread 8,5,main]) completed. Took 0.0 secs.
:beam-runners-flink_2.11:shadowJar (Thread[Task worker for ':' Thread 8,5,main]) started.
> Task :beam-runners-flink_2.11:shadowJar
Build cache key for task ':beam-runners-flink_2.11:shadowJar' is f8ad603eb25fae60647a0a65572b35d2
Caching disabled for task ':beam-runners-flink_2.11:shadowJar': Caching has not been enabled for the task
Task ':beam-runners-flink_2.11:shadowJar' is not up-to-date because:
No history is available.
*******************
GRADLE SHADOW STATS
Total Jars: 2 (includes project)
Total Time: 2.37s [2370ms]
Average Time/Jar: 1.185s [1185.0ms]
*******************
:beam-runners-flink_2.11:shadowJar (Thread[Task worker for ':' Thread 8,5,main]) completed. Took 2.735 secs.
:beam-runners-flink_2.11-job-server:compileJava (Thread[Task worker for ':' Thread 8,5,main]) started.
> Task :beam-runners-flink_2.11-job-server:compileJava NO-SOURCE
file or directory '<https://builds.apache.org/job/beam_PostCommit_Python_VR_Flink/ws/src/runners/flink/job-server/src/main/java',> not found
Skipping task ':beam-runners-flink_2.11-job-server:compileJava' as it has no source files and no previous output files.
:beam-runners-flink_2.11-job-server:compileJava (Thread[Task worker for ':' Thread 8,5,main]) completed. Took 0.003 secs.
:beam-runners-flink_2.11-job-server:classes (Thread[Task worker for ':' Thread 8,5,main]) started.
> Task :beam-runners-flink_2.11-job-server:classes UP-TO-DATE
Skipping task ':beam-runners-flink_2.11-job-server:classes' as it has no actions.
:beam-runners-flink_2.11-job-server:classes (Thread[Task worker for ':' Thread 8,5,main]) completed. Took 0.0 secs.
:beam-runners-flink_2.11-job-server:shadowJar (Thread[Task worker for ':' Thread 8,5,main]) started.
> Task :beam-runners-flink_2.11-job-server:shadowJar
Build cache key for task ':beam-runners-flink_2.11-job-server:shadowJar' is 2f54174a47667c1e8304006abd0496e6
Caching disabled for task ':beam-runners-flink_2.11-job-server:shadowJar': Caching has not been enabled for the task
Task ':beam-runners-flink_2.11-job-server:shadowJar' is not up-to-date because:
No history is available.
*******************
GRADLE SHADOW STATS
Total Jars: 85 (includes project)
Total Time: 16.189s [16189ms]
Average Time/Jar: 0.1904588235294s [190.4588235294ms]
*******************
:beam-runners-flink_2.11-job-server:shadowJar (Thread[Task worker for ':' Thread 8,5,main]) completed. Took 17.595 secs.
FAILURE: Build failed with an exception.
* What went wrong:
Execution failed for task ':beam-sdks-python-container:docker'.
> Process 'command 'docker'' finished with non-zero exit value 1
* Try:
Run with --stacktrace option to get the stack trace. Run with --debug option to get more log output. Run with --scan to get full insights.
* Get more help at https://help.gradle.org
Deprecated Gradle features were used in this build, making it incompatible with Gradle 5.0.
Use '--warning-mode all' to show the individual deprecation warnings.
See https://docs.gradle.org/4.10.2/userguide/command_line_interface.html#sec:command_line_warnings
BUILD FAILED in 2m 56s
57 actionable tasks: 52 executed, 4 from cache, 1 up-to-date
Publishing build scan...
https://gradle.com/s/ws56ju6ppgwwo
Build step 'Invoke Gradle script' changed build result to FAILURE
Build step 'Invoke Gradle script' marked build as failure
Build failed in Jenkins: beam_PostCommit_Python_VR_Flink #408
Posted by Apache Jenkins Server <je...@builds.apache.org>.
See <https://builds.apache.org/job/beam_PostCommit_Python_VR_Flink/408/display/redirect?page=changes>
Changes:
[lcwik] [BEAM-5780] Make fn-api-worker and legacy-worker point to the different
------------------------------------------
[...truncated 241.98 KB...]
Skip updating github.com/cpuguy83/go-md2man#dc9f53734905c233adfc09fd4f063dce63ce3daf in /home/jenkins/.gradle/go/repo/github.com/cpuguy83/go-md2man/12e5b04f5fe32bdd05573f005036f2c6.
Skip updating github.com/coreos/etcd#11214aa33bf5a47d3d9d8dafe0f6b97237dfe921 in /home/jenkins/.gradle/go/repo/github.com/coreos/etcd/e07ad470c42c48737a8fdaa60abf6316.
Skip updating github.com/coreos/etcd#11214aa33bf5a47d3d9d8dafe0f6b97237dfe921 in /home/jenkins/.gradle/go/repo/github.com/coreos/etcd/e07ad470c42c48737a8fdaa60abf6316.
Skip updating github.com/spf13/afero#bb8f1927f2a9d3ab41c9340aa034f6b803f4359c in /home/jenkins/.gradle/go/repo/github.com/spf13/afero/0d5b43f5d5a0d64c660c5f7f85c69eba.
Skip updating github.com/spf13/cast#acbeb36b902d72a7a4c18e8f3241075e7ab763e4 in /home/jenkins/.gradle/go/repo/github.com/spf13/cast/517542251c45d58331ec1dd452bb121b.
Skip updating github.com/spf13/cobra#93959269ad99e80983c9ba742a7e01203a4c0e4f in /home/jenkins/.gradle/go/repo/github.com/spf13/cobra/e71e66962e88c28e97f1d24435dc7be4.
Skip updating github.com/spf13/jwalterweatherman#7c0cea34c8ece3fbeb2b27ab9b59511d360fb394 in /home/jenkins/.gradle/go/repo/github.com/spf13/jwalterweatherman/330c1f6608327a4a7166e17f6e499144.
Skip updating github.com/coreos/etcd#11214aa33bf5a47d3d9d8dafe0f6b97237dfe921 in /home/jenkins/.gradle/go/repo/github.com/coreos/etcd/e07ad470c42c48737a8fdaa60abf6316.
Skip updating github.com/spf13/viper#aafc9e6bc7b7bb53ddaa75a5ef49a17d6e654be5 in /home/jenkins/.gradle/go/repo/github.com/spf13/viper/0646b428d96e964862ed970f8f3b1b0d.
Skip updating github.com/stathat/go#74669b9f388d9d788c97399a0824adbfee78400e in /home/jenkins/.gradle/go/repo/github.com/stathat/go/50bfc833dbb8ee4dc51ab0c7cc9cdadc.
Skip updating github.com/coreos/etcd#11214aa33bf5a47d3d9d8dafe0f6b97237dfe921 in /home/jenkins/.gradle/go/repo/github.com/coreos/etcd/e07ad470c42c48737a8fdaa60abf6316.
Skip updating github.com/coreos/etcd#11214aa33bf5a47d3d9d8dafe0f6b97237dfe921 in /home/jenkins/.gradle/go/repo/github.com/coreos/etcd/e07ad470c42c48737a8fdaa60abf6316.
Skip updating github.com/coreos/etcd#11214aa33bf5a47d3d9d8dafe0f6b97237dfe921 in /home/jenkins/.gradle/go/repo/github.com/coreos/etcd/e07ad470c42c48737a8fdaa60abf6316.
Skip updating github.com/coreos/etcd#11214aa33bf5a47d3d9d8dafe0f6b97237dfe921 in /home/jenkins/.gradle/go/repo/github.com/coreos/etcd/e07ad470c42c48737a8fdaa60abf6316.
Skip updating github.com/xordataexchange/crypt#b2862e3d0a775f18c7cfe02273500ae307b61218 in /home/jenkins/.gradle/go/repo/github.com/xordataexchange/crypt/8e109341273400bea10f5f0413dcdd9f.
Skip updating go.opencensus.io#aa2b39d1618ef56ba156f27cfcdae9042f68f0bc in /home/jenkins/.gradle/go/repo/go.opencensus.io/fec515add58c7d1c6457c89d887bb2cd.
Skip updating golang.org/x/crypto#d9133f5469342136e669e85192a26056b587f503 in /home/jenkins/.gradle/go/repo/golang.org/x/crypto/2aba65426fb5ce67509b4db7a8dec732.
Skip updating golang.org/x/debug#95515998a8a4bd7448134b2cb5971dbeb12e0b77 in /home/jenkins/.gradle/go/repo/golang.org/x/debug/9043712fb350d6971269000e35dcbfbe.
Skip updating golang.org/x/net#2fb46b16b8dda405028c50f7c7f0f9dd1fa6bfb1 in /home/jenkins/.gradle/go/repo/golang.org/x/net/f47324d5ea8156d76c2bbb6ec5ebfdb6.
Skip updating golang.org/x/oauth2#a032972e28060ca4f5644acffae3dfc268cc09db in /home/jenkins/.gradle/go/repo/golang.org/x/oauth2/b0090736c2a63258c64df39f8d8a4b28.
Skip updating golang.org/x/sync#fd80eb99c8f653c847d294a001bdf2a3a6f768f5 in /home/jenkins/.gradle/go/repo/golang.org/x/sync/bb244395f28c52df3e99060750ebb26d.
Skip updating golang.org/x/sys#37707fdb30a5b38865cfb95e5aab41707daec7fd in /home/jenkins/.gradle/go/repo/golang.org/x/sys/c019fea3f060e6ac3a7ba229face9b20.
Skip updating github.com/coreos/etcd#11214aa33bf5a47d3d9d8dafe0f6b97237dfe921 in /home/jenkins/.gradle/go/repo/github.com/coreos/etcd/e07ad470c42c48737a8fdaa60abf6316.
Skip updating github.com/coreos/etcd#11214aa33bf5a47d3d9d8dafe0f6b97237dfe921 in /home/jenkins/.gradle/go/repo/github.com/coreos/etcd/e07ad470c42c48737a8fdaa60abf6316.
Skip updating google.golang.org/api#386d4e5f4f92f86e6aec85985761bba4b938a2d5 in /home/jenkins/.gradle/go/repo/google.golang.org/api/e28049fb85a1109eef37826e4bbdd908.
Skip updating google.golang.org/genproto#2b5a72b8730b0b16380010cfe5286c42108d88e7 in /home/jenkins/.gradle/go/repo/google.golang.org/genproto/d671e773e8f05b7375b87bbe0b61b2ce.
Skip updating google.golang.org/grpc#7646b5360d049a7ca31e9133315db43456f39e2e in /home/jenkins/.gradle/go/repo/google.golang.org/grpc/f8a4497e5e07f775c7d9e343b98b7521.
Skip updating github.com/coreos/etcd#11214aa33bf5a47d3d9d8dafe0f6b97237dfe921 in /home/jenkins/.gradle/go/repo/github.com/coreos/etcd/e07ad470c42c48737a8fdaa60abf6316.
Skip updating github.com/coreos/etcd#11214aa33bf5a47d3d9d8dafe0f6b97237dfe921 in /home/jenkins/.gradle/go/repo/github.com/coreos/etcd/e07ad470c42c48737a8fdaa60abf6316.
:beam-sdks-go:installDependencies (Thread[Task worker for ':' Thread 4,5,main]) completed. Took 2.579 secs.
:beam-sdks-go:buildLinuxAmd64 (Thread[Task worker for ':' Thread 4,5,main]) started.
> Task :beam-sdks-go:buildLinuxAmd64
Caching disabled for task ':beam-sdks-go:buildLinuxAmd64': Caching has not been enabled for the task
Task ':beam-sdks-go:buildLinuxAmd64' is not up-to-date because:
Task has not declared any outputs despite executing actions.
:beam-sdks-go:buildLinuxAmd64 (Thread[Task worker for ':' Thread 4,5,main]) completed. Took 4.188 secs.
:beam-sdks-go:build (Thread[Task worker for ':' Thread 4,5,main]) started.
> Task :beam-sdks-go:build
Caching disabled for task ':beam-sdks-go:build': Caching has not been enabled for the task
Task ':beam-sdks-go:build' is not up-to-date because:
Task has not declared any outputs despite executing actions.
:beam-sdks-go:build (Thread[Task worker for ':' Thread 4,5,main]) completed. Took 0.0 secs.
:beam-sdks-python-container:resolveBuildDependencies (Thread[Task worker for ':' Thread 4,5,main]) started.
> Task :beam-sdks-python-container:resolveBuildDependencies
Build cache key for task ':beam-sdks-python-container:resolveBuildDependencies' is f73434e17c6b092659ce18605f928eb1
Caching disabled for task ':beam-sdks-python-container:resolveBuildDependencies': Caching has not been enabled for the task
Task ':beam-sdks-python-container:resolveBuildDependencies' is not up-to-date because:
No history is available.
Cache <https://builds.apache.org/job/beam_PostCommit_Python_VR_Flink/ws/src/sdks/python/container/.gogradle/cache/PersistenceNotationToResolvedCache-0.10.bin> not found, skip.
Cache <https://builds.apache.org/job/beam_PostCommit_Python_VR_Flink/ws/src/sdks/python/container/.gogradle/cache/PersistenceResolvedToDependenciesCache-0.10.bin> not found, skip.
Resolving ./github.com/apache/beam/sdks/go@<https://builds.apache.org/job/beam_PostCommit_Python_VR_Flink/ws/src/sdks/go>
:beam-sdks-python-container:resolveBuildDependencies (Thread[Task worker for ':' Thread 4,5,main]) completed. Took 0.481 secs.
:beam-sdks-python-container:installDependencies (Thread[Task worker for ':' Thread 4,5,main]) started.
> Task :beam-sdks-python-container:installDependencies
Caching disabled for task ':beam-sdks-python-container:installDependencies': Caching has not been enabled for the task
Task ':beam-sdks-python-container:installDependencies' is not up-to-date because:
Task has not declared any outputs despite executing actions.
Cache <https://builds.apache.org/job/beam_PostCommit_Python_VR_Flink/ws/src/sdks/python/container/.gogradle/cache/VendorSnapshot-0.10.bin> not found, skip.
:beam-sdks-python-container:installDependencies (Thread[Task worker for ':' Thread 4,5,main]) completed. Took 0.614 secs.
:beam-sdks-python-container:buildLinuxAmd64 (Thread[Task worker for ':' Thread 4,5,main]) started.
> Task :beam-sdks-python-container:buildLinuxAmd64
Build cache key for task ':beam-sdks-python-container:buildLinuxAmd64' is 26b7bb59941067f441283cccdd7f52f8
Caching disabled for task ':beam-sdks-python-container:buildLinuxAmd64': Caching has not been enabled for the task
Task ':beam-sdks-python-container:buildLinuxAmd64' is not up-to-date because:
No history is available.
> Task :beam-sdks-java-harness:shadowJar
*******************
GRADLE SHADOW STATS
Total Jars: 43 (includes project)
Total Time: 36.681s [36681ms]
Average Time/Jar: 0.8530465116279s [853.0465116279ms]
*******************
:beam-sdks-java-harness:shadowJar (Thread[Task worker for ':' Thread 7,5,main]) completed. Took 37.124 secs.
:beam-runners-java-fn-execution:compileJava (Thread[Task worker for ':' Thread 7,5,main]) started.
:beam-sdks-python-container:buildLinuxAmd64 (Thread[Task worker for ':' Thread 4,5,main]) completed. Took 3.436 secs.
:beam-sdks-python-container:build (Thread[Task worker for ':' Thread 4,5,main]) started.
> Task :beam-sdks-python-container:build
Caching disabled for task ':beam-sdks-python-container:build': Caching has not been enabled for the task
Task ':beam-sdks-python-container:build' is not up-to-date because:
Task has not declared any outputs despite executing actions.
:beam-sdks-python-container:build (Thread[Task worker for ':' Thread 4,5,main]) completed. Took 0.001 secs.
:beam-sdks-python-container:copyDockerfileDependencies (Thread[Task worker for ':' Thread 4,5,main]) started.
> Task :beam-sdks-python-container:copyDockerfileDependencies
Build cache key for task ':beam-sdks-python-container:copyDockerfileDependencies' is 0ba5efb024c892bb72be8f3aa9218161
Caching disabled for task ':beam-sdks-python-container:copyDockerfileDependencies': Caching has not been enabled for the task
Task ':beam-sdks-python-container:copyDockerfileDependencies' is not up-to-date because:
No history is available.
:beam-sdks-python-container:copyDockerfileDependencies (Thread[Task worker for ':' Thread 4,5,main]) completed. Took 0.03 secs.
:beam-sdks-python-container:dockerPrepare (Thread[Task worker for ':' Thread 4,5,main]) started.
> Task :beam-sdks-python-container:dockerPrepare
Build cache key for task ':beam-sdks-python-container:dockerPrepare' is 469bcf1ba9aebbaacd549eb19c2e8c44
Caching disabled for task ':beam-sdks-python-container:dockerPrepare': Caching has not been enabled for the task
Task ':beam-sdks-python-container:dockerPrepare' is not up-to-date because:
No history is available.
:beam-sdks-python-container:dockerPrepare (Thread[Task worker for ':' Thread 4,5,main]) completed. Took 0.102 secs.
:beam-sdks-python-container:docker (Thread[Task worker for ':' Thread 4,5,main]) started.
> Task :beam-sdks-python-container:docker
Caching disabled for task ':beam-sdks-python-container:docker': Caching has not been enabled for the task
Task ':beam-sdks-python-container:docker' is not up-to-date because:
Task has not declared any outputs despite executing actions.
Starting process 'command 'docker''. Working directory: <https://builds.apache.org/job/beam_PostCommit_Python_VR_Flink/ws/src/sdks/python/container/build/docker> Command: docker build --no-cache -t jenkins-docker-apache.bintray.io/beam/python:latest .
Successfully started process 'command 'docker''
Sending build context to Docker daemon 17.64MB
Step 1/9 : FROM python:2-stretch
---> 3c43a5d4034a
Step 2/9 : MAINTAINER "Apache Beam <de...@beam.apache.org>"
---> Running in 7884118b3a5d
---> 705568f6cb12
Removing intermediate container 7884118b3a5d
Step 3/9 : RUN apt-get update && apt-get install -y libsnappy-dev libyaml-dev && rm -rf /var/lib/apt/lists/*
---> Running in 5258d2fc41e2
grpc: the connection is unavailable
> Task :beam-sdks-python-container:docker FAILED
:beam-sdks-python-container:docker (Thread[Task worker for ':' Thread 4,5,main]) completed. Took 3.665 secs.
> Task :beam-runners-java-fn-execution:compileJava
Build cache key for task ':beam-runners-java-fn-execution:compileJava' is eb5aaedb24935610e48d180108b1e9d0
Task ':beam-runners-java-fn-execution:compileJava' is not up-to-date because:
No history is available.
Custom actions are attached to task ':beam-runners-java-fn-execution:compileJava'.
All input files are considered out-of-date for incremental task ':beam-runners-java-fn-execution:compileJava'.
Full recompilation is required because no incremental change information is available. This is usually caused by clean builds or changing compiler arguments.
Compiling with error-prone compiler
Note: <https://builds.apache.org/job/beam_PostCommit_Python_VR_Flink/ws/src/runners/java-fn-execution/src/main/java/org/apache/beam/runners/fnexecution/ServerFactory.java> uses or overrides a deprecated API.
Note: Recompile with -Xlint:deprecation for details.
Note: Some input files use unchecked or unsafe operations.
Note: Recompile with -Xlint:unchecked for details.
Created classpath snapshot for incremental compilation in 4.129 secs. 26885 duplicate classes found in classpath (see all with --debug).
Packing task ':beam-runners-java-fn-execution:compileJava'
:beam-runners-java-fn-execution:compileJava (Thread[Task worker for ':' Thread 7,5,main]) completed. Took 15.329 secs.
:beam-runners-java-fn-execution:classes (Thread[Task worker for ':' Thread 7,5,main]) started.
> Task :beam-runners-java-fn-execution:classes
Skipping task ':beam-runners-java-fn-execution:classes' as it has no actions.
:beam-runners-java-fn-execution:classes (Thread[Task worker for ':' Thread 7,5,main]) completed. Took 0.0 secs.
:beam-runners-java-fn-execution:shadowJar (Thread[Task worker for ':' Thread 7,5,main]) started.
> Task :beam-runners-java-fn-execution:shadowJar
Build cache key for task ':beam-runners-java-fn-execution:shadowJar' is fa7a69e5636e42183831af0dbb18a345
Caching disabled for task ':beam-runners-java-fn-execution:shadowJar': Caching has not been enabled for the task
Task ':beam-runners-java-fn-execution:shadowJar' is not up-to-date because:
No history is available.
*******************
GRADLE SHADOW STATS
Total Jars: 2 (includes project)
Total Time: 2.192s [2192ms]
Average Time/Jar: 1.096s [1096.0ms]
*******************
:beam-runners-java-fn-execution:shadowJar (Thread[Task worker for ':' Thread 7,5,main]) completed. Took 2.371 secs.
:beam-runners-flink_2.11:compileJava (Thread[Task worker for ':' Thread 7,5,main]) started.
> Task :beam-runners-flink_2.11:compileJava
Build cache key for task ':beam-runners-flink_2.11:compileJava' is 1691ffee63957ce1dfb103e0060d4104
Task ':beam-runners-flink_2.11:compileJava' is not up-to-date because:
No history is available.
Custom actions are attached to task ':beam-runners-flink_2.11:compileJava'.
All input files are considered out-of-date for incremental task ':beam-runners-flink_2.11:compileJava'.
Full recompilation is required because no incremental change information is available. This is usually caused by clean builds or changing compiler arguments.
Compiling with error-prone compiler
Note: Some input files use or override a deprecated API.
Note: Recompile with -Xlint:deprecation for details.
Note: Some input files use unchecked or unsafe operations.
Note: Recompile with -Xlint:unchecked for details.
Created classpath snapshot for incremental compilation in 1.209 secs. 6714 duplicate classes found in classpath (see all with --debug).
Packing task ':beam-runners-flink_2.11:compileJava'
:beam-runners-flink_2.11:compileJava (Thread[Task worker for ':' Thread 7,5,main]) completed. Took 12.181 secs.
:beam-runners-flink_2.11:classes (Thread[Task worker for ':' Thread 7,5,main]) started.
> Task :beam-runners-flink_2.11:classes
Skipping task ':beam-runners-flink_2.11:classes' as it has no actions.
:beam-runners-flink_2.11:classes (Thread[Task worker for ':' Thread 7,5,main]) completed. Took 0.0 secs.
:beam-runners-flink_2.11:shadowJar (Thread[Task worker for ':' Thread 7,5,main]) started.
> Task :beam-runners-flink_2.11:shadowJar
Build cache key for task ':beam-runners-flink_2.11:shadowJar' is e557b724bf89dc7cc2a005ad0fdc9796
Caching disabled for task ':beam-runners-flink_2.11:shadowJar': Caching has not been enabled for the task
Task ':beam-runners-flink_2.11:shadowJar' is not up-to-date because:
No history is available.
*******************
GRADLE SHADOW STATS
Total Jars: 2 (includes project)
Total Time: 2.044s [2044ms]
Average Time/Jar: 1.022s [1022.0ms]
*******************
:beam-runners-flink_2.11:shadowJar (Thread[Task worker for ':' Thread 7,5,main]) completed. Took 2.451 secs.
:beam-runners-flink_2.11-job-server:compileJava (Thread[Task worker for ':' Thread 7,5,main]) started.
> Task :beam-runners-flink_2.11-job-server:compileJava NO-SOURCE
file or directory '<https://builds.apache.org/job/beam_PostCommit_Python_VR_Flink/ws/src/runners/flink/job-server/src/main/java',> not found
Skipping task ':beam-runners-flink_2.11-job-server:compileJava' as it has no source files and no previous output files.
:beam-runners-flink_2.11-job-server:compileJava (Thread[Task worker for ':' Thread 7,5,main]) completed. Took 0.001 secs.
:beam-runners-flink_2.11-job-server:classes (Thread[Task worker for ':' Thread 7,5,main]) started.
> Task :beam-runners-flink_2.11-job-server:classes UP-TO-DATE
Skipping task ':beam-runners-flink_2.11-job-server:classes' as it has no actions.
:beam-runners-flink_2.11-job-server:classes (Thread[Task worker for ':' Thread 7,5,main]) completed. Took 0.0 secs.
:beam-runners-flink_2.11-job-server:shadowJar (Thread[Task worker for ':' Thread 7,5,main]) started.
> Task :beam-runners-flink_2.11-job-server:shadowJar
Build cache key for task ':beam-runners-flink_2.11-job-server:shadowJar' is c2d24645cae4409479ce3aa0f82bc224
Caching disabled for task ':beam-runners-flink_2.11-job-server:shadowJar': Caching has not been enabled for the task
Task ':beam-runners-flink_2.11-job-server:shadowJar' is not up-to-date because:
No history is available.
*******************
GRADLE SHADOW STATS
Total Jars: 85 (includes project)
Total Time: 16.084s [16084ms]
Average Time/Jar: 0.1892235294118s [189.2235294118ms]
*******************
:beam-runners-flink_2.11-job-server:shadowJar (Thread[Task worker for ':' Thread 7,5,main]) completed. Took 17.244 secs.
FAILURE: Build failed with an exception.
* What went wrong:
Execution failed for task ':beam-sdks-python-container:docker'.
> Process 'command 'docker'' finished with non-zero exit value 1
* Try:
Run with --stacktrace option to get the stack trace. Run with --debug option to get more log output. Run with --scan to get full insights.
* Get more help at https://help.gradle.org
Deprecated Gradle features were used in this build, making it incompatible with Gradle 5.0.
Use '--warning-mode all' to show the individual deprecation warnings.
See https://docs.gradle.org/4.10.2/userguide/command_line_interface.html#sec:command_line_warnings
BUILD FAILED in 2m 51s
57 actionable tasks: 52 executed, 4 from cache, 1 up-to-date
Publishing build scan...
https://gradle.com/s/7o7oq3b2tihe4
Build step 'Invoke Gradle script' changed build result to FAILURE
Build step 'Invoke Gradle script' marked build as failure
Build failed in Jenkins: beam_PostCommit_Python_VR_Flink #407
Posted by Apache Jenkins Server <je...@builds.apache.org>.
See <https://builds.apache.org/job/beam_PostCommit_Python_VR_Flink/407/display/redirect?page=changes>
Changes:
[lcwik] [BEAM-5730] Migrate ITs using DataflowRunner to use custom worker
------------------------------------------
[...truncated 241.73 KB...]
Skip updating github.com/cpuguy83/go-md2man#dc9f53734905c233adfc09fd4f063dce63ce3daf in /home/jenkins/.gradle/go/repo/github.com/cpuguy83/go-md2man/12e5b04f5fe32bdd05573f005036f2c6.
Skip updating github.com/coreos/etcd#11214aa33bf5a47d3d9d8dafe0f6b97237dfe921 in /home/jenkins/.gradle/go/repo/github.com/coreos/etcd/e07ad470c42c48737a8fdaa60abf6316.
Skip updating github.com/coreos/etcd#11214aa33bf5a47d3d9d8dafe0f6b97237dfe921 in /home/jenkins/.gradle/go/repo/github.com/coreos/etcd/e07ad470c42c48737a8fdaa60abf6316.
Skip updating github.com/spf13/afero#bb8f1927f2a9d3ab41c9340aa034f6b803f4359c in /home/jenkins/.gradle/go/repo/github.com/spf13/afero/0d5b43f5d5a0d64c660c5f7f85c69eba.
Skip updating github.com/spf13/cast#acbeb36b902d72a7a4c18e8f3241075e7ab763e4 in /home/jenkins/.gradle/go/repo/github.com/spf13/cast/517542251c45d58331ec1dd452bb121b.
Skip updating github.com/spf13/cobra#93959269ad99e80983c9ba742a7e01203a4c0e4f in /home/jenkins/.gradle/go/repo/github.com/spf13/cobra/e71e66962e88c28e97f1d24435dc7be4.
Skip updating github.com/spf13/jwalterweatherman#7c0cea34c8ece3fbeb2b27ab9b59511d360fb394 in /home/jenkins/.gradle/go/repo/github.com/spf13/jwalterweatherman/330c1f6608327a4a7166e17f6e499144.
Skip updating github.com/coreos/etcd#11214aa33bf5a47d3d9d8dafe0f6b97237dfe921 in /home/jenkins/.gradle/go/repo/github.com/coreos/etcd/e07ad470c42c48737a8fdaa60abf6316.
Skip updating github.com/spf13/viper#aafc9e6bc7b7bb53ddaa75a5ef49a17d6e654be5 in /home/jenkins/.gradle/go/repo/github.com/spf13/viper/0646b428d96e964862ed970f8f3b1b0d.
Skip updating github.com/stathat/go#74669b9f388d9d788c97399a0824adbfee78400e in /home/jenkins/.gradle/go/repo/github.com/stathat/go/50bfc833dbb8ee4dc51ab0c7cc9cdadc.
Skip updating github.com/coreos/etcd#11214aa33bf5a47d3d9d8dafe0f6b97237dfe921 in /home/jenkins/.gradle/go/repo/github.com/coreos/etcd/e07ad470c42c48737a8fdaa60abf6316.
Skip updating github.com/coreos/etcd#11214aa33bf5a47d3d9d8dafe0f6b97237dfe921 in /home/jenkins/.gradle/go/repo/github.com/coreos/etcd/e07ad470c42c48737a8fdaa60abf6316.
Skip updating github.com/coreos/etcd#11214aa33bf5a47d3d9d8dafe0f6b97237dfe921 in /home/jenkins/.gradle/go/repo/github.com/coreos/etcd/e07ad470c42c48737a8fdaa60abf6316.
Skip updating github.com/coreos/etcd#11214aa33bf5a47d3d9d8dafe0f6b97237dfe921 in /home/jenkins/.gradle/go/repo/github.com/coreos/etcd/e07ad470c42c48737a8fdaa60abf6316.
Skip updating github.com/xordataexchange/crypt#b2862e3d0a775f18c7cfe02273500ae307b61218 in /home/jenkins/.gradle/go/repo/github.com/xordataexchange/crypt/8e109341273400bea10f5f0413dcdd9f.
Skip updating go.opencensus.io#aa2b39d1618ef56ba156f27cfcdae9042f68f0bc in /home/jenkins/.gradle/go/repo/go.opencensus.io/fec515add58c7d1c6457c89d887bb2cd.
Skip updating golang.org/x/crypto#d9133f5469342136e669e85192a26056b587f503 in /home/jenkins/.gradle/go/repo/golang.org/x/crypto/2aba65426fb5ce67509b4db7a8dec732.
Skip updating golang.org/x/debug#95515998a8a4bd7448134b2cb5971dbeb12e0b77 in /home/jenkins/.gradle/go/repo/golang.org/x/debug/9043712fb350d6971269000e35dcbfbe.
Skip updating golang.org/x/net#2fb46b16b8dda405028c50f7c7f0f9dd1fa6bfb1 in /home/jenkins/.gradle/go/repo/golang.org/x/net/f47324d5ea8156d76c2bbb6ec5ebfdb6.
Skip updating golang.org/x/oauth2#a032972e28060ca4f5644acffae3dfc268cc09db in /home/jenkins/.gradle/go/repo/golang.org/x/oauth2/b0090736c2a63258c64df39f8d8a4b28.
Skip updating golang.org/x/sync#fd80eb99c8f653c847d294a001bdf2a3a6f768f5 in /home/jenkins/.gradle/go/repo/golang.org/x/sync/bb244395f28c52df3e99060750ebb26d.
Skip updating golang.org/x/sys#37707fdb30a5b38865cfb95e5aab41707daec7fd in /home/jenkins/.gradle/go/repo/golang.org/x/sys/c019fea3f060e6ac3a7ba229face9b20.
Skip updating github.com/coreos/etcd#11214aa33bf5a47d3d9d8dafe0f6b97237dfe921 in /home/jenkins/.gradle/go/repo/github.com/coreos/etcd/e07ad470c42c48737a8fdaa60abf6316.
Skip updating github.com/coreos/etcd#11214aa33bf5a47d3d9d8dafe0f6b97237dfe921 in /home/jenkins/.gradle/go/repo/github.com/coreos/etcd/e07ad470c42c48737a8fdaa60abf6316.
Skip updating google.golang.org/api#386d4e5f4f92f86e6aec85985761bba4b938a2d5 in /home/jenkins/.gradle/go/repo/google.golang.org/api/e28049fb85a1109eef37826e4bbdd908.
Skip updating google.golang.org/genproto#2b5a72b8730b0b16380010cfe5286c42108d88e7 in /home/jenkins/.gradle/go/repo/google.golang.org/genproto/d671e773e8f05b7375b87bbe0b61b2ce.
Skip updating google.golang.org/grpc#7646b5360d049a7ca31e9133315db43456f39e2e in /home/jenkins/.gradle/go/repo/google.golang.org/grpc/f8a4497e5e07f775c7d9e343b98b7521.
Skip updating github.com/coreos/etcd#11214aa33bf5a47d3d9d8dafe0f6b97237dfe921 in /home/jenkins/.gradle/go/repo/github.com/coreos/etcd/e07ad470c42c48737a8fdaa60abf6316.
Skip updating github.com/coreos/etcd#11214aa33bf5a47d3d9d8dafe0f6b97237dfe921 in /home/jenkins/.gradle/go/repo/github.com/coreos/etcd/e07ad470c42c48737a8fdaa60abf6316.
:beam-sdks-go:installDependencies (Thread[Task worker for ':' Thread 4,5,main]) completed. Took 2.276 secs.
:beam-sdks-go:buildLinuxAmd64 (Thread[Task worker for ':' Thread 4,5,main]) started.
> Task :beam-sdks-go:buildLinuxAmd64
Caching disabled for task ':beam-sdks-go:buildLinuxAmd64': Caching has not been enabled for the task
Task ':beam-sdks-go:buildLinuxAmd64' is not up-to-date because:
Task has not declared any outputs despite executing actions.
:beam-sdks-go:buildLinuxAmd64 (Thread[Task worker for ':' Thread 4,5,main]) completed. Took 4.024 secs.
:beam-sdks-go:build (Thread[Task worker for ':' Thread 4,5,main]) started.
> Task :beam-sdks-go:build
Caching disabled for task ':beam-sdks-go:build': Caching has not been enabled for the task
Task ':beam-sdks-go:build' is not up-to-date because:
Task has not declared any outputs despite executing actions.
:beam-sdks-go:build (Thread[Task worker for ':' Thread 4,5,main]) completed. Took 0.001 secs.
:beam-sdks-python-container:resolveBuildDependencies (Thread[Task worker for ':' Thread 4,5,main]) started.
> Task :beam-sdks-python-container:resolveBuildDependencies
Build cache key for task ':beam-sdks-python-container:resolveBuildDependencies' is f73434e17c6b092659ce18605f928eb1
Caching disabled for task ':beam-sdks-python-container:resolveBuildDependencies': Caching has not been enabled for the task
Task ':beam-sdks-python-container:resolveBuildDependencies' is not up-to-date because:
No history is available.
Cache <https://builds.apache.org/job/beam_PostCommit_Python_VR_Flink/ws/src/sdks/python/container/.gogradle/cache/PersistenceNotationToResolvedCache-0.10.bin> not found, skip.
Cache <https://builds.apache.org/job/beam_PostCommit_Python_VR_Flink/ws/src/sdks/python/container/.gogradle/cache/PersistenceResolvedToDependenciesCache-0.10.bin> not found, skip.
Resolving ./github.com/apache/beam/sdks/go@<https://builds.apache.org/job/beam_PostCommit_Python_VR_Flink/ws/src/sdks/go>
:beam-sdks-python-container:resolveBuildDependencies (Thread[Task worker for ':' Thread 4,5,main]) completed. Took 0.451 secs.
:beam-sdks-python-container:installDependencies (Thread[Task worker for ':' Thread 4,5,main]) started.
> Task :beam-sdks-python-container:installDependencies
Caching disabled for task ':beam-sdks-python-container:installDependencies': Caching has not been enabled for the task
Task ':beam-sdks-python-container:installDependencies' is not up-to-date because:
Task has not declared any outputs despite executing actions.
Cache <https://builds.apache.org/job/beam_PostCommit_Python_VR_Flink/ws/src/sdks/python/container/.gogradle/cache/VendorSnapshot-0.10.bin> not found, skip.
:beam-sdks-python-container:installDependencies (Thread[Task worker for ':' Thread 4,5,main]) completed. Took 0.562 secs.
:beam-sdks-python-container:buildLinuxAmd64 (Thread[Task worker for ':' Thread 4,5,main]) started.
> Task :beam-sdks-python-container:buildLinuxAmd64
Build cache key for task ':beam-sdks-python-container:buildLinuxAmd64' is 26b7bb59941067f441283cccdd7f52f8
Caching disabled for task ':beam-sdks-python-container:buildLinuxAmd64': Caching has not been enabled for the task
Task ':beam-sdks-python-container:buildLinuxAmd64' is not up-to-date because:
No history is available.
:beam-sdks-python-container:buildLinuxAmd64 (Thread[Task worker for ':' Thread 4,5,main]) completed. Took 2.966 secs.
:beam-sdks-python-container:build (Thread[Task worker for ':' Thread 4,5,main]) started.
> Task :beam-sdks-python-container:build
Caching disabled for task ':beam-sdks-python-container:build': Caching has not been enabled for the task
Task ':beam-sdks-python-container:build' is not up-to-date because:
Task has not declared any outputs despite executing actions.
:beam-sdks-python-container:build (Thread[Task worker for ':' Thread 4,5,main]) completed. Took 0.001 secs.
:beam-sdks-python-container:copyDockerfileDependencies (Thread[Task worker for ':' Thread 4,5,main]) started.
> Task :beam-sdks-python-container:copyDockerfileDependencies
Build cache key for task ':beam-sdks-python-container:copyDockerfileDependencies' is 117ce8eec5c00da4a394c3b9c97122b7
Caching disabled for task ':beam-sdks-python-container:copyDockerfileDependencies': Caching has not been enabled for the task
Task ':beam-sdks-python-container:copyDockerfileDependencies' is not up-to-date because:
No history is available.
:beam-sdks-python-container:copyDockerfileDependencies (Thread[Task worker for ':' Thread 4,5,main]) completed. Took 0.033 secs.
:beam-sdks-python-container:dockerPrepare (Thread[Task worker for ':' Thread 4,5,main]) started.
> Task :beam-sdks-python-container:dockerPrepare
Build cache key for task ':beam-sdks-python-container:dockerPrepare' is f523dc3c6629fea161ee0ebb77a05634
Caching disabled for task ':beam-sdks-python-container:dockerPrepare': Caching has not been enabled for the task
Task ':beam-sdks-python-container:dockerPrepare' is not up-to-date because:
No history is available.
:beam-sdks-python-container:dockerPrepare (Thread[Task worker for ':' Thread 4,5,main]) completed. Took 0.097 secs.
:beam-sdks-python-container:docker (Thread[Task worker for ':' Thread 4,5,main]) started.
> Task :beam-sdks-java-harness:shadowJar
*******************
GRADLE SHADOW STATS
Total Jars: 43 (includes project)
Total Time: 36.921s [36921ms]
Average Time/Jar: 0.8586279069767s [858.6279069767ms]
*******************
:beam-sdks-java-harness:shadowJar (Thread[Task worker for ':' Thread 11,5,main]) completed. Took 37.405 secs.
:beam-runners-java-fn-execution:compileJava (Thread[Task worker for ':' Thread 11,5,main]) started.
> Task :beam-sdks-python-container:docker
Caching disabled for task ':beam-sdks-python-container:docker': Caching has not been enabled for the task
Task ':beam-sdks-python-container:docker' is not up-to-date because:
Task has not declared any outputs despite executing actions.
Starting process 'command 'docker''. Working directory: <https://builds.apache.org/job/beam_PostCommit_Python_VR_Flink/ws/src/sdks/python/container/build/docker> Command: docker build --no-cache -t jenkins-docker-apache.bintray.io/beam/python:latest .
Successfully started process 'command 'docker''
Sending build context to Docker daemon 17.64MB
Step 1/9 : FROM python:2-stretch
---> 3c43a5d4034a
Step 2/9 : MAINTAINER "Apache Beam <de...@beam.apache.org>"
---> Running in acd8e6a11488
---> f2a7f5d03296
Removing intermediate container acd8e6a11488
Step 3/9 : RUN apt-get update && apt-get install -y libsnappy-dev libyaml-dev && rm -rf /var/lib/apt/lists/*
---> Running in f212c94bd48d
grpc: the connection is unavailable
> Task :beam-sdks-python-container:docker FAILED
:beam-sdks-python-container:docker (Thread[Task worker for ':' Thread 4,5,main]) completed. Took 3.764 secs.
> Task :beam-runners-java-fn-execution:compileJava
Build cache key for task ':beam-runners-java-fn-execution:compileJava' is 6f1f43564f63c0f522d2eaec5bde1ac0
Task ':beam-runners-java-fn-execution:compileJava' is not up-to-date because:
No history is available.
Custom actions are attached to task ':beam-runners-java-fn-execution:compileJava'.
All input files are considered out-of-date for incremental task ':beam-runners-java-fn-execution:compileJava'.
Full recompilation is required because no incremental change information is available. This is usually caused by clean builds or changing compiler arguments.
Compiling with error-prone compiler
Note: <https://builds.apache.org/job/beam_PostCommit_Python_VR_Flink/ws/src/runners/java-fn-execution/src/main/java/org/apache/beam/runners/fnexecution/ServerFactory.java> uses or overrides a deprecated API.
Note: Recompile with -Xlint:deprecation for details.
Note: Some input files use unchecked or unsafe operations.
Note: Recompile with -Xlint:unchecked for details.
Created classpath snapshot for incremental compilation in 3.69 secs. 26885 duplicate classes found in classpath (see all with --debug).
Packing task ':beam-runners-java-fn-execution:compileJava'
:beam-runners-java-fn-execution:compileJava (Thread[Task worker for ':' Thread 11,5,main]) completed. Took 14.732 secs.
:beam-runners-java-fn-execution:classes (Thread[Task worker for ':' Thread 11,5,main]) started.
> Task :beam-runners-java-fn-execution:classes
Skipping task ':beam-runners-java-fn-execution:classes' as it has no actions.
:beam-runners-java-fn-execution:classes (Thread[Task worker for ':' Thread 11,5,main]) completed. Took 0.0 secs.
:beam-runners-java-fn-execution:shadowJar (Thread[Task worker for ':' Thread 11,5,main]) started.
> Task :beam-runners-java-fn-execution:shadowJar
Build cache key for task ':beam-runners-java-fn-execution:shadowJar' is 016489fe5010a522e69597c1ea52467a
Caching disabled for task ':beam-runners-java-fn-execution:shadowJar': Caching has not been enabled for the task
Task ':beam-runners-java-fn-execution:shadowJar' is not up-to-date because:
No history is available.
*******************
GRADLE SHADOW STATS
Total Jars: 2 (includes project)
Total Time: 2.139s [2139ms]
Average Time/Jar: 1.0695s [1069.5ms]
*******************
:beam-runners-java-fn-execution:shadowJar (Thread[Task worker for ':' Thread 11,5,main]) completed. Took 2.322 secs.
:beam-runners-flink_2.11:compileJava (Thread[Task worker for ':' Thread 11,5,main]) started.
> Task :beam-runners-flink_2.11:compileJava
Build cache key for task ':beam-runners-flink_2.11:compileJava' is 4b4aaf9aae08a459539b9ed3e45048bb
Task ':beam-runners-flink_2.11:compileJava' is not up-to-date because:
No history is available.
Custom actions are attached to task ':beam-runners-flink_2.11:compileJava'.
All input files are considered out-of-date for incremental task ':beam-runners-flink_2.11:compileJava'.
Full recompilation is required because no incremental change information is available. This is usually caused by clean builds or changing compiler arguments.
Compiling with error-prone compiler
Note: Some input files use or override a deprecated API.
Note: Recompile with -Xlint:deprecation for details.
Note: Some input files use unchecked or unsafe operations.
Note: Recompile with -Xlint:unchecked for details.
Created classpath snapshot for incremental compilation in 1.28 secs. 6714 duplicate classes found in classpath (see all with --debug).
Packing task ':beam-runners-flink_2.11:compileJava'
:beam-runners-flink_2.11:compileJava (Thread[Task worker for ':' Thread 11,5,main]) completed. Took 12.024 secs.
:beam-runners-flink_2.11:classes (Thread[Task worker for ':' Thread 11,5,main]) started.
> Task :beam-runners-flink_2.11:classes
Skipping task ':beam-runners-flink_2.11:classes' as it has no actions.
:beam-runners-flink_2.11:classes (Thread[Task worker for ':' Thread 11,5,main]) completed. Took 0.0 secs.
:beam-runners-flink_2.11:shadowJar (Thread[Task worker for ':' Thread 3,5,main]) started.
> Task :beam-runners-flink_2.11:shadowJar
Build cache key for task ':beam-runners-flink_2.11:shadowJar' is ae14bbf0468e2fbf54f701fa5a964761
Caching disabled for task ':beam-runners-flink_2.11:shadowJar': Caching has not been enabled for the task
Task ':beam-runners-flink_2.11:shadowJar' is not up-to-date because:
No history is available.
*******************
GRADLE SHADOW STATS
Total Jars: 2 (includes project)
Total Time: 2.247s [2247ms]
Average Time/Jar: 1.1235s [1123.5ms]
*******************
:beam-runners-flink_2.11:shadowJar (Thread[Task worker for ':' Thread 3,5,main]) completed. Took 2.67 secs.
:beam-runners-flink_2.11-job-server:compileJava (Thread[Task worker for ':' Thread 3,5,main]) started.
> Task :beam-runners-flink_2.11-job-server:compileJava NO-SOURCE
file or directory '<https://builds.apache.org/job/beam_PostCommit_Python_VR_Flink/ws/src/runners/flink/job-server/src/main/java',> not found
Skipping task ':beam-runners-flink_2.11-job-server:compileJava' as it has no source files and no previous output files.
:beam-runners-flink_2.11-job-server:compileJava (Thread[Task worker for ':' Thread 3,5,main]) completed. Took 0.001 secs.
:beam-runners-flink_2.11-job-server:classes (Thread[Task worker for ':' Thread 3,5,main]) started.
> Task :beam-runners-flink_2.11-job-server:classes UP-TO-DATE
Skipping task ':beam-runners-flink_2.11-job-server:classes' as it has no actions.
:beam-runners-flink_2.11-job-server:classes (Thread[Task worker for ':' Thread 3,5,main]) completed. Took 0.0 secs.
:beam-runners-flink_2.11-job-server:shadowJar (Thread[Task worker for ':' Thread 5,5,main]) started.
> Task :beam-runners-flink_2.11-job-server:shadowJar
Build cache key for task ':beam-runners-flink_2.11-job-server:shadowJar' is cc2063312d872817f67bd7779f679620
Caching disabled for task ':beam-runners-flink_2.11-job-server:shadowJar': Caching has not been enabled for the task
Task ':beam-runners-flink_2.11-job-server:shadowJar' is not up-to-date because:
No history is available.
*******************
GRADLE SHADOW STATS
Total Jars: 85 (includes project)
Total Time: 16.336s [16336ms]
Average Time/Jar: 0.1921882352941s [192.1882352941ms]
*******************
:beam-runners-flink_2.11-job-server:shadowJar (Thread[Task worker for ':' Thread 5,5,main]) completed. Took 17.41 secs.
FAILURE: Build failed with an exception.
* What went wrong:
Execution failed for task ':beam-sdks-python-container:docker'.
> Process 'command 'docker'' finished with non-zero exit value 1
* Try:
Run with --stacktrace option to get the stack trace. Run with --debug option to get more log output. Run with --scan to get full insights.
* Get more help at https://help.gradle.org
Deprecated Gradle features were used in this build, making it incompatible with Gradle 5.0.
Use '--warning-mode all' to show the individual deprecation warnings.
See https://docs.gradle.org/4.10.2/userguide/command_line_interface.html#sec:command_line_warnings
BUILD FAILED in 2m 51s
57 actionable tasks: 52 executed, 4 from cache, 1 up-to-date
Publishing build scan...
https://gradle.com/s/5y3vejsokewra
Build step 'Invoke Gradle script' changed build result to FAILURE
Build step 'Invoke Gradle script' marked build as failure
Build failed in Jenkins: beam_PostCommit_Python_VR_Flink #406
Posted by Apache Jenkins Server <je...@builds.apache.org>.
See <https://builds.apache.org/job/beam_PostCommit_Python_VR_Flink/406/display/redirect?page=changes>
Changes:
[ccy] Update website source release link
------------------------------------------
[...truncated 241.15 KB...]
Skip updating github.com/cpuguy83/go-md2man#dc9f53734905c233adfc09fd4f063dce63ce3daf in /home/jenkins/.gradle/go/repo/github.com/cpuguy83/go-md2man/12e5b04f5fe32bdd05573f005036f2c6.
Skip updating github.com/coreos/etcd#11214aa33bf5a47d3d9d8dafe0f6b97237dfe921 in /home/jenkins/.gradle/go/repo/github.com/coreos/etcd/e07ad470c42c48737a8fdaa60abf6316.
Skip updating github.com/coreos/etcd#11214aa33bf5a47d3d9d8dafe0f6b97237dfe921 in /home/jenkins/.gradle/go/repo/github.com/coreos/etcd/e07ad470c42c48737a8fdaa60abf6316.
Skip updating github.com/spf13/afero#bb8f1927f2a9d3ab41c9340aa034f6b803f4359c in /home/jenkins/.gradle/go/repo/github.com/spf13/afero/0d5b43f5d5a0d64c660c5f7f85c69eba.
Skip updating github.com/spf13/cast#acbeb36b902d72a7a4c18e8f3241075e7ab763e4 in /home/jenkins/.gradle/go/repo/github.com/spf13/cast/517542251c45d58331ec1dd452bb121b.
Skip updating github.com/spf13/cobra#93959269ad99e80983c9ba742a7e01203a4c0e4f in /home/jenkins/.gradle/go/repo/github.com/spf13/cobra/e71e66962e88c28e97f1d24435dc7be4.
Skip updating github.com/spf13/jwalterweatherman#7c0cea34c8ece3fbeb2b27ab9b59511d360fb394 in /home/jenkins/.gradle/go/repo/github.com/spf13/jwalterweatherman/330c1f6608327a4a7166e17f6e499144.
Skip updating github.com/coreos/etcd#11214aa33bf5a47d3d9d8dafe0f6b97237dfe921 in /home/jenkins/.gradle/go/repo/github.com/coreos/etcd/e07ad470c42c48737a8fdaa60abf6316.
Skip updating github.com/spf13/viper#aafc9e6bc7b7bb53ddaa75a5ef49a17d6e654be5 in /home/jenkins/.gradle/go/repo/github.com/spf13/viper/0646b428d96e964862ed970f8f3b1b0d.
Skip updating github.com/stathat/go#74669b9f388d9d788c97399a0824adbfee78400e in /home/jenkins/.gradle/go/repo/github.com/stathat/go/50bfc833dbb8ee4dc51ab0c7cc9cdadc.
Skip updating github.com/coreos/etcd#11214aa33bf5a47d3d9d8dafe0f6b97237dfe921 in /home/jenkins/.gradle/go/repo/github.com/coreos/etcd/e07ad470c42c48737a8fdaa60abf6316.
Skip updating github.com/coreos/etcd#11214aa33bf5a47d3d9d8dafe0f6b97237dfe921 in /home/jenkins/.gradle/go/repo/github.com/coreos/etcd/e07ad470c42c48737a8fdaa60abf6316.
Skip updating github.com/coreos/etcd#11214aa33bf5a47d3d9d8dafe0f6b97237dfe921 in /home/jenkins/.gradle/go/repo/github.com/coreos/etcd/e07ad470c42c48737a8fdaa60abf6316.
Skip updating github.com/coreos/etcd#11214aa33bf5a47d3d9d8dafe0f6b97237dfe921 in /home/jenkins/.gradle/go/repo/github.com/coreos/etcd/e07ad470c42c48737a8fdaa60abf6316.
Skip updating github.com/xordataexchange/crypt#b2862e3d0a775f18c7cfe02273500ae307b61218 in /home/jenkins/.gradle/go/repo/github.com/xordataexchange/crypt/8e109341273400bea10f5f0413dcdd9f.
Skip updating go.opencensus.io#aa2b39d1618ef56ba156f27cfcdae9042f68f0bc in /home/jenkins/.gradle/go/repo/go.opencensus.io/fec515add58c7d1c6457c89d887bb2cd.
Skip updating golang.org/x/crypto#d9133f5469342136e669e85192a26056b587f503 in /home/jenkins/.gradle/go/repo/golang.org/x/crypto/2aba65426fb5ce67509b4db7a8dec732.
Skip updating golang.org/x/debug#95515998a8a4bd7448134b2cb5971dbeb12e0b77 in /home/jenkins/.gradle/go/repo/golang.org/x/debug/9043712fb350d6971269000e35dcbfbe.
Skip updating golang.org/x/net#2fb46b16b8dda405028c50f7c7f0f9dd1fa6bfb1 in /home/jenkins/.gradle/go/repo/golang.org/x/net/f47324d5ea8156d76c2bbb6ec5ebfdb6.
Skip updating golang.org/x/oauth2#a032972e28060ca4f5644acffae3dfc268cc09db in /home/jenkins/.gradle/go/repo/golang.org/x/oauth2/b0090736c2a63258c64df39f8d8a4b28.
Skip updating golang.org/x/sync#fd80eb99c8f653c847d294a001bdf2a3a6f768f5 in /home/jenkins/.gradle/go/repo/golang.org/x/sync/bb244395f28c52df3e99060750ebb26d.
Skip updating golang.org/x/sys#37707fdb30a5b38865cfb95e5aab41707daec7fd in /home/jenkins/.gradle/go/repo/golang.org/x/sys/c019fea3f060e6ac3a7ba229face9b20.
Skip updating github.com/coreos/etcd#11214aa33bf5a47d3d9d8dafe0f6b97237dfe921 in /home/jenkins/.gradle/go/repo/github.com/coreos/etcd/e07ad470c42c48737a8fdaa60abf6316.
Skip updating github.com/coreos/etcd#11214aa33bf5a47d3d9d8dafe0f6b97237dfe921 in /home/jenkins/.gradle/go/repo/github.com/coreos/etcd/e07ad470c42c48737a8fdaa60abf6316.
Skip updating google.golang.org/api#386d4e5f4f92f86e6aec85985761bba4b938a2d5 in /home/jenkins/.gradle/go/repo/google.golang.org/api/e28049fb85a1109eef37826e4bbdd908.
Skip updating google.golang.org/genproto#2b5a72b8730b0b16380010cfe5286c42108d88e7 in /home/jenkins/.gradle/go/repo/google.golang.org/genproto/d671e773e8f05b7375b87bbe0b61b2ce.
Skip updating google.golang.org/grpc#7646b5360d049a7ca31e9133315db43456f39e2e in /home/jenkins/.gradle/go/repo/google.golang.org/grpc/f8a4497e5e07f775c7d9e343b98b7521.
Skip updating github.com/coreos/etcd#11214aa33bf5a47d3d9d8dafe0f6b97237dfe921 in /home/jenkins/.gradle/go/repo/github.com/coreos/etcd/e07ad470c42c48737a8fdaa60abf6316.
Skip updating github.com/coreos/etcd#11214aa33bf5a47d3d9d8dafe0f6b97237dfe921 in /home/jenkins/.gradle/go/repo/github.com/coreos/etcd/e07ad470c42c48737a8fdaa60abf6316.
:beam-sdks-go:installDependencies (Thread[Task worker for ':' Thread 4,5,main]) completed. Took 2.336 secs.
:beam-sdks-go:buildLinuxAmd64 (Thread[Task worker for ':' Thread 4,5,main]) started.
> Task :beam-sdks-go:buildLinuxAmd64
Caching disabled for task ':beam-sdks-go:buildLinuxAmd64': Caching has not been enabled for the task
Task ':beam-sdks-go:buildLinuxAmd64' is not up-to-date because:
Task has not declared any outputs despite executing actions.
:beam-sdks-go:buildLinuxAmd64 (Thread[Task worker for ':' Thread 4,5,main]) completed. Took 3.982 secs.
:beam-sdks-go:build (Thread[Task worker for ':' Thread 4,5,main]) started.
> Task :beam-sdks-go:build
Caching disabled for task ':beam-sdks-go:build': Caching has not been enabled for the task
Task ':beam-sdks-go:build' is not up-to-date because:
Task has not declared any outputs despite executing actions.
:beam-sdks-go:build (Thread[Task worker for ':' Thread 4,5,main]) completed. Took 0.0 secs.
:beam-sdks-python-container:resolveBuildDependencies (Thread[Task worker for ':' Thread 4,5,main]) started.
> Task :beam-sdks-python-container:resolveBuildDependencies
Build cache key for task ':beam-sdks-python-container:resolveBuildDependencies' is f73434e17c6b092659ce18605f928eb1
Caching disabled for task ':beam-sdks-python-container:resolveBuildDependencies': Caching has not been enabled for the task
Task ':beam-sdks-python-container:resolveBuildDependencies' is not up-to-date because:
No history is available.
Cache <https://builds.apache.org/job/beam_PostCommit_Python_VR_Flink/ws/src/sdks/python/container/.gogradle/cache/PersistenceNotationToResolvedCache-0.10.bin> not found, skip.
Cache <https://builds.apache.org/job/beam_PostCommit_Python_VR_Flink/ws/src/sdks/python/container/.gogradle/cache/PersistenceResolvedToDependenciesCache-0.10.bin> not found, skip.
Resolving ./github.com/apache/beam/sdks/go@<https://builds.apache.org/job/beam_PostCommit_Python_VR_Flink/ws/src/sdks/go>
:beam-sdks-python-container:resolveBuildDependencies (Thread[Task worker for ':' Thread 4,5,main]) completed. Took 0.446 secs.
:beam-sdks-python-container:installDependencies (Thread[Task worker for ':' Thread 4,5,main]) started.
> Task :beam-sdks-python-container:installDependencies
Caching disabled for task ':beam-sdks-python-container:installDependencies': Caching has not been enabled for the task
Task ':beam-sdks-python-container:installDependencies' is not up-to-date because:
Task has not declared any outputs despite executing actions.
Cache <https://builds.apache.org/job/beam_PostCommit_Python_VR_Flink/ws/src/sdks/python/container/.gogradle/cache/VendorSnapshot-0.10.bin> not found, skip.
:beam-sdks-python-container:installDependencies (Thread[Task worker for ':' Thread 4,5,main]) completed. Took 0.582 secs.
:beam-sdks-python-container:buildLinuxAmd64 (Thread[Task worker for ':' Thread 4,5,main]) started.
> Task :beam-sdks-python-container:buildLinuxAmd64
Build cache key for task ':beam-sdks-python-container:buildLinuxAmd64' is 26b7bb59941067f441283cccdd7f52f8
Caching disabled for task ':beam-sdks-python-container:buildLinuxAmd64': Caching has not been enabled for the task
Task ':beam-sdks-python-container:buildLinuxAmd64' is not up-to-date because:
No history is available.
:beam-sdks-python-container:buildLinuxAmd64 (Thread[Task worker for ':' Thread 4,5,main]) completed. Took 3.027 secs.
:beam-sdks-python-container:build (Thread[Task worker for ':' Thread 4,5,main]) started.
> Task :beam-sdks-python-container:build
Caching disabled for task ':beam-sdks-python-container:build': Caching has not been enabled for the task
Task ':beam-sdks-python-container:build' is not up-to-date because:
Task has not declared any outputs despite executing actions.
:beam-sdks-python-container:build (Thread[Task worker for ':' Thread 4,5,main]) completed. Took 0.001 secs.
:beam-sdks-python-container:copyDockerfileDependencies (Thread[Task worker for ':' Thread 4,5,main]) started.
> Task :beam-sdks-python-container:copyDockerfileDependencies
Build cache key for task ':beam-sdks-python-container:copyDockerfileDependencies' is e70226e5319ddcfe9f562509bb5aa89a
Caching disabled for task ':beam-sdks-python-container:copyDockerfileDependencies': Caching has not been enabled for the task
Task ':beam-sdks-python-container:copyDockerfileDependencies' is not up-to-date because:
No history is available.
:beam-sdks-python-container:copyDockerfileDependencies (Thread[Task worker for ':' Thread 4,5,main]) completed. Took 0.031 secs.
:beam-sdks-python-container:dockerPrepare (Thread[Task worker for ':' Thread 4,5,main]) started.
> Task :beam-sdks-python-container:dockerPrepare
Build cache key for task ':beam-sdks-python-container:dockerPrepare' is afaff3af086d0169bb6708bb835dc8dd
Caching disabled for task ':beam-sdks-python-container:dockerPrepare': Caching has not been enabled for the task
Task ':beam-sdks-python-container:dockerPrepare' is not up-to-date because:
No history is available.
:beam-sdks-python-container:dockerPrepare (Thread[Task worker for ':' Thread 4,5,main]) completed. Took 0.095 secs.
:beam-sdks-python-container:docker (Thread[Task worker for ':' Thread 4,5,main]) started.
> Task :beam-sdks-python-container:docker
Caching disabled for task ':beam-sdks-python-container:docker': Caching has not been enabled for the task
Task ':beam-sdks-python-container:docker' is not up-to-date because:
Task has not declared any outputs despite executing actions.
Starting process 'command 'docker''. Working directory: <https://builds.apache.org/job/beam_PostCommit_Python_VR_Flink/ws/src/sdks/python/container/build/docker> Command: docker build --no-cache -t jenkins-docker-apache.bintray.io/beam/python:latest .
Successfully started process 'command 'docker''
Sending build context to Docker daemon 17.64MB
Step 1/9 : FROM python:2-stretch
---> 3c43a5d4034a
Step 2/9 : MAINTAINER "Apache Beam <de...@beam.apache.org>"
> Task :beam-sdks-java-harness:shadowJar
*******************
GRADLE SHADOW STATS
Total Jars: 43 (includes project)
Total Time: 36.712s [36712ms]
Average Time/Jar: 0.8537674418604999s [853.7674418605ms]
*******************
:beam-sdks-java-harness:shadowJar (Thread[Task worker for ':' Thread 2,5,main]) completed. Took 37.151 secs.
:beam-runners-java-fn-execution:compileJava (Thread[Task worker for ':' Thread 2,5,main]) started.
> Task :beam-sdks-python-container:docker FAILED
---> Running in 039f59d31559
---> 91055552d2da
Removing intermediate container 039f59d31559
Step 3/9 : RUN apt-get update && apt-get install -y libsnappy-dev libyaml-dev && rm -rf /var/lib/apt/lists/*
---> Running in 8a8d6f45af72
grpc: the connection is unavailable
:beam-sdks-python-container:docker (Thread[Task worker for ':' Thread 4,5,main]) completed. Took 3.735 secs.
> Task :beam-runners-java-fn-execution:compileJava
Build cache key for task ':beam-runners-java-fn-execution:compileJava' is 34fa842cde4493338d6dd0e72222f4b1
Task ':beam-runners-java-fn-execution:compileJava' is not up-to-date because:
No history is available.
Custom actions are attached to task ':beam-runners-java-fn-execution:compileJava'.
All input files are considered out-of-date for incremental task ':beam-runners-java-fn-execution:compileJava'.
Full recompilation is required because no incremental change information is available. This is usually caused by clean builds or changing compiler arguments.
Compiling with error-prone compiler
Note: <https://builds.apache.org/job/beam_PostCommit_Python_VR_Flink/ws/src/runners/java-fn-execution/src/main/java/org/apache/beam/runners/fnexecution/ServerFactory.java> uses or overrides a deprecated API.
Note: Recompile with -Xlint:deprecation for details.
Note: Some input files use unchecked or unsafe operations.
Note: Recompile with -Xlint:unchecked for details.
Created classpath snapshot for incremental compilation in 4.159 secs. 26885 duplicate classes found in classpath (see all with --debug).
Packing task ':beam-runners-java-fn-execution:compileJava'
:beam-runners-java-fn-execution:compileJava (Thread[Task worker for ':' Thread 2,5,main]) completed. Took 15.178 secs.
:beam-runners-java-fn-execution:classes (Thread[Task worker for ':' Thread 2,5,main]) started.
> Task :beam-runners-java-fn-execution:classes
Skipping task ':beam-runners-java-fn-execution:classes' as it has no actions.
:beam-runners-java-fn-execution:classes (Thread[Task worker for ':' Thread 2,5,main]) completed. Took 0.0 secs.
:beam-runners-java-fn-execution:shadowJar (Thread[Task worker for ':' Thread 7,5,main]) started.
> Task :beam-runners-java-fn-execution:shadowJar
Build cache key for task ':beam-runners-java-fn-execution:shadowJar' is a5be21c6b58261f65b87308557f3eb98
Caching disabled for task ':beam-runners-java-fn-execution:shadowJar': Caching has not been enabled for the task
Task ':beam-runners-java-fn-execution:shadowJar' is not up-to-date because:
No history is available.
*******************
GRADLE SHADOW STATS
Total Jars: 2 (includes project)
Total Time: 2.365s [2365ms]
Average Time/Jar: 1.1825s [1182.5ms]
*******************
:beam-runners-java-fn-execution:shadowJar (Thread[Task worker for ':' Thread 7,5,main]) completed. Took 2.561 secs.
:beam-runners-flink_2.11:compileJava (Thread[Task worker for ':' Thread 7,5,main]) started.
> Task :beam-runners-flink_2.11:compileJava
Build cache key for task ':beam-runners-flink_2.11:compileJava' is 99222e6dec69b8d75b4132cacdeba3fd
Task ':beam-runners-flink_2.11:compileJava' is not up-to-date because:
No history is available.
Custom actions are attached to task ':beam-runners-flink_2.11:compileJava'.
All input files are considered out-of-date for incremental task ':beam-runners-flink_2.11:compileJava'.
Full recompilation is required because no incremental change information is available. This is usually caused by clean builds or changing compiler arguments.
Compiling with error-prone compiler
Note: Some input files use or override a deprecated API.
Note: Recompile with -Xlint:deprecation for details.
Note: Some input files use unchecked or unsafe operations.
Note: Recompile with -Xlint:unchecked for details.
Created classpath snapshot for incremental compilation in 1.355 secs. 6714 duplicate classes found in classpath (see all with --debug).
Packing task ':beam-runners-flink_2.11:compileJava'
:beam-runners-flink_2.11:compileJava (Thread[Task worker for ':' Thread 7,5,main]) completed. Took 11.896 secs.
:beam-runners-flink_2.11:classes (Thread[Task worker for ':' Thread 7,5,main]) started.
> Task :beam-runners-flink_2.11:classes
Skipping task ':beam-runners-flink_2.11:classes' as it has no actions.
:beam-runners-flink_2.11:classes (Thread[Task worker for ':' Thread 7,5,main]) completed. Took 0.0 secs.
:beam-runners-flink_2.11:shadowJar (Thread[Task worker for ':' Thread 7,5,main]) started.
> Task :beam-runners-flink_2.11:shadowJar
Build cache key for task ':beam-runners-flink_2.11:shadowJar' is c8cc1d65673defb3b606323ef1f1cc74
Caching disabled for task ':beam-runners-flink_2.11:shadowJar': Caching has not been enabled for the task
Task ':beam-runners-flink_2.11:shadowJar' is not up-to-date because:
No history is available.
*******************
GRADLE SHADOW STATS
Total Jars: 2 (includes project)
Total Time: 2.137s [2137ms]
Average Time/Jar: 1.0685s [1068.5ms]
*******************
:beam-runners-flink_2.11:shadowJar (Thread[Task worker for ':' Thread 7,5,main]) completed. Took 2.479 secs.
:beam-runners-flink_2.11-job-server:compileJava (Thread[Task worker for ':' Thread 7,5,main]) started.
> Task :beam-runners-flink_2.11-job-server:compileJava NO-SOURCE
file or directory '<https://builds.apache.org/job/beam_PostCommit_Python_VR_Flink/ws/src/runners/flink/job-server/src/main/java',> not found
Skipping task ':beam-runners-flink_2.11-job-server:compileJava' as it has no source files and no previous output files.
:beam-runners-flink_2.11-job-server:compileJava (Thread[Task worker for ':' Thread 7,5,main]) completed. Took 0.001 secs.
:beam-runners-flink_2.11-job-server:classes (Thread[Task worker for ':' Thread 7,5,main]) started.
> Task :beam-runners-flink_2.11-job-server:classes UP-TO-DATE
Skipping task ':beam-runners-flink_2.11-job-server:classes' as it has no actions.
:beam-runners-flink_2.11-job-server:classes (Thread[Task worker for ':' Thread 7,5,main]) completed. Took 0.0 secs.
:beam-runners-flink_2.11-job-server:shadowJar (Thread[Task worker for ':' Thread 7,5,main]) started.
> Task :beam-runners-flink_2.11-job-server:shadowJar
Build cache key for task ':beam-runners-flink_2.11-job-server:shadowJar' is 769bd294e29752f9480d79221f0ff3c0
Caching disabled for task ':beam-runners-flink_2.11-job-server:shadowJar': Caching has not been enabled for the task
Task ':beam-runners-flink_2.11-job-server:shadowJar' is not up-to-date because:
No history is available.
*******************
GRADLE SHADOW STATS
Total Jars: 85 (includes project)
Total Time: 16.881s [16881ms]
Average Time/Jar: 0.1986s [198.6ms]
*******************
:beam-runners-flink_2.11-job-server:shadowJar (Thread[Task worker for ':' Thread 7,5,main]) completed. Took 18.031 secs.
FAILURE: Build failed with an exception.
* What went wrong:
Execution failed for task ':beam-sdks-python-container:docker'.
> Process 'command 'docker'' finished with non-zero exit value 1
* Try:
Run with --stacktrace option to get the stack trace. Run with --debug option to get more log output. Run with --scan to get full insights.
* Get more help at https://help.gradle.org
Deprecated Gradle features were used in this build, making it incompatible with Gradle 5.0.
Use '--warning-mode all' to show the individual deprecation warnings.
See https://docs.gradle.org/4.10.2/userguide/command_line_interface.html#sec:command_line_warnings
BUILD FAILED in 2m 54s
57 actionable tasks: 52 executed, 4 from cache, 1 up-to-date
Publishing build scan...
https://gradle.com/s/3dofjto3mglqs
Build step 'Invoke Gradle script' changed build result to FAILURE
Build step 'Invoke Gradle script' marked build as failure