You are viewing a plain text version of this content. The canonical link for it is here.
Posted to builds@solr.apache.org by Apache Jenkins Server <je...@builds.apache.org> on 2024/10/21 12:02:33 UTC

[JENKINS] Solr » Solr-check-9.7 - Build # 88 - Failure!

Build: https://ci-builds.apache.org/job/Solr/job/Solr-check-9.7/88/

1 tests failed.
FAILED:  org.apache.solr.search.TestStressVersions.testStressGetRealtimeVersions

Error Message:
com.carrotsearch.randomizedtesting.UncaughtExceptionError: Captured an uncaught exception in thread: Thread[id=19172, name=READER6, state=RUNNABLE, group=TGRP-TestStressVersions]

Stack Trace:
com.carrotsearch.randomizedtesting.UncaughtExceptionError: Captured an uncaught exception in thread: Thread[id=19172, name=READER6, state=RUNNABLE, group=TGRP-TestStressVersions]
	at __randomizedtesting.SeedInfo.seed([A40DBCC398CF80EE:A109ADFCD5B384B2]:0)
Caused by: java.lang.RuntimeException: java.util.concurrent.RejectedExecutionException: Task org.apache.solr.common.util.ExecutorUtil$MDCAwareThreadPoolExecutor$$Lambda$385/0x0000000100572840@65bb6346 rejected from org.apache.solr.common.util.ExecutorUtil$MDCAwareThreadPoolExecutor@3b25932e[Running, pool size = 1, active threads = 1, queued tasks = 1000, completed tasks = 26248]
	at __randomizedtesting.SeedInfo.seed([A40DBCC398CF80EE]:0)
	at org.apache.solr.search.TestStressVersions$2.run(TestStressVersions.java:263)
Caused by: java.util.concurrent.RejectedExecutionException: Task org.apache.solr.common.util.ExecutorUtil$MDCAwareThreadPoolExecutor$$Lambda$385/0x0000000100572840@65bb6346 rejected from org.apache.solr.common.util.ExecutorUtil$MDCAwareThreadPoolExecutor@3b25932e[Running, pool size = 1, active threads = 1, queued tasks = 1000, completed tasks = 26248]
	at java.base/java.util.concurrent.ThreadPoolExecutor$AbortPolicy.rejectedExecution(ThreadPoolExecutor.java:2055)
	at java.base/java.util.concurrent.ThreadPoolExecutor.reject(ThreadPoolExecutor.java:825)
	at java.base/java.util.concurrent.ThreadPoolExecutor.execute(ThreadPoolExecutor.java:1355)
	at org.apache.solr.common.util.ExecutorUtil$MDCAwareThreadPoolExecutor.execute(ExecutorUtil.java:430)
	at org.apache.lucene.search.TaskExecutor$TaskGroup.invokeAll(TaskExecutor.java:152)
	at org.apache.lucene.search.TaskExecutor.invokeAll(TaskExecutor.java:76)
	at org.apache.lucene.index.TermStates.build(TermStates.java:116)
	at org.apache.lucene.search.TermQuery.createWeight(TermQuery.java:275)
	at org.apache.lucene.search.IndexSearcher.createWeight(IndexSearcher.java:882)
	at org.apache.lucene.search.IndexSearcher.search(IndexSearcher.java:560)
	at org.apache.solr.search.SolrIndexSearcher.buildAndRunCollectorChain(SolrIndexSearcher.java:276)
	at org.apache.solr.search.SolrIndexSearcher.getDocListNC(SolrIndexSearcher.java:1932)
	at org.apache.solr.search.SolrIndexSearcher.getDocListC(SolrIndexSearcher.java:1729)
	at org.apache.solr.search.SolrIndexSearcher.search(SolrIndexSearcher.java:726)
	at org.apache.solr.search.SolrIndexSearcher.search(SolrIndexSearcher.java:721)
	at org.apache.solr.handler.component.QueryComponent.doProcessUngroupedSearch(QueryComponent.java:1690)
	at org.apache.solr.handler.component.QueryComponent.process(QueryComponent.java:432)
	at org.apache.solr.handler.component.SearchHandler.handleRequestBody(SearchHandler.java:456)
	at org.apache.solr.handler.RequestHandlerBase.handleRequest(RequestHandlerBase.java:226)
	at org.apache.solr.core.SolrCore.execute(SolrCore.java:2880)
	at org.apache.solr.util.TestHarness.query(TestHarness.java:355)
	at org.apache.solr.util.TestHarness.query(TestHarness.java:335)
	at org.apache.solr.search.TestStressVersions$2.run(TestStressVersions.java:240)




Build Log:
[...truncated 15279 lines...]
#   ERROR: Error from server at https://localhost:46543/solr/admin/collections?action=CREATE&name=test&collection.configName=test&numShards=2&nrtReplicas=1&wt=json&version=2.2: Underlying core creation failed while creating collection: test
# --
# 
# Please find the SOLR_HOME snapshot for failed test #7 at: /home/jenkins/jenkins-slave/workspace/Solr/Solr-check-9.7/solr/packaging/build/test-output/failure-snapshots/76-7
# Last output:
# INFO  - 2024-10-21 12:00:09.330; org.apache.solr.util.configuration.SSLConfigurations; Setting javax.net.ssl.keyStorePassword
# INFO  - 2024-10-21 12:00:09.334; org.apache.solr.util.configuration.SSLConfigurations; Setting javax.net.ssl.trustStorePassword
# WARN  - 2024-10-21 12:00:10.818; org.apache.solr.common.cloud.SolrZkClient; Using default ZkCredentialsInjector. ZkCredentialsInjector is not secure, it creates an empty list of credentials which leads to 'OPEN_ACL_UNSAFE' ACLs to Zookeeper nodes
# WARN  - 2024-10-21 12:00:14.300; org.apache.solr.common.cloud.SolrZkClient; Using default ZkACLProvider. DefaultZkACLProvider is not secure, it creates 'OPEN_ACL_UNSAFE' ACLs to Zookeeper nodes
ok 77 SOLR-11740 check 'solr stop' connection # in 13899 ms
ok 78 stop command for single port # in 19028 ms
ok 79 status detects locally running solr # in 8048 ms
ok 80 running subcommands with zk is prevented # in 265 ms
ok 81 listing out files # in 6414 ms
ok 82 connecting to solr via various solr urls and zk hosts # in 14460 ms
ok 83 copying files around # in 19421 ms
ok 84 upconfig # in 4150 ms
ok 85 zkcli.sh gets 'solrhome' from 'solr.home' system property # in 1246 ms
ok 86 zkcli.sh gets 'solrhome' from 'solrhome' command line option # in 1245 ms
ok 87 bin/solr zk cp gets 'solrhome' from '--solr-home' command line option # in 3864 ms
ok 88 Cleanup # in 1347 ms

> Task :solr:packaging:integrationTests FAILED
ERROR: The following test(s) have failed:
  - org.apache.solr.search.TestStressVersions.testStressGetRealtimeVersions (:solr:core)
    Test history: https://ge.apache.org/scans/tests?search.rootProjectNames=solr-root&tests.container=org.apache.solr.search.TestStressVersions&tests.test=testStressGetRealtimeVersions http://fucit.org/solr-jenkins-reports/history-trend-of-recent-failures.html#series/org.apache.solr.search.TestStressVersions.testStressGetRealtimeVersions
    Test output: /home/jenkins/jenkins-slave/workspace/Solr/Solr-check-9.7/solr/core/build/test-results/test/outputs/OUTPUT-org.apache.solr.search.TestStressVersions.txt
    Reproduce with: ./gradlew :solr:core:test --tests "org.apache.solr.search.TestStressVersions.testStressGetRealtimeVersions" -Ptests.jvms=4 -Ptests.haltonfailure=false "-Ptests.jvmargs=-XX:TieredStopAtLevel=1 -XX:+UseParallelGC -XX:ActiveProcessorCount=1 -XX:ReservedCodeCacheSize=120m" -Ptests.seed=A40DBCC398CF80EE -Ptests.multiplier=2 -Ptests.badapples=false -Ptests.file.encoding=ISO-8859-1


FAILURE: Build failed with an exception.

* Where:
Build file '/home/jenkins/jenkins-slave/workspace/Solr/Solr-check-9.7/solr/packaging/build.gradle' line: 302

* What went wrong:
Execution failed for task ':solr:packaging:integrationTests'.
> Process 'command '/home/jenkins/jenkins-slave/workspace/Solr/Solr-check-9.7/.gradle/node/packaging/node_modules/bats/bin/bats'' finished with non-zero exit value 1

* Try:
> Run with --stacktrace option to get the stack trace.
> Run with --info or --debug option to get more log output.
> Get more help at https://help.gradle.org.

Deprecated Gradle features were used in this build, making it incompatible with Gradle 9.0.

You can use '--warning-mode all' to show the individual deprecation warnings and determine if they come from your own scripts or plugins.

For more on this, please refer to https://docs.gradle.org/8.4/userguide/command_line_interface.html#sec:command_line_warnings in the Gradle documentation.

BUILD FAILED in 1h 10m 58s
694 actionable tasks: 694 executed

Publishing build scan...
https://ge.apache.org/s/twbcic673zam6

Build step 'Invoke Gradle script' changed build result to FAILURE
Build step 'Invoke Gradle script' marked build as failure
Archiving artifacts
Recording test results
[Checks API] No suitable checks publisher found.
Email was triggered for: Failure - Any
Sending email for trigger: Failure - Any