You are viewing a plain text version of this content. The canonical link for it is here.
Posted to builds@beam.apache.org by Apache Jenkins Server <je...@builds.apache.org> on 2022/02/14 18:39:26 UTC
Build failed in Jenkins: beam_PostCommit_Java_PVR_Samza #1059
See <https://ci-beam.apache.org/job/beam_PostCommit_Java_PVR_Samza/1059/display/redirect?page=changes>
Changes:
[noreply] Update 2.36.0 blog post to mention ARM64 support
[noreply] Minor: Disable checker framework in nightly snapshot (#16829)
[noreply] [BEAM-13860] Make `DoFn.infer_output_type` return element type (#16788)
------------------------------------------
[...truncated 12.14 KB...]
> Task :sdks:java:harness:processResources NO-SOURCE
> Task :sdks:java:core:generateAvroJava NO-SOURCE
> Task :runners:core-construction-java:processResources NO-SOURCE
> Task :runners:core-java:processResources NO-SOURCE
> Task :runners:core-construction-java:processTestResources NO-SOURCE
> Task :model:job-management:extractProto
> Task :model:fn-execution:extractProto
> Task :runners:core-java:processTestResources NO-SOURCE
> Task :sdks:java:io:kafka:createCheckerFrameworkManifest
> Task :runners:samza:createCheckerFrameworkManifest
> Task :sdks:java:io:kafka:processResources NO-SOURCE
> Task :runners:portability:java:createCheckerFrameworkManifest
> Task :runners:portability:java:processResources NO-SOURCE
> Task :release:go-licenses:java:copyLicenses
> Task :sdks:java:container:java8:copyLicenses
> Task :release:go-licenses:java:dockerClean UP-TO-DATE
> Task :runners:portability:java:processTestResources NO-SOURCE
> Task :sdks:java:container:java8:dockerClean UP-TO-DATE
> Task :runners:samza:processResources
> Task :model:job-management:processResources
> Task :release:go-licenses:java:dockerPrepare
> Task :model:fn-execution:processResources
> Task :runners:samza:processTestResources
> Task :sdks:java:container:downloadCloudProfilerAgent
version.txt
NOTICES
profiler_java_agent.so
> Task :sdks:java:core:generateGrammarSource FROM-CACHE
> Task :sdks:java:core:processResources
> Task :sdks:java:core:generateTestAvroProtocol NO-SOURCE
> Task :sdks:java:core:generateTestAvroJava
> Task :sdks:java:core:generateTestGrammarSource NO-SOURCE
> Task :sdks:java:core:processTestResources
> Task :model:pipeline:extractIncludeProto
> Task :model:pipeline:extractProto
> Task :model:pipeline:generateProto FROM-CACHE
> Task :model:pipeline:compileJava FROM-CACHE
> Task :model:pipeline:processResources
> Task :model:pipeline:classes
> Task :sdks:java:container:goPrepare UP-TO-DATE
> Task :model:pipeline:jar
> Task :model:pipeline:shadowJar FROM-CACHE
> Task :model:fn-execution:extractIncludeProto
> Task :model:job-management:extractIncludeProto
> Task :model:job-management:generateProto FROM-CACHE
> Task :model:fn-execution:generateProto FROM-CACHE
> Task :sdks:java:container:goBuild
/home/jenkins/go/bin/go1.16.12 build -o ./build/target/linux_amd64/boot boot.go
> Task :sdks:java:container:java8:copySdkHarnessLauncher
Execution optimizations have been disabled for task ':sdks:java:container:java8:copySdkHarnessLauncher' to ensure correctness due to the following reasons:
- Gradle detected a problem with the following location: '/home/jenkins/jenkins-slave/workspace/beam_PostCommit_Java_PVR_Samza/src/sdks/java/container/build/target'. Reason: Task ':sdks:java:container:java8:copySdkHarnessLauncher' uses this output of task ':sdks:java:container:downloadCloudProfilerAgent' without declaring an explicit or implicit dependency. This can lead to incorrect results being produced, depending on what order the tasks are executed. Please refer to https://docs.gradle.org/7.3.2/userguide/validation_problems.html#implicit_dependency for more details about this problem.
> Task :model:job-management:compileJava FROM-CACHE
> Task :model:job-management:classes
> Task :model:fn-execution:compileJava FROM-CACHE
> Task :model:fn-execution:classes
> Task :release:go-licenses:java:docker
Sending build context to Docker daemon 5.12kB
Step 1/6 : FROM golang:1.16-bullseye
---> 221c5472423f
Step 2/6 : RUN go get github.com/google/go-licenses
---> Using cache
---> a4f9b240115f
Step 3/6 : COPY get-licenses.sh /opt/apache/beam/
---> Using cache
---> fc2820590cec
Step 4/6 : ARG sdk_location
---> Using cache
---> ed8aa583fe39
Step 5/6 : ENV sdk_location=$sdk_location
---> Using cache
---> 4fd7eccc1b7b
Step 6/6 : ENTRYPOINT /opt/apache/beam/get-licenses.sh
---> Using cache
---> 4c5dfb2133c9
Successfully built 4c5dfb2133c9
Successfully tagged golicenses-java:latest
> Task :model:job-management:shadowJar FROM-CACHE
> Task :model:fn-execution:shadowJar FROM-CACHE
> Task :sdks:java:container:generateLicenseReport
> Task :release:go-licenses:java:dockerRun
+ rm -rf '/output/*'
+ export GO111MODULE=off
+ GO111MODULE=off
+ go get github.com/apache/beam/sdks/java/container
> Task :sdks:java:core:compileJava FROM-CACHE
> Task :sdks:java:core:classes
> Task :sdks:java:container:pullLicenses
Copying already-fetched licenses from /home/jenkins/jenkins-slave/workspace/beam_PostCommit_Java_PVR_Samza/src/sdks/java/container/build/reports/dependency-license to /home/jenkins/jenkins-slave/workspace/beam_PostCommit_Java_PVR_Samza/src/sdks/java/container/build/target/java_third_party_licenses
> Task :sdks:java:core:shadowJar FROM-CACHE
> Task :sdks:java:core:jar
> Task :sdks:java:fn-execution:compileJava FROM-CACHE
> Task :sdks:java:fn-execution:classes UP-TO-DATE
> Task :sdks:java:fn-execution:jar
> Task :runners:core-construction-java:compileJava FROM-CACHE
> Task :runners:core-construction-java:classes UP-TO-DATE
> Task :runners:core-construction-java:jar
> Task :runners:core-java:compileJava FROM-CACHE
> Task :runners:core-java:classes UP-TO-DATE
> Task :runners:core-java:jar
> Task :sdks:java:extensions:google-cloud-platform-core:compileJava FROM-CACHE
> Task :sdks:java:extensions:google-cloud-platform-core:classes UP-TO-DATE
> Task :sdks:java:extensions:google-cloud-platform-core:jar
> Task :sdks:java:harness:compileJava FROM-CACHE
> Task :sdks:java:harness:classes UP-TO-DATE
> Task :sdks:java:harness:jar
> Task :sdks:java:core:compileTestJava FROM-CACHE
> Task :sdks:java:core:testClasses
> Task :runners:java-fn-execution:compileJava FROM-CACHE
> Task :runners:java-fn-execution:classes UP-TO-DATE
> Task :sdks:java:core:shadowTestJar FROM-CACHE
> Task :runners:java-fn-execution:jar
> Task :sdks:java:container:pullLicenses
Collecting pip
Using cached pip-22.0.3-py3-none-any.whl (2.1 MB)
> Task :sdks:java:expansion-service:compileJava FROM-CACHE
> Task :sdks:java:expansion-service:classes UP-TO-DATE
> Task :sdks:java:expansion-service:jar
> Task :runners:java-job-service:compileJava FROM-CACHE
> Task :runners:java-job-service:classes UP-TO-DATE
> Task :runners:java-job-service:jar
> Task :sdks:java:io:kafka:compileJava FROM-CACHE
> Task :sdks:java:io:kafka:classes UP-TO-DATE
> Task :sdks:java:io:kafka:jar
> Task :runners:samza:compileJava FROM-CACHE
> Task :runners:samza:classes
> Task :runners:samza:jar
> Task :runners:core-java:compileTestJava FROM-CACHE
> Task :runners:core-java:testClasses UP-TO-DATE
> Task :runners:core-java:testJar
> Task :runners:samza:compileTestJava FROM-CACHE
> Task :runners:samza:testClasses
> Task :runners:samza:testJar
> Task :runners:core-construction-java:compileTestJava FROM-CACHE
> Task :runners:core-construction-java:testClasses UP-TO-DATE
> Task :runners:core-construction-java:testJar
> Task :sdks:java:harness:shadowJar FROM-CACHE
> Task :sdks:java:container:pullLicenses
Collecting setuptools
Using cached setuptools-60.9.0-py3-none-any.whl (1.1 MB)
Collecting wheel
Using cached wheel-0.37.1-py2.py3-none-any.whl (35 kB)
Installing collected packages: pip, setuptools, wheel
Attempting uninstall: pip
Found existing installation: pip 20.0.2
Uninstalling pip-20.0.2:
Successfully uninstalled pip-20.0.2
> Task :sdks:java:container:java8:copyDockerfileDependencies
> Task :sdks:java:container:pullLicenses
Attempting uninstall: setuptools
Found existing installation: setuptools 44.0.0
Uninstalling setuptools-44.0.0:
Successfully uninstalled setuptools-44.0.0
Successfully installed pip-22.0.3 setuptools-60.9.0 wheel-0.37.1
Collecting beautifulsoup4<5.0,>=4.9.0
Using cached beautifulsoup4-4.10.0-py3-none-any.whl (97 kB)
Collecting pyyaml<6.0.0,>=3.12
Using cached PyYAML-5.4.1-cp38-cp38-manylinux1_x86_64.whl (662 kB)
Collecting tenacity<6.0,>=5.0.2
Using cached tenacity-5.1.5-py2.py3-none-any.whl (34 kB)
Collecting soupsieve>1.2
Using cached soupsieve-2.3.1-py3-none-any.whl (37 kB)
Collecting six>=1.9.0
Using cached six-1.16.0-py2.py3-none-any.whl (11 kB)
Installing collected packages: soupsieve, six, pyyaml, tenacity, beautifulsoup4
> Task :runners:portability:java:compileJava FROM-CACHE
> Task :runners:portability:java:classes UP-TO-DATE
> Task :runners:portability:java:jar
> Task :runners:portability:java:compileTestJava FROM-CACHE
> Task :runners:portability:java:testClasses UP-TO-DATE
> Task :runners:portability:java:testJar
> Task :sdks:java:container:pullLicenses
Successfully installed beautifulsoup4-4.10.0 pyyaml-5.4.1 six-1.16.0 soupsieve-2.3.1 tenacity-5.1.5
Executing python /home/jenkins/jenkins-slave/workspace/beam_PostCommit_Java_PVR_Samza/src/sdks/java/container/license_scripts/pull_licenses_java.py --license_index=/home/jenkins/jenkins-slave/workspace/beam_PostCommit_Java_PVR_Samza/src/sdks/java/container/build/reports/dependency-license/index.json --output_dir=/home/jenkins/jenkins-slave/workspace/beam_PostCommit_Java_PVR_Samza/src/sdks/java/container/build/target/java_third_party_licenses --dep_url_yaml=/home/jenkins/jenkins-slave/workspace/beam_PostCommit_Java_PVR_Samza/src/sdks/java/container/license_scripts/dep_urls_java.yaml --manual_license_path=/home/jenkins/jenkins-slave/workspace/beam_PostCommit_Java_PVR_Samza/src/sdks/java/container/license_scripts/manual_licenses
INFO:root:Pulling license for 220 dependencies using 16 threads.
INFO:root:Replaced local file URL with file:///home/jenkins/jenkins-slave/workspace/beam_PostCommit_Java_PVR_Samza/src/sdks/java/container/license_scripts/manual_licenses/xz/COPYING for xz-1.5
INFO:root:pull_licenses_java.py succeed. It took 20.759175 seconds with 16 threads.
Copying licenses from /home/jenkins/jenkins-slave/workspace/beam_PostCommit_Java_PVR_Samza/src/sdks/java/container/build/target/java_third_party_licenses to /home/jenkins/jenkins-slave/workspace/beam_PostCommit_Java_PVR_Samza/src/sdks/java/container/build/target/third_party_licenses.
Finished license_scripts.sh
> Task :sdks:java:container:java8:copyJavaThirdPartyLicenses
> Task :runners:samza:job-server:validatesPortableRunnerEmbedded
> Task :release:go-licenses:java:dockerRun
+ go-licenses save github.com/apache/beam/sdks/java/container --save_path=/output/licenses
+ go-licenses csv github.com/apache/beam/sdks/java/container
+ tee /output/licenses/list.csv
github.com/apache/beam/sdks/java/container,https://github.com/apache/beam/blob/master/LICENSE,Apache-2.0
google.golang.org/grpc,https://github.com/grpc/grpc-go/blob/master/LICENSE,Apache-2.0
github.com/golang/protobuf,https://github.com/golang/protobuf/blob/master/LICENSE,BSD-3-Clause
google.golang.org/protobuf,https://go.googlesource.com/protobuf/+/refs/heads/master/LICENSE,BSD-3-Clause
golang.org/x/text,https://go.googlesource.com/text/+/refs/heads/master/LICENSE,BSD-3-Clause
github.com/apache/beam/sdks/go/pkg/beam,https://github.com/apache/beam/blob/master/sdks/go/README.md,Apache-2.0
golang.org/x/net,https://go.googlesource.com/net/+/refs/heads/master/LICENSE,BSD-3-Clause
google.golang.org/genproto/googleapis/rpc/status,https://github.com/googleapis/go-genproto/blob/master/LICENSE,Apache-2.0
golang.org/x/sys,https://go.googlesource.com/sys/+/refs/heads/master/LICENSE,BSD-3-Clause
+ chmod -R a+w /output/licenses
> Task :release:go-licenses:java:createLicenses
> Task :sdks:java:container:java8:copyGolangLicenses
> Task :sdks:java:container:java8:dockerPrepare
> Task :sdks:java:container:java8:docker
FATAL: command execution failed
java.io.IOException: Backing channel 'apache-beam-jenkins-6' is disconnected.
at hudson.remoting.RemoteInvocationHandler.channelOrFail(RemoteInvocationHandler.java:216)
at hudson.remoting.RemoteInvocationHandler.invoke(RemoteInvocationHandler.java:286)
at com.sun.proxy.$Proxy133.isAlive(Unknown Source)
at hudson.Launcher$RemoteLauncher$ProcImpl.isAlive(Launcher.java:1211)
at hudson.Launcher$RemoteLauncher$ProcImpl.join(Launcher.java:1203)
at hudson.Launcher$ProcStarter.join(Launcher.java:523)
at hudson.plugins.gradle.Gradle.perform(Gradle.java:317)
at hudson.tasks.BuildStepMonitor$1.perform(BuildStepMonitor.java:20)
at hudson.model.AbstractBuild$AbstractBuildExecution.perform(AbstractBuild.java:803)
at hudson.model.Build$BuildExecution.build(Build.java:197)
at hudson.model.Build$BuildExecution.doRun(Build.java:163)
at hudson.model.AbstractBuild$AbstractBuildExecution.run(AbstractBuild.java:513)
at hudson.model.Run.execute(Run.java:1906)
at hudson.model.FreeStyleBuild.run(FreeStyleBuild.java:43)
at hudson.model.ResourceController.execute(ResourceController.java:97)
at hudson.model.Executor.run(Executor.java:429)
Caused by: java.io.IOException: Pipe closed after 0 cycles
at org.apache.sshd.common.channel.ChannelPipedInputStream.read(ChannelPipedInputStream.java:118)
at org.apache.sshd.common.channel.ChannelPipedInputStream.read(ChannelPipedInputStream.java:101)
at hudson.remoting.FlightRecorderInputStream.read(FlightRecorderInputStream.java:93)
at hudson.remoting.ChunkedInputStream.readHeader(ChunkedInputStream.java:74)
at hudson.remoting.ChunkedInputStream.readUntilBreak(ChunkedInputStream.java:104)
at hudson.remoting.ChunkedCommandTransport.readBlock(ChunkedCommandTransport.java:39)
at hudson.remoting.AbstractSynchronousByteArrayCommandTransport.read(AbstractSynchronousByteArrayCommandTransport.java:34)
at hudson.remoting.SynchronousCommandTransport$ReaderThread.run(SynchronousCommandTransport.java:61)
Build step 'Invoke Gradle script' changed build result to FAILURE
Build step 'Invoke Gradle script' marked build as failure
ERROR: apache-beam-jenkins-6 is offline; cannot locate jdk_1.8_latest
---------------------------------------------------------------------
To unsubscribe, e-mail: builds-unsubscribe@beam.apache.org
For additional commands, e-mail: builds-help@beam.apache.org