You are viewing a plain text version of this content. The canonical link for it is here.
Posted to builds@hbase.apache.org by Apache Jenkins Server <je...@builds.apache.org> on 2014/08/29 02:44:33 UTC

Build failed in Jenkins: HBase-0.98-on-Hadoop-1.1 #455

See <https://builds.apache.org/job/HBase-0.98-on-Hadoop-1.1/455/changes>

Changes:

[apurtell] HBASE-11844 region_mover.rb load enters an infinite loop if region already present on target server (Stephen Veiss)

------------------------------------------
[...truncated 32377 lines...]
	- locked <0x000000078c6667a8> (a sun.nio.ch.Util$2)
	- locked <0x000000078c666798> (a java.util.Collections$UnmodifiableSet)
	- locked <0x000000078c666680> (a sun.nio.ch.EPollSelectorImpl)
	at sun.nio.ch.SelectorImpl.select(SelectorImpl.java:98)
	at org.apache.hadoop.ipc.Server$Responder.doRunLoop(Server.java:835)
	at org.apache.hadoop.ipc.Server$Responder.run(Server.java:818)

"org.apache.hadoop.hdfs.server.blockmanagement.BlockManager$ReplicationMonitor@287cbb10" daemon prio=10 tid=0x00007f24f4e4f000 nid=0x1de9 waiting on condition [0x00007f24c668c000]
   java.lang.Thread.State: TIMED_WAITING (sleeping)
	at java.lang.Thread.sleep(Native Method)
	at org.apache.hadoop.hdfs.server.blockmanagement.BlockManager$ReplicationMonitor.run(BlockManager.java:3336)
	at java.lang.Thread.run(Thread.java:744)

"org.apache.hadoop.hdfs.server.blockmanagement.HeartbeatManager$Monitor@14dd2c34" daemon prio=10 tid=0x00007f24f4e4d800 nid=0x1de8 waiting on condition [0x00007f24c678d000]
   java.lang.Thread.State: TIMED_WAITING (sleeping)
	at java.lang.Thread.sleep(Native Method)
	at org.apache.hadoop.hdfs.server.blockmanagement.HeartbeatManager$Monitor.run(HeartbeatManager.java:307)
	at java.lang.Thread.run(Thread.java:744)

"org.apache.hadoop.hdfs.server.blockmanagement.DecommissionManager$Monitor@e39f6f1" daemon prio=10 tid=0x00007f24f4e4c800 nid=0x1de7 waiting on condition [0x00007f24c688e000]
   java.lang.Thread.State: TIMED_WAITING (sleeping)
	at java.lang.Thread.sleep(Native Method)
	at org.apache.hadoop.hdfs.server.blockmanagement.DecommissionManager$Monitor.run(DecommissionManager.java:76)
	at java.lang.Thread.run(Thread.java:744)

"org.apache.hadoop.hdfs.server.blockmanagement.PendingReplicationBlocks$PendingReplicationMonitor@56218d7e" daemon prio=10 tid=0x00007f24f4e4b800 nid=0x1de6 waiting on condition [0x00007f24c698f000]
   java.lang.Thread.State: TIMED_WAITING (sleeping)
	at java.lang.Thread.sleep(Native Method)
	at org.apache.hadoop.hdfs.server.blockmanagement.PendingReplicationBlocks$PendingReplicationMonitor.run(PendingReplicationBlocks.java:221)
	at java.lang.Thread.run(Thread.java:744)

"org.apache.hadoop.util.JvmPauseMonitor$Monitor@782a437c" daemon prio=10 tid=0x00007f24f4e3f000 nid=0x1ddc waiting on condition [0x00007f24c6b91000]
   java.lang.Thread.State: TIMED_WAITING (sleeping)
	at java.lang.Thread.sleep(Native Method)
	at org.apache.hadoop.util.JvmPauseMonitor$Monitor.run(JvmPauseMonitor.java:161)
	at java.lang.Thread.run(Thread.java:744)

"IPC Server idle connection scanner for port 43591" daemon prio=10 tid=0x00007f24f4e2b800 nid=0x1dda in Object.wait() [0x00007f24c6c92000]
   java.lang.Thread.State: TIMED_WAITING (on object monitor)
	at java.lang.Object.wait(Native Method)
	at java.util.TimerThread.mainLoop(Timer.java:552)
	- locked <0x000000078c662568> (a java.util.TaskQueue)
	at java.util.TimerThread.run(Timer.java:505)

"Socket Reader #1 for port 43591" prio=10 tid=0x00007f24f4e0a800 nid=0x1dd9 runnable [0x00007f24c6d93000]
   java.lang.Thread.State: RUNNABLE
	at sun.nio.ch.EPollArrayWrapper.epollWait(Native Method)
	at sun.nio.ch.EPollArrayWrapper.poll(EPollArrayWrapper.java:269)
	at sun.nio.ch.EPollSelectorImpl.doSelect(EPollSelectorImpl.java:79)
	at sun.nio.ch.SelectorImpl.lockAndDoSelect(SelectorImpl.java:87)
	- locked <0x000000078c64fe28> (a sun.nio.ch.Util$2)
	- locked <0x000000078c64fe18> (a java.util.Collections$UnmodifiableSet)
	- locked <0x000000078c64fcf0> (a sun.nio.ch.EPollSelectorImpl)
	at sun.nio.ch.SelectorImpl.select(SelectorImpl.java:98)
	at sun.nio.ch.SelectorImpl.select(SelectorImpl.java:102)
	at org.apache.hadoop.ipc.Server$Listener$Reader.doRunLoop(Server.java:616)
	- locked <0x000000078c666208> (a org.apache.hadoop.ipc.Server$Listener$Reader)
	at org.apache.hadoop.ipc.Server$Listener$Reader.run(Server.java:595)

"Timer-0" daemon prio=10 tid=0x00007f24f4d19800 nid=0x1d19 in Object.wait() [0x00007f24c6e94000]
   java.lang.Thread.State: TIMED_WAITING (on object monitor)
	at java.lang.Object.wait(Native Method)
	at java.util.TimerThread.mainLoop(Timer.java:552)
	- locked <0x000000078cff4910> (a java.util.TaskQueue)
	at java.util.TimerThread.run(Timer.java:505)

"957276189@qtp-1766863888-1 - Acceptor0 SelectChannelConnector@localhost:36926" daemon prio=10 tid=0x00007f24f4d11000 nid=0x1d0d runnable [0x00007f24c6f95000]
   java.lang.Thread.State: RUNNABLE
	at sun.nio.ch.EPollArrayWrapper.epollWait(Native Method)
	at sun.nio.ch.EPollArrayWrapper.poll(EPollArrayWrapper.java:269)
	at sun.nio.ch.EPollSelectorImpl.doSelect(EPollSelectorImpl.java:79)
	at sun.nio.ch.SelectorImpl.lockAndDoSelect(SelectorImpl.java:87)
	- locked <0x000000078c707d30> (a sun.nio.ch.Util$2)
	- locked <0x000000078c707d20> (a java.util.Collections$UnmodifiableSet)
	- locked <0x000000078c707cd8> (a sun.nio.ch.EPollSelectorImpl)
	at sun.nio.ch.SelectorImpl.select(SelectorImpl.java:98)
	at org.mortbay.io.nio.SelectorManager$SelectSet.doSelect(SelectorManager.java:498)
	at org.mortbay.io.nio.SelectorManager.doSelect(SelectorManager.java:192)
	at org.mortbay.jetty.nio.SelectChannelConnector.accept(SelectChannelConnector.java:124)
	at org.mortbay.jetty.AbstractConnector$Acceptor.run(AbstractConnector.java:708)
	at org.mortbay.thread.QueuedThreadPool$PoolThread.run(QueuedThreadPool.java:582)

"1648771547@qtp-1766863888-0" daemon prio=10 tid=0x00007f24f4d14000 nid=0x1d0c in Object.wait() [0x00007f24c7806000]
   java.lang.Thread.State: TIMED_WAITING (on object monitor)
	at java.lang.Object.wait(Native Method)
	- waiting on <0x000000078cfd3be0> (a org.mortbay.thread.QueuedThreadPool$PoolThread)
	at org.mortbay.thread.QueuedThreadPool$PoolThread.run(QueuedThreadPool.java:626)
	- locked <0x000000078cfd3be0> (a org.mortbay.thread.QueuedThreadPool$PoolThread)

"Timer for 'NameNode' metrics system" daemon prio=10 tid=0x00007f24f4c9b000 nid=0x1c4d in Object.wait() [0x00007f24c7096000]
   java.lang.Thread.State: TIMED_WAITING (on object monitor)
	at java.lang.Object.wait(Native Method)
	at java.util.TimerThread.mainLoop(Timer.java:552)
	- locked <0x000000078d00b6a8> (a java.util.TaskQueue)
	at java.util.TimerThread.run(Timer.java:505)

"process reaper" daemon prio=10 tid=0x00007f24f4999000 nid=0x1a9b waiting on condition [0x00007f24c783f000]
   java.lang.Thread.State: TIMED_WAITING (parking)
	at sun.misc.Unsafe.park(Native Method)
	- parking to wait for  <0x000000078c3dbd78> (a java.util.concurrent.SynchronousQueue$TransferStack)
	at java.util.concurrent.locks.LockSupport.parkNanos(LockSupport.java:226)
	at java.util.concurrent.SynchronousQueue$TransferStack.awaitFulfill(SynchronousQueue.java:460)
	at java.util.concurrent.SynchronousQueue$TransferStack.transfer(SynchronousQueue.java:359)
	at java.util.concurrent.SynchronousQueue.poll(SynchronousQueue.java:942)
	at java.util.concurrent.ThreadPoolExecutor.getTask(ThreadPoolExecutor.java:1068)
	at java.util.concurrent.ThreadPoolExecutor.runWorker(ThreadPoolExecutor.java:1130)
	at java.util.concurrent.ThreadPoolExecutor$Worker.run(ThreadPoolExecutor.java:615)
	at java.lang.Thread.run(Thread.java:744)

"Service Thread" daemon prio=10 tid=0x00007f24f4290000 nid=0x18c4 runnable [0x0000000000000000]
   java.lang.Thread.State: RUNNABLE

"C2 CompilerThread1" daemon prio=10 tid=0x00007f24f428e000 nid=0x18c2 waiting on condition [0x0000000000000000]
   java.lang.Thread.State: RUNNABLE

"C2 CompilerThread0" daemon prio=10 tid=0x00007f24f428b000 nid=0x18c1 waiting on condition [0x0000000000000000]
   java.lang.Thread.State: RUNNABLE

"Signal Dispatcher" daemon prio=10 tid=0x00007f24f4280800 nid=0x18c0 runnable [0x0000000000000000]
   java.lang.Thread.State: RUNNABLE

"Finalizer" daemon prio=10 tid=0x00007f24f426b000 nid=0x1896 in Object.wait() [0x00007f24ec7eb000]
   java.lang.Thread.State: WAITING (on object monitor)
	at java.lang.Object.wait(Native Method)
	at java.lang.ref.ReferenceQueue.remove(ReferenceQueue.java:135)
	- locked <0x000000078d0320d0> (a java.lang.ref.ReferenceQueue$Lock)
	at java.lang.ref.ReferenceQueue.remove(ReferenceQueue.java:151)
	at java.lang.ref.Finalizer$FinalizerThread.run(Finalizer.java:189)

"Reference Handler" daemon prio=10 tid=0x00007f24f4267000 nid=0x1895 in Object.wait() [0x00007f24ec8ec000]
   java.lang.Thread.State: WAITING (on object monitor)
	at java.lang.Object.wait(Native Method)
	at java.lang.Object.wait(Object.java:503)
	at java.lang.ref.Reference$ReferenceHandler.run(Reference.java:133)
	- locked <0x000000078d01bb88> (a java.lang.ref.Reference$Lock)

"main" prio=10 tid=0x00007f24f400a800 nid=0x186d in Object.wait() [0x00007f24fadcb000]
   java.lang.Thread.State: TIMED_WAITING (on object monitor)
	at java.lang.Object.wait(Native Method)
	at org.apache.hadoop.hbase.regionserver.wal.SyncFuture.get(SyncFuture.java:167)
	- locked <0x000000078d32eb08> (a org.apache.hadoop.hbase.regionserver.wal.SyncFuture)
	at org.apache.hadoop.hbase.regionserver.wal.FSHLog.blockOnSync(FSHLog.java:1421)
	at org.apache.hadoop.hbase.regionserver.wal.FSHLog.publishSyncThenBlockOnCompletion(FSHLog.java:1415)
	at org.apache.hadoop.hbase.regionserver.wal.FSHLog.sync(FSHLog.java:1538)
	at org.apache.hadoop.hbase.regionserver.wal.FSHLog.append(FSHLog.java:1168)
	at org.apache.hadoop.hbase.regionserver.wal.FSHLog.append(FSHLog.java:1103)
	at org.apache.hadoop.hbase.replication.regionserver.TestReplicationHLogReaderManager.appendToLogPlus(TestReplicationHLogReaderManager.java:198)
	at org.apache.hadoop.hbase.replication.regionserver.TestReplicationHLogReaderManager.test(TestReplicationHLogReaderManager.java:181)
	at sun.reflect.NativeMethodAccessorImpl.invoke0(Native Method)
	at sun.reflect.NativeMethodAccessorImpl.invoke(NativeMethodAccessorImpl.java:57)
	at sun.reflect.DelegatingMethodAccessorImpl.invoke(DelegatingMethodAccessorImpl.java:43)
	at java.lang.reflect.Method.invoke(Method.java:606)
	at org.junit.runners.model.FrameworkMethod$1.runReflectiveCall(FrameworkMethod.java:47)
	at org.junit.internal.runners.model.ReflectiveCallable.run(ReflectiveCallable.java:12)
	at org.junit.runners.model.FrameworkMethod.invokeExplosively(FrameworkMethod.java:44)
	at org.junit.internal.runners.statements.InvokeMethod.evaluate(InvokeMethod.java:17)
	at org.junit.internal.runners.statements.RunBefores.evaluate(RunBefores.java:26)
	at org.junit.internal.runners.statements.RunAfters.evaluate(RunAfters.java:27)
	at org.junit.runners.ParentRunner.runLeaf(ParentRunner.java:271)
	at org.junit.runners.BlockJUnit4ClassRunner.runChild(BlockJUnit4ClassRunner.java:70)
	at org.junit.runners.BlockJUnit4ClassRunner.runChild(BlockJUnit4ClassRunner.java:50)
	at org.junit.runners.ParentRunner$3.run(ParentRunner.java:238)
	at org.junit.runners.ParentRunner$1.schedule(ParentRunner.java:63)
	at org.junit.runners.ParentRunner.runChildren(ParentRunner.java:236)
	at org.junit.runners.ParentRunner.access$000(ParentRunner.java:53)
	at org.junit.runners.ParentRunner$2.evaluate(ParentRunner.java:229)
	at org.junit.runners.ParentRunner.run(ParentRunner.java:309)
	at org.junit.runners.Suite.runChild(Suite.java:127)
	at org.junit.runners.Suite.runChild(Suite.java:26)
	at org.junit.runners.ParentRunner$3.run(ParentRunner.java:238)
	at org.junit.runners.ParentRunner$1.schedule(ParentRunner.java:63)
	at org.junit.runners.ParentRunner.runChildren(ParentRunner.java:236)
	at org.junit.runners.ParentRunner.access$000(ParentRunner.java:53)
	at org.junit.runners.ParentRunner$2.evaluate(ParentRunner.java:229)
	at org.junit.internal.runners.statements.RunBefores.evaluate(RunBefores.java:26)
	at org.junit.internal.runners.statements.RunAfters.evaluate(RunAfters.java:27)
	at org.junit.runners.ParentRunner.run(ParentRunner.java:309)
	at org.junit.runners.Suite.runChild(Suite.java:127)
	at org.junit.runners.Suite.runChild(Suite.java:26)
	at org.junit.runners.ParentRunner$3.run(ParentRunner.java:238)
	at org.junit.runners.ParentRunner$1.schedule(ParentRunner.java:63)
	at org.junit.runners.ParentRunner.runChildren(ParentRunner.java:236)
	at org.junit.runners.ParentRunner.access$000(ParentRunner.java:53)
	at org.junit.runners.ParentRunner$2.evaluate(ParentRunner.java:229)
	at org.junit.runners.ParentRunner.run(ParentRunner.java:309)
	at org.junit.runner.JUnitCore.run(JUnitCore.java:160)
	at org.junit.runner.JUnitCore.run(JUnitCore.java:138)
	at org.apache.maven.surefire.junitcore.JUnitCoreWrapper.createRequestAndRun(JUnitCoreWrapper.java:113)
	at org.apache.maven.surefire.junitcore.JUnitCoreWrapper.executeEager(JUnitCoreWrapper.java:85)
	at org.apache.maven.surefire.junitcore.JUnitCoreWrapper.execute(JUnitCoreWrapper.java:54)
	at org.apache.maven.surefire.junitcore.JUnitCoreProvider.invoke(JUnitCoreProvider.java:134)
	at org.apache.maven.surefire.booter.ForkedBooter.invokeProviderInSameClassLoader(ForkedBooter.java:200)
	at org.apache.maven.surefire.booter.ForkedBooter.runSuitesInProcess(ForkedBooter.java:153)
	at org.apache.maven.surefire.booter.ForkedBooter.main(ForkedBooter.java:103)

"VM Thread" prio=10 tid=0x00007f24f4264800 nid=0x1891 runnable 

"GC task thread#0 (ParallelGC)" prio=10 tid=0x00007f24f4020800 nid=0x1872 runnable 

"GC task thread#1 (ParallelGC)" prio=10 tid=0x00007f24f4022000 nid=0x1873 runnable 

"GC task thread#2 (ParallelGC)" prio=10 tid=0x00007f24f4024000 nid=0x1874 runnable 

"GC task thread#3 (ParallelGC)" prio=10 tid=0x00007f24f4026000 nid=0x1875 runnable 

"GC task thread#4 (ParallelGC)" prio=10 tid=0x00007f24f4027800 nid=0x1876 runnable 

"GC task thread#5 (ParallelGC)" prio=10 tid=0x00007f24f4029800 nid=0x1878 runnable 

"GC task thread#6 (ParallelGC)" prio=10 tid=0x00007f24f402b800 nid=0x1879 runnable 

"GC task thread#7 (ParallelGC)" prio=10 tid=0x00007f24f402d800 nid=0x187a runnable 

"GC task thread#8 (ParallelGC)" prio=10 tid=0x00007f24f402f000 nid=0x187b runnable 

"GC task thread#9 (ParallelGC)" prio=10 tid=0x00007f24f4031000 nid=0x187c runnable 

"GC task thread#10 (ParallelGC)" prio=10 tid=0x00007f24f4033000 nid=0x187d runnable 

"GC task thread#11 (ParallelGC)" prio=10 tid=0x00007f24f4034800 nid=0x187e runnable 

"GC task thread#12 (ParallelGC)" prio=10 tid=0x00007f24f4036800 nid=0x187f runnable 

"VM Periodic Task Thread" prio=10 tid=0x00007f24f429b000 nid=0x18c5 waiting on condition 

JNI global references: 325

+ echo '************ END  zombies jstack extract'
************ END  zombies jstack extract
+ JIRA_COMMENT='

     {color:red}-1 core zombie tests{color}.  There are 6 zombie test(s): 	at org.apache.hadoop.hbase.replication.TestMultiSlaveReplication.testMultiSlaveReplication(TestMultiSlaveReplication.java:124)
	at org.apache.hadoop.hbase.replication.regionserver.TestReplicationHLogReaderManager.test(TestReplicationHLogReaderManager.java:181)'
+ BAD=1
+ jps
+ grep surefirebooter
+ cut -d ' ' -f 1
+ xargs kill -9
POST BUILD TASK : SUCCESS
END OF POST BUILD TASK : 0
Archiving artifacts
Sending artifact delta relative to HBase-0.98-on-Hadoop-1.1 #454
Archived 1676 artifacts
Archive block size is 32768
Received 49 blocks and 380962284 bytes
Compression is 0.4%
Took 3 min 11 sec
Recording test results
Updating HBASE-11844

Jenkins build is back to normal : HBase-0.98-on-Hadoop-1.1 #457

Posted by Apache Jenkins Server <je...@builds.apache.org>.
See <https://builds.apache.org/job/HBase-0.98-on-Hadoop-1.1/457/changes>


Build failed in Jenkins: HBase-0.98-on-Hadoop-1.1 #456

Posted by Apache Jenkins Server <je...@builds.apache.org>.
See <https://builds.apache.org/job/HBase-0.98-on-Hadoop-1.1/456/changes>

Changes:

[apurtell] HBASE-11856 hbase-common needs a log4j.properties resource for handling unit test logging output

[apurtell] HBASE-11846 HStore#assertBulkLoadHFileOk should log if a full HFile verification will be performed during a bulkload (Esteban Gutierrez)

------------------------------------------
[...truncated 940 lines...]
[INFO] HBase - Client .................................... SUCCESS [39.819s]
[INFO] HBase - Hadoop Compatibility ...................... SUCCESS [5.728s]
[INFO] HBase - Hadoop One Compatibility .................. SUCCESS [1.667s]
[INFO] HBase - Prefix Tree ............................... SUCCESS [5.450s]
[INFO] HBase - Server .................................... FAILURE [5:06.377s]
[INFO] HBase - Testing Util .............................. SKIPPED
[INFO] HBase - Thrift .................................... SKIPPED
[INFO] HBase - Shell ..................................... SKIPPED
[INFO] HBase - Integration Tests ......................... SKIPPED
[INFO] HBase - Examples .................................. SKIPPED
[INFO] HBase - Assembly .................................. SKIPPED
[INFO] ------------------------------------------------------------------------
[INFO] BUILD FAILURE
[INFO] ------------------------------------------------------------------------
[INFO] Total time: 7:10.235s
[INFO] Finished at: Fri Aug 29 00:51:25 UTC 2014
[INFO] Final Memory: 54M/796M
[INFO] ------------------------------------------------------------------------
[ERROR] Failed to execute goal org.apache.maven.plugins:maven-surefire-plugin:2.12-TRUNK-HBASE-2:test (default-test) on project hbase-server: Error occurred in starting fork, check output in log -> [Help 1]
[ERROR] 
[ERROR] To see the full stack trace of the errors, re-run Maven with the -e switch.
[ERROR] Re-run Maven using the -X switch to enable full debug logging.
[ERROR] 
[ERROR] For more information about the errors and possible solutions, please read the following articles:
[ERROR] [Help 1] http://cwiki.apache.org/confluence/display/MAVEN/MojoExecutionException
[ERROR] 
[ERROR] After correcting the problems, you can resume the build with the command
[ERROR]   mvn <goals> -rf :hbase-server
Build step 'Invoke top-level Maven targets' marked build as failure
Performing Post build task...
Match found for :.* : True
Logical operation result is TRUE
Running script  :   ZOMBIE_TESTS_COUNT=`jps | grep surefirebooter | wc -l`
  if [[ $ZOMBIE_TESTS_COUNT != 0 ]] ; then
    #It seems sometimes the tests are not dying immediately. Let's give them 10s
    echo "Suspicious java process found - waiting 10s to see if there are just slow to stop"
    sleep 10
    ZOMBIE_TESTS_COUNT=`jps | grep surefirebooter | wc -l`
    if [[ $ZOMBIE_TESTS_COUNT != 0 ]] ; then
      echo "There are $ZOMBIE_TESTS_COUNT zombie tests, they should have been killed by surefire but survived"
      echo "************ BEGIN zombies jstack extract"
      ZB_STACK=`jps | grep surefirebooter | cut -d ' ' -f 1 | xargs -n 1 jstack | grep ".test" | grep "\.java"`
      jps | grep surefirebooter | cut -d ' ' -f 1 | xargs -n 1 jstack
      echo "************ END  zombies jstack extract"
      JIRA_COMMENT="$JIRA_COMMENT

     {color:red}-1 core zombie tests{color}.  There are ${ZOMBIE_TESTS_COUNT} zombie test(s): ${ZB_STACK}"
      BAD=1
      jps | grep surefirebooter | cut -d ' ' -f 1 | xargs kill -9
    else
      echo "We're ok: there is no zombie test, but some tests took some time to stop"
    fi
  else
    echo "We're ok: there is no zombie test"
  fi
[HBase-0.98-on-Hadoop-1.1] $ /bin/bash -xe /tmp/hudson5347610817653135128.sh
++ jps
++ grep surefirebooter
++ wc -l
+ ZOMBIE_TESTS_COUNT=1
+ [[ 1 != 0 ]]
+ echo 'Suspicious java process found - waiting 10s to see if there are just slow to stop'
Suspicious java process found - waiting 10s to see if there are just slow to stop
+ sleep 10
++ jps
++ grep surefirebooter
++ wc -l
+ ZOMBIE_TESTS_COUNT=1
+ [[ 1 != 0 ]]
+ echo 'There are 1 zombie tests, they should have been killed by surefire but survived'
There are 1 zombie tests, they should have been killed by surefire but survived
+ echo '************ BEGIN zombies jstack extract'
************ BEGIN zombies jstack extract
++ jps
++ cut -d ' ' -f 1
++ grep .test
++ grep surefirebooter
++ xargs -n 1 jstack
++ grep '\.java'
+ ZB_STACK='	at org.apache.hama.examples.LinearRegressionTest.testCorrectGDWithLinearRegressionExecution(LinearRegressionTest.java:28)'
+ jps
+ grep surefirebooter
+ cut -d ' ' -f 1
+ xargs -n 1 jstack
2014-08-29 00:51:39
Full thread dump Java HotSpot(TM) Server VM (23.25-b01 mixed mode):

"Attach Listener" daemon prio=10 tid=0xaa400c00 nid=0x2e88 waiting on condition [0x00000000]
   java.lang.Thread.State: RUNNABLE

"process reaper" daemon prio=10 tid=0xa9030c00 nid=0x2e34 waiting on condition [0xaaa20000]
   java.lang.Thread.State: TIMED_WAITING (parking)
	at sun.misc.Unsafe.park(Native Method)
	- parking to wait for  <0xe01000a8> (a java.util.concurrent.SynchronousQueue$TransferStack)
	at java.util.concurrent.locks.LockSupport.parkNanos(LockSupport.java:226)
	at java.util.concurrent.SynchronousQueue$TransferStack.awaitFulfill(SynchronousQueue.java:460)
	at java.util.concurrent.SynchronousQueue$TransferStack.transfer(SynchronousQueue.java:359)
	at java.util.concurrent.SynchronousQueue.poll(SynchronousQueue.java:942)
	at java.util.concurrent.ThreadPoolExecutor.getTask(ThreadPoolExecutor.java:1068)
	at java.util.concurrent.ThreadPoolExecutor.runWorker(ThreadPoolExecutor.java:1130)
	at java.util.concurrent.ThreadPoolExecutor$Worker.run(ThreadPoolExecutor.java:615)
	at java.lang.Thread.run(Thread.java:724)

"pool-1-thread-1" prio=10 tid=0xa99acc00 nid=0x2e32 waiting on condition [0xaa27d000]
   java.lang.Thread.State: TIMED_WAITING (sleeping)
	at java.lang.Thread.sleep(Native Method)
	at org.apache.hama.bsp.BSPJobClient.monitorAndPrintJob(BSPJobClient.java:635)
	at org.apache.hama.bsp.BSPJob.waitForCompletion(BSPJob.java:230)
	at org.apache.hama.examples.GradientDescentExample.main(GradientDescentExample.java:85)
	at org.apache.hama.examples.LinearRegressionTest.testCorrectGDWithLinearRegressionExecution(LinearRegressionTest.java:28)
	at sun.reflect.NativeMethodAccessorImpl.invoke0(Native Method)
	at sun.reflect.NativeMethodAccessorImpl.invoke(NativeMethodAccessorImpl.java:57)
	at sun.reflect.DelegatingMethodAccessorImpl.invoke(DelegatingMethodAccessorImpl.java:43)
	at java.lang.reflect.Method.invoke(Method.java:606)
	at org.junit.runners.model.FrameworkMethod$1.runReflectiveCall(FrameworkMethod.java:44)
	at org.junit.internal.runners.model.ReflectiveCallable.run(ReflectiveCallable.java:15)
	at org.junit.runners.model.FrameworkMethod.invokeExplosively(FrameworkMethod.java:41)
	at org.junit.internal.runners.statements.InvokeMethod.evaluate(InvokeMethod.java:20)
	at org.junit.runners.BlockJUnit4ClassRunner.runChild(BlockJUnit4ClassRunner.java:76)
	at org.junit.runners.BlockJUnit4ClassRunner.runChild(BlockJUnit4ClassRunner.java:50)
	at org.junit.runners.ParentRunner$3.run(ParentRunner.java:193)
	at org.junit.experimental.ParallelComputer$1$1.call(ParallelComputer.java:46)
	at java.util.concurrent.FutureTask$Sync.innerRun(FutureTask.java:334)
	at java.util.concurrent.FutureTask.run(FutureTask.java:166)
	at java.util.concurrent.ThreadPoolExecutor.runWorker(ThreadPoolExecutor.java:1145)
	at java.util.concurrent.ThreadPoolExecutor$Worker.run(ThreadPoolExecutor.java:615)
	at java.lang.Thread.run(Thread.java:724)

"Service Thread" daemon prio=10 tid=0xaa8f7c00 nid=0x2e30 runnable [0x00000000]
   java.lang.Thread.State: RUNNABLE

"C2 CompilerThread1" daemon prio=10 tid=0xaa8f6000 nid=0x2e2f waiting on condition [0x00000000]
   java.lang.Thread.State: RUNNABLE

"C2 CompilerThread0" daemon prio=10 tid=0xaa8f4000 nid=0x2e2e waiting on condition [0x00000000]
   java.lang.Thread.State: RUNNABLE

"Signal Dispatcher" daemon prio=10 tid=0xaa8f2400 nid=0x2e2d runnable [0x00000000]
   java.lang.Thread.State: RUNNABLE

"Finalizer" daemon prio=10 tid=0xaa8b7c00 nid=0x2e2c in Object.wait() [0xaec7d000]
   java.lang.Thread.State: WAITING (on object monitor)
	at java.lang.Object.wait(Native Method)
	- waiting on <0xe0100380> (a java.lang.ref.ReferenceQueue$Lock)
	at java.lang.ref.ReferenceQueue.remove(ReferenceQueue.java:135)
	- locked <0xe0100380> (a java.lang.ref.ReferenceQueue$Lock)
	at java.lang.ref.ReferenceQueue.remove(ReferenceQueue.java:151)
	at java.lang.ref.Finalizer$FinalizerThread.run(Finalizer.java:189)

"Reference Handler" daemon prio=10 tid=0xaa8b6000 nid=0x2e2b in Object.wait() [0xaef7d000]
   java.lang.Thread.State: WAITING (on object monitor)
	at java.lang.Object.wait(Native Method)
	- waiting on <0xe00e0068> (a java.lang.ref.Reference$Lock)
	at java.lang.Object.wait(Object.java:503)
	at java.lang.ref.Reference$ReferenceHandler.run(Reference.java:133)
	- locked <0xe00e0068> (a java.lang.ref.Reference$Lock)

"main" prio=10 tid=0xf6706400 nid=0x2e1c waiting on condition [0xf68a9000]
   java.lang.Thread.State: WAITING (parking)
	at sun.misc.Unsafe.park(Native Method)
	- parking to wait for  <0xe0100530> (a java.util.concurrent.FutureTask$Sync)
	at java.util.concurrent.locks.LockSupport.park(LockSupport.java:186)
	at java.util.concurrent.locks.AbstractQueuedSynchronizer.parkAndCheckInterrupt(AbstractQueuedSynchronizer.java:834)
	at java.util.concurrent.locks.AbstractQueuedSynchronizer.doAcquireSharedInterruptibly(AbstractQueuedSynchronizer.java:994)
	at java.util.concurrent.locks.AbstractQueuedSynchronizer.acquireSharedInterruptibly(AbstractQueuedSynchronizer.java:1303)
	at java.util.concurrent.FutureTask$Sync.innerGet(FutureTask.java:248)
	at java.util.concurrent.FutureTask.get(FutureTask.java:111)
	at org.junit.experimental.ParallelComputer$1.finished(ParallelComputer.java:55)
	at org.junit.runners.ParentRunner.runChildren(ParentRunner.java:196)
	at org.junit.runners.ParentRunner.access$000(ParentRunner.java:42)
	at org.junit.runners.ParentRunner$2.evaluate(ParentRunner.java:184)
	at org.junit.runners.ParentRunner.run(ParentRunner.java:236)
	at org.junit.runners.Suite.runChild(Suite.java:128)
	at org.junit.runners.Suite.runChild(Suite.java:24)
	at org.junit.runners.ParentRunner$3.run(ParentRunner.java:193)
	at org.junit.runners.ParentRunner$1.schedule(ParentRunner.java:52)
	at org.junit.runners.ParentRunner.runChildren(ParentRunner.java:191)
	at org.junit.runners.ParentRunner.access$000(ParentRunner.java:42)
	at org.junit.runners.ParentRunner$2.evaluate(ParentRunner.java:184)
	at org.junit.runners.ParentRunner.run(ParentRunner.java:236)
	at org.junit.runner.JUnitCore.run(JUnitCore.java:157)
	at org.junit.runner.JUnitCore.run(JUnitCore.java:136)
	at org.junit.runner.JUnitCore.run(JUnitCore.java:127)
	at org.apache.maven.surefire.junitcore.JUnitCoreTestSet.runJunitCore(JUnitCoreTestSet.java:208)
	at org.apache.maven.surefire.junitcore.JUnitCoreTestSet.execute(JUnitCoreTestSet.java:95)
	at org.apache.maven.surefire.junitcore.JUnitCoreTestSet.execute(JUnitCoreTestSet.java:82)
	at org.apache.maven.surefire.junitcore.JUnitCoreDirectoryTestSuite.execute(JUnitCoreDirectoryTestSuite.java:84)
	at org.apache.maven.surefire.Surefire.run(Surefire.java:104)
	at sun.reflect.NativeMethodAccessorImpl.invoke0(Native Method)
	at sun.reflect.NativeMethodAccessorImpl.invoke(NativeMethodAccessorImpl.java:57)
	at sun.reflect.DelegatingMethodAccessorImpl.invoke(DelegatingMethodAccessorImpl.java:43)
	at java.lang.reflect.Method.invoke(Method.java:606)
	at org.apache.maven.surefire.booter.SurefireBooter.runSuitesInProcess(SurefireBooter.java:290)
	at org.apache.maven.surefire.booter.SurefireBooter.main(SurefireBooter.java:1017)

"VM Thread" prio=10 tid=0xaa8b0400 nid=0x2e2a runnable 

"GC task thread#0 (ParallelGC)" prio=10 tid=0xf6710400 nid=0x2e1d runnable 

"GC task thread#1 (ParallelGC)" prio=10 tid=0xf6711c00 nid=0x2e1e runnable 

"GC task thread#2 (ParallelGC)" prio=10 tid=0xf6713400 nid=0x2e1f runnable 

"GC task thread#3 (ParallelGC)" prio=10 tid=0xf6714800 nid=0x2e20 runnable 

"GC task thread#4 (ParallelGC)" prio=10 tid=0xf6716000 nid=0x2e21 runnable 

"GC task thread#5 (ParallelGC)" prio=10 tid=0xf6717800 nid=0x2e22 runnable 

"GC task thread#6 (ParallelGC)" prio=10 tid=0xf6718c00 nid=0x2e23 runnable 

"GC task thread#7 (ParallelGC)" prio=10 tid=0xf671a400 nid=0x2e24 runnable 

"GC task thread#8 (ParallelGC)" prio=10 tid=0xf671bc00 nid=0x2e25 runnable 

"GC task thread#9 (ParallelGC)" prio=10 tid=0xf671d000 nid=0x2e26 runnable 

"GC task thread#10 (ParallelGC)" prio=10 tid=0xf671e800 nid=0x2e27 runnable 

"GC task thread#11 (ParallelGC)" prio=10 tid=0xf6720000 nid=0x2e28 runnable 

"GC task thread#12 (ParallelGC)" prio=10 tid=0xf6721800 nid=0x2e29 runnable 

"VM Periodic Task Thread" prio=10 tid=0xaa8f9800 nid=0x2e31 waiting on condition 

JNI global references: 299

+ echo '************ END  zombies jstack extract'
************ END  zombies jstack extract
+ JIRA_COMMENT='

     {color:red}-1 core zombie tests{color}.  There are 1 zombie test(s): 	at org.apache.hama.examples.LinearRegressionTest.testCorrectGDWithLinearRegressionExecution(LinearRegressionTest.java:28)'
+ BAD=1
+ jps
+ grep surefirebooter
+ cut -d ' ' -f 1
+ xargs kill -9
POST BUILD TASK : SUCCESS
END OF POST BUILD TASK : 0
Archiving artifacts
Sending artifact delta relative to HBase-0.98-on-Hadoop-1.1 #454
Archived 670 artifacts
Archive block size is 32768
Received 4 blocks and 34941806 bytes
Compression is 0.4%
Took 1 min 21 sec
Recording test results
Updating HBASE-11856
Updating HBASE-11846