You are viewing a plain text version of this content. The canonical link for it is here.
Posted to dev@lucene.apache.org by Policeman Jenkins Server <je...@thetaphi.de> on 2016/03/02 10:00:42 UTC
[JENKINS-EA] Lucene-Solr-trunk-Linux (64bit/jdk-9-ea+107) - Build #
16070 - Failure!
Build: http://jenkins.thetaphi.de/job/Lucene-Solr-trunk-Linux/16070/
Java: 64bit/jdk-9-ea+107 -XX:+UseCompressedOops -XX:+UseG1GC
1 tests failed.
FAILED: org.apache.lucene.util.TestVersion.testDeprecations
Error Message:
LUCENE_7_0_0 should not be deprecated
Stack Trace:
java.lang.AssertionError: LUCENE_7_0_0 should not be deprecated
at __randomizedtesting.SeedInfo.seed([792476A1F5E6F703:9A8D338666964FF2]:0)
at org.junit.Assert.fail(Assert.java:93)
at org.junit.Assert.assertTrue(Assert.java:43)
at org.junit.Assert.assertFalse(Assert.java:68)
at org.apache.lucene.util.TestVersion.testDeprecations(TestVersion.java:180)
at sun.reflect.NativeMethodAccessorImpl.invoke0(Native Method)
at sun.reflect.NativeMethodAccessorImpl.invoke(NativeMethodAccessorImpl.java:62)
at sun.reflect.DelegatingMethodAccessorImpl.invoke(DelegatingMethodAccessorImpl.java:43)
at java.lang.reflect.Method.invoke(Method.java:520)
at com.carrotsearch.randomizedtesting.RandomizedRunner.invoke(RandomizedRunner.java:1764)
at com.carrotsearch.randomizedtesting.RandomizedRunner$8.evaluate(RandomizedRunner.java:871)
at com.carrotsearch.randomizedtesting.RandomizedRunner$9.evaluate(RandomizedRunner.java:907)
at com.carrotsearch.randomizedtesting.RandomizedRunner$10.evaluate(RandomizedRunner.java:921)
at org.apache.lucene.util.TestRuleSetupTeardownChained$1.evaluate(TestRuleSetupTeardownChained.java:49)
at org.apache.lucene.util.AbstractBeforeAfterRule$1.evaluate(AbstractBeforeAfterRule.java:45)
at org.apache.lucene.util.TestRuleThreadAndTestName$1.evaluate(TestRuleThreadAndTestName.java:48)
at org.apache.lucene.util.TestRuleIgnoreAfterMaxFailures$1.evaluate(TestRuleIgnoreAfterMaxFailures.java:64)
at org.apache.lucene.util.TestRuleMarkFailure$1.evaluate(TestRuleMarkFailure.java:47)
at com.carrotsearch.randomizedtesting.rules.StatementAdapter.evaluate(StatementAdapter.java:36)
at com.carrotsearch.randomizedtesting.ThreadLeakControl$StatementRunner.run(ThreadLeakControl.java:367)
at com.carrotsearch.randomizedtesting.ThreadLeakControl.forkTimeoutingTask(ThreadLeakControl.java:809)
at com.carrotsearch.randomizedtesting.ThreadLeakControl$3.evaluate(ThreadLeakControl.java:460)
at com.carrotsearch.randomizedtesting.RandomizedRunner.runSingleTest(RandomizedRunner.java:880)
at com.carrotsearch.randomizedtesting.RandomizedRunner$5.evaluate(RandomizedRunner.java:781)
at com.carrotsearch.randomizedtesting.RandomizedRunner$6.evaluate(RandomizedRunner.java:816)
at com.carrotsearch.randomizedtesting.RandomizedRunner$7.evaluate(RandomizedRunner.java:827)
at org.apache.lucene.util.AbstractBeforeAfterRule$1.evaluate(AbstractBeforeAfterRule.java:45)
at com.carrotsearch.randomizedtesting.rules.StatementAdapter.evaluate(StatementAdapter.java:36)
at org.apache.lucene.util.TestRuleStoreClassName$1.evaluate(TestRuleStoreClassName.java:41)
at com.carrotsearch.randomizedtesting.rules.NoShadowingOrOverridesOnMethodsRule$1.evaluate(NoShadowingOrOverridesOnMethodsRule.java:40)
at com.carrotsearch.randomizedtesting.rules.NoShadowingOrOverridesOnMethodsRule$1.evaluate(NoShadowingOrOverridesOnMethodsRule.java:40)
at com.carrotsearch.randomizedtesting.rules.StatementAdapter.evaluate(StatementAdapter.java:36)
at com.carrotsearch.randomizedtesting.rules.StatementAdapter.evaluate(StatementAdapter.java:36)
at com.carrotsearch.randomizedtesting.rules.StatementAdapter.evaluate(StatementAdapter.java:36)
at org.apache.lucene.util.TestRuleAssertionsRequired$1.evaluate(TestRuleAssertionsRequired.java:53)
at org.apache.lucene.util.TestRuleMarkFailure$1.evaluate(TestRuleMarkFailure.java:47)
at org.apache.lucene.util.TestRuleIgnoreAfterMaxFailures$1.evaluate(TestRuleIgnoreAfterMaxFailures.java:64)
at org.apache.lucene.util.TestRuleIgnoreTestSuites$1.evaluate(TestRuleIgnoreTestSuites.java:54)
at com.carrotsearch.randomizedtesting.rules.StatementAdapter.evaluate(StatementAdapter.java:36)
at com.carrotsearch.randomizedtesting.ThreadLeakControl$StatementRunner.run(ThreadLeakControl.java:367)
at java.lang.Thread.run(Thread.java:804)
Build Log:
[...truncated 1233 lines...]
[junit4] Suite: org.apache.lucene.util.TestVersion
[junit4] 2> NOTE: reproduce with: ant test -Dtestcase=TestVersion -Dtests.method=testDeprecations -Dtests.seed=792476A1F5E6F703 -Dtests.multiplier=3 -Dtests.slow=true -Dtests.locale=pa-Arab-PK -Dtests.timezone=America/Chicago -Dtests.asserts=true -Dtests.file.encoding=ISO-8859-1
[junit4] FAILURE 0.00s J2 | TestVersion.testDeprecations <<<
[junit4] > Throwable #1: java.lang.AssertionError: LUCENE_7_0_0 should not be deprecated
[junit4] > at __randomizedtesting.SeedInfo.seed([792476A1F5E6F703:9A8D338666964FF2]:0)
[junit4] > at org.apache.lucene.util.TestVersion.testDeprecations(TestVersion.java:180)
[junit4] > at java.lang.Thread.run(Thread.java:804)
[junit4] 2> NOTE: test params are: codec=Asserting(Lucene60): {}, docValues:{}, maxPointsInLeafNode=1405, maxMBSortInHeap=5.093680741190018, sim=RandomSimilarity(queryNorm=true,coord=no): {}, locale=pa-Arab-PK, timezone=America/Chicago
[junit4] 2> NOTE: Linux 3.19.0-51-generic amd64/Oracle Corporation 9-ea (64-bit)/cpus=12,threads=1,free=287763680,total=344981504
[junit4] 2> NOTE: All tests run in this JVM: [TestForceMergeForever, TestSpanOrQuery, TestParallelReaderEmptyIndex, TestField, TestElevationComparator, TestAllFilesHaveChecksumFooter, TestConsistentFieldNumbers, TestIndexWriterReader, TestNot, TestSleepingLockWrapper, TestSparseFixedBitSet, TestSpanContainQuery, TestIndexWriterMaxDocs, TestSpans, TestTermsEnum2, TestIntBlockPool, TestIndexWriterConfig, TestSPIClassIterator, TestDemo, TestMaxTermFrequency, TestCachingCollector, TestSegmentInfos, TestBytesRefHash, TestMergeSchedulerExternal, TestDemoParallelLeafReader, TestDocBoost, TestIntroSorter, TestBytesStore, TestComplexExplanationsOfNonMatches, TestNumericTokenStream, TestNRTReaderCleanup, TestNoMergeScheduler, TestCharTermAttributeImpl, TestBKD, TestDocValuesScoring, TestExternalCodecs, TestIndexInput, TestPrefixQuery, TestControlledRealTimeReopenThread, TestCustomSearcherSort, TestFrequencyTrackingRingBuffer, TestLucene60PointFormat, TestAttributeSource, TestNorms, TestStressIndexing2, TestTopDocsMerge, TestIndexCommit, TestNRTThreads, TestTransactions, TestMultiMMap, TestApproximationSearchEquivalence, TestSloppyPhraseQuery, TestPrefixCodedTerms, TestOfflineSorter, TestSortedSetSelector, TestDirectPacked, TestMathUtil, TestRegexpRandom2, TestTopDocsCollector, TestArrayUtil, TestSearch, TestSearchWithThreads, TestLiveFieldValues, TestCrashCausesCorruptIndex, TestFastCompressionMode, TestBufferedIndexInput, TestTermVectorsReader, TestCharsRefBuilder, TestLucene50SegmentInfoFormat, TestMultiLevelSkipList, TestIndexWriter, TestIndexWriterMerging, TestFSTs, TestPackedInts, TestNumericRangeQuery32, TestIndexWriterExceptions, TestIndexWriterCommit, TestDirectoryReaderReopen, TestTimeLimitingCollector, TestHighCompressionMode, TestStressIndexing, TestMinimize, TestTieredMergePolicy, TestWeakIdentityMap, TestBagOfPositions, TestSort, TestToken, TestSimpleSearchEquivalence, TestLegacyNumericUtils, TestIndexWriterOnDiskFull, TestMixedCodecs, TestLazyProxSkipping, TestDeterminism, TestStressNRT, TestTermRangeQuery, TestDocumentsWriterDeleteQueue, TestDocumentWriter, TestSpanSearchEquivalence, TestPrefixInBooleanQuery, TestUniqueTermCount, TestUnicodeUtil, TestIndexableField, TestCheckIndex, TestCompiledAutomaton, TestConstantScoreQuery, TestRecyclingIntBlockAllocator, TestSpanExplanationsOfNonMatches, TestRollingBuffer, TestDateTools, TestPriorityQueue, TestBinaryDocument, TestTotalHitCountCollector, TestRamUsageEstimator, TestNoMergePolicy, TestPhrasePrefixQuery, TestBytesRef, TestTwoPhaseCommitTool, TestVersion]
[junit4] Completed [318/411 (1!)] on J2 in 0.02s, 11 tests, 1 failure <<< FAILURES!
[...truncated 332 lines...]
BUILD FAILED
/home/jenkins/workspace/Lucene-Solr-trunk-Linux/build.xml:740: The following error occurred while executing this line:
/home/jenkins/workspace/Lucene-Solr-trunk-Linux/build.xml:684: The following error occurred while executing this line:
/home/jenkins/workspace/Lucene-Solr-trunk-Linux/build.xml:59: The following error occurred while executing this line:
/home/jenkins/workspace/Lucene-Solr-trunk-Linux/lucene/build.xml:50: The following error occurred while executing this line:
/home/jenkins/workspace/Lucene-Solr-trunk-Linux/lucene/common-build.xml:1457: The following error occurred while executing this line:
/home/jenkins/workspace/Lucene-Solr-trunk-Linux/lucene/common-build.xml:1014: There were test failures: 411 suites (1 ignored), 3423 tests, 1 failure, 61 ignored (57 assumptions) [seed: 792476A1F5E6F703]
Total time: 6 minutes 12 seconds
Build step 'Invoke Ant' marked build as failure
Archiving artifacts
[WARNINGS] Skipping publisher since build result is FAILURE
Recording test results
Email was triggered for: Failure - Any
Sending email for trigger: Failure - Any
[JENKINS-EA] Lucene-Solr-trunk-Linux (64bit/jdk-9-ea+107) - Build #
16075 - Still Failing!
Posted by Policeman Jenkins Server <je...@thetaphi.de>.
Build: http://jenkins.thetaphi.de/job/Lucene-Solr-trunk-Linux/16075/
Java: 64bit/jdk-9-ea+107 -XX:-UseCompressedOops -XX:+UseParallelGC
2 tests failed.
FAILED: org.apache.lucene.codecs.lucene50.TestBlockPostingsFormat.testDocsOnly
Error Message:
Captured an uncaught exception in thread: Thread[id=1153, name=Thread-1016, state=RUNNABLE, group=TGRP-TestBlockPostingsFormat]
Stack Trace:
com.carrotsearch.randomizedtesting.UncaughtExceptionError: Captured an uncaught exception in thread: Thread[id=1153, name=Thread-1016, state=RUNNABLE, group=TGRP-TestBlockPostingsFormat]
at __randomizedtesting.SeedInfo.seed([6103DFB54A58C46A:1D4775A74089B13A]:0)
Caused by: java.lang.RuntimeException: java.lang.ArrayIndexOutOfBoundsException: 7
at __randomizedtesting.SeedInfo.seed([6103DFB54A58C46A]:0)
at org.apache.lucene.index.RandomPostingsTester$TestThread.run(RandomPostingsTester.java:1006)
Caused by: java.lang.ArrayIndexOutOfBoundsException: 7
at org.apache.lucene.util.automaton.MinimizationOperations.minimize(MinimizationOperations.java:235)
at org.apache.lucene.util.automaton.RegExp.toAutomatonInternal(RegExp.java:524)
at org.apache.lucene.util.automaton.RegExp.toAutomaton(RegExp.java:495)
at org.apache.lucene.util.automaton.RegExp.toAutomaton(RegExp.java:426)
at org.apache.lucene.util.automaton.AutomatonTestUtil.randomSingleAutomaton(AutomatonTestUtil.java:262)
at org.apache.lucene.util.automaton.AutomatonTestUtil.randomAutomaton(AutomatonTestUtil.java:277)
at org.apache.lucene.index.RandomPostingsTester.testTermsOneThread(RandomPostingsTester.java:1167)
at org.apache.lucene.index.RandomPostingsTester.access$000(RandomPostingsTester.java:61)
at org.apache.lucene.index.RandomPostingsTester$TestThread.run(RandomPostingsTester.java:1004)
FAILED: org.apache.lucene.util.automaton.TestMinimize.testBasic
Error Message:
12
Stack Trace:
java.lang.ArrayIndexOutOfBoundsException: 12
at __randomizedtesting.SeedInfo.seed([6103DFB54A58C46A:CAF9C2A095844244]:0)
at org.apache.lucene.util.automaton.MinimizationOperations.minimize(MinimizationOperations.java:235)
at org.apache.lucene.util.automaton.TestMinimize.testBasic(TestMinimize.java:33)
at sun.reflect.NativeMethodAccessorImpl.invoke0(Native Method)
at sun.reflect.NativeMethodAccessorImpl.invoke(NativeMethodAccessorImpl.java:62)
at sun.reflect.DelegatingMethodAccessorImpl.invoke(DelegatingMethodAccessorImpl.java:43)
at java.lang.reflect.Method.invoke(Method.java:520)
at com.carrotsearch.randomizedtesting.RandomizedRunner.invoke(RandomizedRunner.java:1764)
at com.carrotsearch.randomizedtesting.RandomizedRunner$8.evaluate(RandomizedRunner.java:871)
at com.carrotsearch.randomizedtesting.RandomizedRunner$9.evaluate(RandomizedRunner.java:907)
at com.carrotsearch.randomizedtesting.RandomizedRunner$10.evaluate(RandomizedRunner.java:921)
at org.apache.lucene.util.TestRuleSetupTeardownChained$1.evaluate(TestRuleSetupTeardownChained.java:49)
at org.apache.lucene.util.AbstractBeforeAfterRule$1.evaluate(AbstractBeforeAfterRule.java:45)
at org.apache.lucene.util.TestRuleThreadAndTestName$1.evaluate(TestRuleThreadAndTestName.java:48)
at org.apache.lucene.util.TestRuleIgnoreAfterMaxFailures$1.evaluate(TestRuleIgnoreAfterMaxFailures.java:64)
at org.apache.lucene.util.TestRuleMarkFailure$1.evaluate(TestRuleMarkFailure.java:47)
at com.carrotsearch.randomizedtesting.rules.StatementAdapter.evaluate(StatementAdapter.java:36)
at com.carrotsearch.randomizedtesting.ThreadLeakControl$StatementRunner.run(ThreadLeakControl.java:367)
at com.carrotsearch.randomizedtesting.ThreadLeakControl.forkTimeoutingTask(ThreadLeakControl.java:809)
at com.carrotsearch.randomizedtesting.ThreadLeakControl$3.evaluate(ThreadLeakControl.java:460)
at com.carrotsearch.randomizedtesting.RandomizedRunner.runSingleTest(RandomizedRunner.java:880)
at com.carrotsearch.randomizedtesting.RandomizedRunner$5.evaluate(RandomizedRunner.java:781)
at com.carrotsearch.randomizedtesting.RandomizedRunner$6.evaluate(RandomizedRunner.java:816)
at com.carrotsearch.randomizedtesting.RandomizedRunner$7.evaluate(RandomizedRunner.java:827)
at org.apache.lucene.util.AbstractBeforeAfterRule$1.evaluate(AbstractBeforeAfterRule.java:45)
at com.carrotsearch.randomizedtesting.rules.StatementAdapter.evaluate(StatementAdapter.java:36)
at org.apache.lucene.util.TestRuleStoreClassName$1.evaluate(TestRuleStoreClassName.java:41)
at com.carrotsearch.randomizedtesting.rules.NoShadowingOrOverridesOnMethodsRule$1.evaluate(NoShadowingOrOverridesOnMethodsRule.java:40)
at com.carrotsearch.randomizedtesting.rules.NoShadowingOrOverridesOnMethodsRule$1.evaluate(NoShadowingOrOverridesOnMethodsRule.java:40)
at com.carrotsearch.randomizedtesting.rules.StatementAdapter.evaluate(StatementAdapter.java:36)
at com.carrotsearch.randomizedtesting.rules.StatementAdapter.evaluate(StatementAdapter.java:36)
at com.carrotsearch.randomizedtesting.rules.StatementAdapter.evaluate(StatementAdapter.java:36)
at org.apache.lucene.util.TestRuleAssertionsRequired$1.evaluate(TestRuleAssertionsRequired.java:53)
at org.apache.lucene.util.TestRuleMarkFailure$1.evaluate(TestRuleMarkFailure.java:47)
at org.apache.lucene.util.TestRuleIgnoreAfterMaxFailures$1.evaluate(TestRuleIgnoreAfterMaxFailures.java:64)
at org.apache.lucene.util.TestRuleIgnoreTestSuites$1.evaluate(TestRuleIgnoreTestSuites.java:54)
at com.carrotsearch.randomizedtesting.rules.StatementAdapter.evaluate(StatementAdapter.java:36)
at com.carrotsearch.randomizedtesting.ThreadLeakControl$StatementRunner.run(ThreadLeakControl.java:367)
at java.lang.Thread.run(Thread.java:804)
Build Log:
[...truncated 535 lines...]
[junit4] Suite: org.apache.lucene.codecs.lucene50.TestBlockPostingsFormat
[junit4] 2> mar. 03, 2016 2:09:56 A.M. com.carrotsearch.randomizedtesting.RandomizedRunner$QueueUncaughtExceptionsHandler uncaughtException
[junit4] 2> WARNING: Uncaught exception in thread: Thread[Thread-1016,5,TGRP-TestBlockPostingsFormat]
[junit4] 2> java.lang.RuntimeException: java.lang.ArrayIndexOutOfBoundsException: 7
[junit4] 2> at __randomizedtesting.SeedInfo.seed([6103DFB54A58C46A]:0)
[junit4] 2> at org.apache.lucene.index.RandomPostingsTester$TestThread.run(RandomPostingsTester.java:1006)
[junit4] 2> Caused by: java.lang.ArrayIndexOutOfBoundsException: 7
[junit4] 2> at org.apache.lucene.util.automaton.MinimizationOperations.minimize(MinimizationOperations.java:235)
[junit4] 2> at org.apache.lucene.util.automaton.RegExp.toAutomatonInternal(RegExp.java:524)
[junit4] 2> at org.apache.lucene.util.automaton.RegExp.toAutomaton(RegExp.java:495)
[junit4] 2> at org.apache.lucene.util.automaton.RegExp.toAutomaton(RegExp.java:426)
[junit4] 2> at org.apache.lucene.util.automaton.AutomatonTestUtil.randomSingleAutomaton(AutomatonTestUtil.java:262)
[junit4] 2> at org.apache.lucene.util.automaton.AutomatonTestUtil.randomAutomaton(AutomatonTestUtil.java:277)
[junit4] 2> at org.apache.lucene.index.RandomPostingsTester.testTermsOneThread(RandomPostingsTester.java:1167)
[junit4] 2> at org.apache.lucene.index.RandomPostingsTester.access$000(RandomPostingsTester.java:61)
[junit4] 2> at org.apache.lucene.index.RandomPostingsTester$TestThread.run(RandomPostingsTester.java:1004)
[junit4] 2>
[junit4] 2> NOTE: reproduce with: ant test -Dtestcase=TestBlockPostingsFormat -Dtests.method=testDocsOnly -Dtests.seed=6103DFB54A58C46A -Dtests.multiplier=3 -Dtests.slow=true -Dtests.locale=nb-SJ -Dtests.timezone=Pacific/Pohnpei -Dtests.asserts=true -Dtests.file.encoding=US-ASCII
[junit4] ERROR 0.21s J2 | TestBlockPostingsFormat.testDocsOnly <<<
[junit4] > Throwable #1: com.carrotsearch.randomizedtesting.UncaughtExceptionError: Captured an uncaught exception in thread: Thread[id=1153, name=Thread-1016, state=RUNNABLE, group=TGRP-TestBlockPostingsFormat]
[junit4] > at __randomizedtesting.SeedInfo.seed([6103DFB54A58C46A:1D4775A74089B13A]:0)
[junit4] > Caused by: java.lang.RuntimeException: java.lang.ArrayIndexOutOfBoundsException: 7
[junit4] > at __randomizedtesting.SeedInfo.seed([6103DFB54A58C46A]:0)
[junit4] > at org.apache.lucene.index.RandomPostingsTester$TestThread.run(RandomPostingsTester.java:1006)
[junit4] > Caused by: java.lang.ArrayIndexOutOfBoundsException: 7
[junit4] > at org.apache.lucene.util.automaton.MinimizationOperations.minimize(MinimizationOperations.java:235)
[junit4] > at org.apache.lucene.util.automaton.RegExp.toAutomatonInternal(RegExp.java:524)
[junit4] > at org.apache.lucene.util.automaton.RegExp.toAutomaton(RegExp.java:495)
[junit4] > at org.apache.lucene.util.automaton.RegExp.toAutomaton(RegExp.java:426)
[junit4] > at org.apache.lucene.util.automaton.AutomatonTestUtil.randomSingleAutomaton(AutomatonTestUtil.java:262)
[junit4] > at org.apache.lucene.util.automaton.AutomatonTestUtil.randomAutomaton(AutomatonTestUtil.java:277)
[junit4] > at org.apache.lucene.index.RandomPostingsTester.testTermsOneThread(RandomPostingsTester.java:1167)
[junit4] > at org.apache.lucene.index.RandomPostingsTester.access$000(RandomPostingsTester.java:61)
[junit4] > at org.apache.lucene.index.RandomPostingsTester$TestThread.run(RandomPostingsTester.java:1004)
[junit4] 2> NOTE: test params are: codec=Asserting(Lucene60): {}, docValues:{}, maxPointsInLeafNode=1183, maxMBSortInHeap=6.889440045619528, sim=ClassicSimilarity, locale=nb-SJ, timezone=Pacific/Pohnpei
[junit4] 2> NOTE: Linux 3.19.0-51-generic amd64/Oracle Corporation 9-ea (64-bit)/cpus=12,threads=1,free=305415464,total=527958016
[junit4] 2> NOTE: All tests run in this JVM: [TestDirectPacked, Test2BBinaryDocValues, TestNoMergeScheduler, TestTopDocsCollector, TestCachingCollector, TestIndexWriterOnDiskFull, TestIndexWriterReader, TestIndexWriterMaxDocs, TestNumericTokenStream, TestTransactions, TestIndexableField, TestReqExclBulkScorer, TestBufferedChecksum, TestAutomaton, TestSortedSetSelector, TestRegexpRandom2, TestWildcard, TestTopDocsMerge, TestCharsRefBuilder, TestLiveFieldValues, TestSPIClassIterator, TestFastDecompressionMode, TestPointQueries, TestFuzzyQuery, TestSimpleSearchEquivalence, TestLucene60PointFormat, TestNorms, TestCodecHoldsOpenFiles, TestFilterSpans, TestNIOFSDirectory, TestSloppyPhraseQuery, TestMixedCodecs, TestAtomicUpdate, TestSpanOrQuery, TestTermVectorsReader, TestTermVectors, TestLucene50TermVectorsFormat, TestArrayUtil, TestSegmentInfos, TestCustomSearcherSort, TestComplexExplanationsOfNonMatches, TestIndexWriterMerging, TestFastCompressionMode, TestAttributeSource, TestBagOfPositions, TestSleepingLockWrapper, TestDuelingCodecsAtNight, TestMultiLevelSkipList, TestSimpleFSDirectory, TestNot, TestSort, TestTermsEnum2, TestSparseFixedBitSet, Test2BNumericDocValues, TestNRTReaderCleanup, TestDirectory, TestIntsRef, TestPhrasePrefixQuery, TestSearch, TestMatchNoDocsQuery, TestBlockPostingsFormat]
[junit4] Completed [98/411 (1!)] on J2 in 9.27s, 26 tests, 1 error <<< FAILURES!
[...truncated 184 lines...]
[junit4] Suite: org.apache.lucene.util.automaton.TestMinimize
[junit4] 2> NOTE: reproduce with: ant test -Dtestcase=TestMinimize -Dtests.method=testBasic -Dtests.seed=6103DFB54A58C46A -Dtests.multiplier=3 -Dtests.slow=true -Dtests.locale=en-NA -Dtests.timezone=Asia/Anadyr -Dtests.asserts=true -Dtests.file.encoding=US-ASCII
[junit4] ERROR 0.03s J0 | TestMinimize.testBasic <<<
[junit4] > Throwable #1: java.lang.ArrayIndexOutOfBoundsException: 12
[junit4] > at __randomizedtesting.SeedInfo.seed([6103DFB54A58C46A:CAF9C2A095844244]:0)
[junit4] > at org.apache.lucene.util.automaton.MinimizationOperations.minimize(MinimizationOperations.java:235)
[junit4] > at org.apache.lucene.util.automaton.TestMinimize.testBasic(TestMinimize.java:33)
[junit4] > at java.lang.Thread.run(Thread.java:804)
[junit4] 2> NOTE: test params are: codec=Asserting(Lucene60): {}, docValues:{}, maxPointsInLeafNode=1201, maxMBSortInHeap=6.204959135760727, sim=ClassicSimilarity, locale=en-NA, timezone=Asia/Anadyr
[junit4] 2> NOTE: Linux 3.19.0-51-generic amd64/Oracle Corporation 9-ea (64-bit)/cpus=12,threads=1,free=224588520,total=476577792
[junit4] 2> NOTE: All tests run in this JVM: [TestQueryCachingPolicy, TestTermsEnum, TestSearcherManager, TestIndexWriterExceptions2, TestTerm, TestPhraseQuery, TestReaderClosed, TestFilterIterator, TestUpgradeIndexMergePolicy, TestFixedBitSet, TestHighCompressionMode, TestSimpleAttributeImpl, TestBM25Similarity, TestMinShouldMatch2, TestMultiset, TestBinaryTerms, TestCustomNorms, TestIndexWriterUnicode, TestDocIdSetBuilder, TestSumDocFreq, TestFieldType, TestSpanNearQuery, TestNumericDocValuesUpdates, TestQueryBuilder, TestFilterDirectoryReader, TestFilterDirectory, TestMutableValues, TestVirtualMethod, TestTermVectorsWriter, Test2BTerms, TestCrash, TestCheckIndex, TestIndexWriterDelete, TestIndexSearcher, TestLSBRadixSorter, TestStringHelper, TestSortRescorer, TestMinimize]
[junit4] Completed [156/411 (2!)] on J0 in 2.77s, 3 tests, 1 error <<< FAILURES!
[...truncated 834 lines...]
BUILD FAILED
/home/jenkins/workspace/Lucene-Solr-trunk-Linux/build.xml:740: The following error occurred while executing this line:
/home/jenkins/workspace/Lucene-Solr-trunk-Linux/build.xml:684: The following error occurred while executing this line:
/home/jenkins/workspace/Lucene-Solr-trunk-Linux/build.xml:59: The following error occurred while executing this line:
/home/jenkins/workspace/Lucene-Solr-trunk-Linux/lucene/build.xml:50: The following error occurred while executing this line:
/home/jenkins/workspace/Lucene-Solr-trunk-Linux/lucene/common-build.xml:1457: The following error occurred while executing this line:
/home/jenkins/workspace/Lucene-Solr-trunk-Linux/lucene/common-build.xml:1014: There were test failures: 411 suites (1 ignored), 3423 tests, 2 errors, 59 ignored (55 assumptions) [seed: 6103DFB54A58C46A]
Total time: 6 minutes 50 seconds
Build step 'Invoke Ant' marked build as failure
Archiving artifacts
[WARNINGS] Skipping publisher since build result is FAILURE
Recording test results
Email was triggered for: Failure - Any
Sending email for trigger: Failure - Any
[JENKINS-EA] Lucene-Solr-trunk-Linux (32bit/jdk-9-ea+107) - Build #
16074 - Still Failing!
Posted by Policeman Jenkins Server <je...@thetaphi.de>.
Build: http://jenkins.thetaphi.de/job/Lucene-Solr-trunk-Linux/16074/
Java: 32bit/jdk-9-ea+107 -server -XX:+UseSerialGC
2 tests failed.
FAILED: org.apache.lucene.index.TestBackwardsCompatibility.testUnsupportedOldIndexes
Error Message:
Cannot find resource: unsupported.5.0.0-cfs.zip
Stack Trace:
java.io.IOException: Cannot find resource: unsupported.5.0.0-cfs.zip
at __randomizedtesting.SeedInfo.seed([6C3A9137EFD84782:97C1A3145F43E0DE]:0)
at org.apache.lucene.util.LuceneTestCase.getDataInputStream(LuceneTestCase.java:1930)
at org.apache.lucene.index.TestBackwardsCompatibility.testUnsupportedOldIndexes(TestBackwardsCompatibility.java:505)
at sun.reflect.NativeMethodAccessorImpl.invoke0(Native Method)
at sun.reflect.NativeMethodAccessorImpl.invoke(NativeMethodAccessorImpl.java:62)
at sun.reflect.DelegatingMethodAccessorImpl.invoke(DelegatingMethodAccessorImpl.java:43)
at java.lang.reflect.Method.invoke(Method.java:520)
at com.carrotsearch.randomizedtesting.RandomizedRunner.invoke(RandomizedRunner.java:1764)
at com.carrotsearch.randomizedtesting.RandomizedRunner$8.evaluate(RandomizedRunner.java:871)
at com.carrotsearch.randomizedtesting.RandomizedRunner$9.evaluate(RandomizedRunner.java:907)
at com.carrotsearch.randomizedtesting.RandomizedRunner$10.evaluate(RandomizedRunner.java:921)
at org.apache.lucene.util.TestRuleSetupTeardownChained$1.evaluate(TestRuleSetupTeardownChained.java:49)
at org.apache.lucene.util.AbstractBeforeAfterRule$1.evaluate(AbstractBeforeAfterRule.java:45)
at org.apache.lucene.util.TestRuleThreadAndTestName$1.evaluate(TestRuleThreadAndTestName.java:48)
at org.apache.lucene.util.TestRuleIgnoreAfterMaxFailures$1.evaluate(TestRuleIgnoreAfterMaxFailures.java:64)
at org.apache.lucene.util.TestRuleMarkFailure$1.evaluate(TestRuleMarkFailure.java:47)
at com.carrotsearch.randomizedtesting.rules.StatementAdapter.evaluate(StatementAdapter.java:36)
at com.carrotsearch.randomizedtesting.ThreadLeakControl$StatementRunner.run(ThreadLeakControl.java:367)
at com.carrotsearch.randomizedtesting.ThreadLeakControl.forkTimeoutingTask(ThreadLeakControl.java:809)
at com.carrotsearch.randomizedtesting.ThreadLeakControl$3.evaluate(ThreadLeakControl.java:460)
at com.carrotsearch.randomizedtesting.RandomizedRunner.runSingleTest(RandomizedRunner.java:880)
at com.carrotsearch.randomizedtesting.RandomizedRunner$5.evaluate(RandomizedRunner.java:781)
at com.carrotsearch.randomizedtesting.RandomizedRunner$6.evaluate(RandomizedRunner.java:816)
at com.carrotsearch.randomizedtesting.RandomizedRunner$7.evaluate(RandomizedRunner.java:827)
at org.apache.lucene.util.AbstractBeforeAfterRule$1.evaluate(AbstractBeforeAfterRule.java:45)
at com.carrotsearch.randomizedtesting.rules.StatementAdapter.evaluate(StatementAdapter.java:36)
at org.apache.lucene.util.TestRuleStoreClassName$1.evaluate(TestRuleStoreClassName.java:41)
at com.carrotsearch.randomizedtesting.rules.NoShadowingOrOverridesOnMethodsRule$1.evaluate(NoShadowingOrOverridesOnMethodsRule.java:40)
at com.carrotsearch.randomizedtesting.rules.NoShadowingOrOverridesOnMethodsRule$1.evaluate(NoShadowingOrOverridesOnMethodsRule.java:40)
at com.carrotsearch.randomizedtesting.rules.StatementAdapter.evaluate(StatementAdapter.java:36)
at com.carrotsearch.randomizedtesting.rules.StatementAdapter.evaluate(StatementAdapter.java:36)
at com.carrotsearch.randomizedtesting.rules.StatementAdapter.evaluate(StatementAdapter.java:36)
at org.apache.lucene.util.TestRuleAssertionsRequired$1.evaluate(TestRuleAssertionsRequired.java:53)
at org.apache.lucene.util.TestRuleMarkFailure$1.evaluate(TestRuleMarkFailure.java:47)
at org.apache.lucene.util.TestRuleIgnoreAfterMaxFailures$1.evaluate(TestRuleIgnoreAfterMaxFailures.java:64)
at org.apache.lucene.util.TestRuleIgnoreTestSuites$1.evaluate(TestRuleIgnoreTestSuites.java:54)
at com.carrotsearch.randomizedtesting.rules.StatementAdapter.evaluate(StatementAdapter.java:36)
at com.carrotsearch.randomizedtesting.ThreadLeakControl$StatementRunner.run(ThreadLeakControl.java:367)
at java.lang.Thread.run(Thread.java:804)
FAILED: org.apache.lucene.index.TestBackwardsCompatibility.testAllVersionsTested
Error Message:
Missing backcompat test files: 5.0.0-cfs 5.1.0-cfs 5.2.0-cfs 5.2.1-cfs 5.3.0-cfs 5.3.1-cfs 5.3.2-cfs 5.4.0-cfs 5.4.1-cfs 5.5.0-cfs
Stack Trace:
java.lang.AssertionError: Missing backcompat test files:
5.0.0-cfs
5.1.0-cfs
5.2.0-cfs
5.2.1-cfs
5.3.0-cfs
5.3.1-cfs
5.3.2-cfs
5.4.0-cfs
5.4.1-cfs
5.5.0-cfs
at __randomizedtesting.SeedInfo.seed([6C3A9137EFD84782:7CE57E775B4F51AE]:0)
at org.junit.Assert.fail(Assert.java:93)
at org.apache.lucene.index.TestBackwardsCompatibility.testAllVersionsTested(TestBackwardsCompatibility.java:495)
at sun.reflect.NativeMethodAccessorImpl.invoke0(Native Method)
at sun.reflect.NativeMethodAccessorImpl.invoke(NativeMethodAccessorImpl.java:62)
at sun.reflect.DelegatingMethodAccessorImpl.invoke(DelegatingMethodAccessorImpl.java:43)
at java.lang.reflect.Method.invoke(Method.java:520)
at com.carrotsearch.randomizedtesting.RandomizedRunner.invoke(RandomizedRunner.java:1764)
at com.carrotsearch.randomizedtesting.RandomizedRunner$8.evaluate(RandomizedRunner.java:871)
at com.carrotsearch.randomizedtesting.RandomizedRunner$9.evaluate(RandomizedRunner.java:907)
at com.carrotsearch.randomizedtesting.RandomizedRunner$10.evaluate(RandomizedRunner.java:921)
at org.apache.lucene.util.TestRuleSetupTeardownChained$1.evaluate(TestRuleSetupTeardownChained.java:49)
at org.apache.lucene.util.AbstractBeforeAfterRule$1.evaluate(AbstractBeforeAfterRule.java:45)
at org.apache.lucene.util.TestRuleThreadAndTestName$1.evaluate(TestRuleThreadAndTestName.java:48)
at org.apache.lucene.util.TestRuleIgnoreAfterMaxFailures$1.evaluate(TestRuleIgnoreAfterMaxFailures.java:64)
at org.apache.lucene.util.TestRuleMarkFailure$1.evaluate(TestRuleMarkFailure.java:47)
at com.carrotsearch.randomizedtesting.rules.StatementAdapter.evaluate(StatementAdapter.java:36)
at com.carrotsearch.randomizedtesting.ThreadLeakControl$StatementRunner.run(ThreadLeakControl.java:367)
at com.carrotsearch.randomizedtesting.ThreadLeakControl.forkTimeoutingTask(ThreadLeakControl.java:809)
at com.carrotsearch.randomizedtesting.ThreadLeakControl$3.evaluate(ThreadLeakControl.java:460)
at com.carrotsearch.randomizedtesting.RandomizedRunner.runSingleTest(RandomizedRunner.java:880)
at com.carrotsearch.randomizedtesting.RandomizedRunner$5.evaluate(RandomizedRunner.java:781)
at com.carrotsearch.randomizedtesting.RandomizedRunner$6.evaluate(RandomizedRunner.java:816)
at com.carrotsearch.randomizedtesting.RandomizedRunner$7.evaluate(RandomizedRunner.java:827)
at org.apache.lucene.util.AbstractBeforeAfterRule$1.evaluate(AbstractBeforeAfterRule.java:45)
at com.carrotsearch.randomizedtesting.rules.StatementAdapter.evaluate(StatementAdapter.java:36)
at org.apache.lucene.util.TestRuleStoreClassName$1.evaluate(TestRuleStoreClassName.java:41)
at com.carrotsearch.randomizedtesting.rules.NoShadowingOrOverridesOnMethodsRule$1.evaluate(NoShadowingOrOverridesOnMethodsRule.java:40)
at com.carrotsearch.randomizedtesting.rules.NoShadowingOrOverridesOnMethodsRule$1.evaluate(NoShadowingOrOverridesOnMethodsRule.java:40)
at com.carrotsearch.randomizedtesting.rules.StatementAdapter.evaluate(StatementAdapter.java:36)
at com.carrotsearch.randomizedtesting.rules.StatementAdapter.evaluate(StatementAdapter.java:36)
at com.carrotsearch.randomizedtesting.rules.StatementAdapter.evaluate(StatementAdapter.java:36)
at org.apache.lucene.util.TestRuleAssertionsRequired$1.evaluate(TestRuleAssertionsRequired.java:53)
at org.apache.lucene.util.TestRuleMarkFailure$1.evaluate(TestRuleMarkFailure.java:47)
at org.apache.lucene.util.TestRuleIgnoreAfterMaxFailures$1.evaluate(TestRuleIgnoreAfterMaxFailures.java:64)
at org.apache.lucene.util.TestRuleIgnoreTestSuites$1.evaluate(TestRuleIgnoreTestSuites.java:54)
at com.carrotsearch.randomizedtesting.rules.StatementAdapter.evaluate(StatementAdapter.java:36)
at com.carrotsearch.randomizedtesting.ThreadLeakControl$StatementRunner.run(ThreadLeakControl.java:367)
at java.lang.Thread.run(Thread.java:804)
Build Log:
[...truncated 4246 lines...]
[junit4] Suite: org.apache.lucene.index.TestBackwardsCompatibility
[junit4] 2> NOTE: reproduce with: ant test -Dtestcase=TestBackwardsCompatibility -Dtests.method=testUnsupportedOldIndexes -Dtests.seed=6C3A9137EFD84782 -Dtests.multiplier=3 -Dtests.slow=true -Dtests.locale=qu-BO -Dtests.timezone=Asia/Tel_Aviv -Dtests.asserts=true -Dtests.file.encoding=UTF-8
[junit4] ERROR 1.89s J0 | TestBackwardsCompatibility.testUnsupportedOldIndexes <<<
[junit4] > Throwable #1: java.io.IOException: Cannot find resource: unsupported.5.0.0-cfs.zip
[junit4] > at __randomizedtesting.SeedInfo.seed([6C3A9137EFD84782:97C1A3145F43E0DE]:0)
[junit4] > at org.apache.lucene.util.LuceneTestCase.getDataInputStream(LuceneTestCase.java:1930)
[junit4] > at org.apache.lucene.index.TestBackwardsCompatibility.testUnsupportedOldIndexes(TestBackwardsCompatibility.java:505)
[junit4] > at java.lang.Thread.run(Thread.java:804)
[junit4] IGNOR/A 0.01s J0 | TestBackwardsCompatibility.testCreateCFS
[junit4] > Assumption #1: backcompat creation tests must be run with -Dtests.bwcdir=/path/to/write/indexes
[junit4] 2> NOTE: reproduce with: ant test -Dtestcase=TestBackwardsCompatibility -Dtests.method=testAllVersionsTested -Dtests.seed=6C3A9137EFD84782 -Dtests.multiplier=3 -Dtests.slow=true -Dtests.locale=qu-BO -Dtests.timezone=Asia/Tel_Aviv -Dtests.asserts=true -Dtests.file.encoding=UTF-8
[junit4] FAILURE 0.00s J0 | TestBackwardsCompatibility.testAllVersionsTested <<<
[junit4] > Throwable #1: java.lang.AssertionError: Missing backcompat test files:
[junit4] > 5.0.0-cfs
[junit4] > 5.1.0-cfs
[junit4] > 5.2.0-cfs
[junit4] > 5.2.1-cfs
[junit4] > 5.3.0-cfs
[junit4] > 5.3.1-cfs
[junit4] > 5.3.2-cfs
[junit4] > 5.4.0-cfs
[junit4] > 5.4.1-cfs
[junit4] > 5.5.0-cfs
[junit4] > at __randomizedtesting.SeedInfo.seed([6C3A9137EFD84782:7CE57E775B4F51AE]:0)
[junit4] > at org.apache.lucene.index.TestBackwardsCompatibility.testAllVersionsTested(TestBackwardsCompatibility.java:495)
[junit4] > at java.lang.Thread.run(Thread.java:804)
[junit4] IGNOR/A 0.00s J0 | TestBackwardsCompatibility.testCreateIndexWithDocValuesUpdates
[junit4] > Assumption #1: backcompat creation tests must be run with -Dtests.bwcdir=/path/to/write/indexes
[junit4] IGNOR/A 0.01s J0 | TestBackwardsCompatibility.testCreateSingleSegmentNoCFS
[junit4] > Assumption #1: backcompat creation tests must be run with -Dtests.bwcdir=/path/to/write/indexes
[junit4] IGNOR/A 0.00s J0 | TestBackwardsCompatibility.testCreateNoCFS
[junit4] > Assumption #1: backcompat creation tests must be run with -Dtests.bwcdir=/path/to/write/indexes
[junit4] IGNOR/A 0.00s J0 | TestBackwardsCompatibility.testCreateSingleSegmentCFS
[junit4] > Assumption #1: backcompat creation tests must be run with -Dtests.bwcdir=/path/to/write/indexes
[junit4] IGNOR/A 0.00s J0 | TestBackwardsCompatibility.testCreateMoreTermsIndex
[junit4] > Assumption #1: backcompat creation tests must be run with -Dtests.bwcdir=/path/to/write/indexes
[junit4] 2> NOTE: leaving temporary files on disk at: /home/jenkins/workspace/Lucene-Solr-trunk-Linux/lucene/build/backward-codecs/test/J0/temp/lucene.index.TestBackwardsCompatibility_6C3A9137EFD84782-001
[junit4] 2> NOTE: test params are: codec=Asserting(Lucene60): {content6=BlockTreeOrds(blocksize=128), content5=Lucene50(blocksize=128), trieInt=BlockTreeOrds(blocksize=128), content2=BlockTreeOrds(blocksize=128), fieā±·ld=BlockTreeOrds(blocksize=128), utf8=BlockTreeOrds(blocksize=128), trieLong=Lucene50(blocksize=128), id=FSTOrd50, content=BlockTreeOrds(blocksize=128), autf8=Lucene50(blocksize=128)}, docValues:{ndv2=DocValuesFormat(name=Lucene54), ndv1=DocValuesFormat(name=Lucene54), dvBytesSortedFixed=DocValuesFormat(name=Lucene54), dvBytesStraightVar=DocValuesFormat(name=Asserting), dvShort=DocValuesFormat(name=Lucene54), dvBytesStraightFixed=DocValuesFormat(name=Lucene54), dvLong=DocValuesFormat(name=Asserting), dvInt=DocValuesFormat(name=Lucene54), dvBytesSortedVar=DocValuesFormat(name=Lucene54), dvSortedSet=DocValuesFormat(name=Direct), bdv2=DocValuesFormat(name=Lucene54), bdv2_c=DocValuesFormat(name=Asserting), dvDouble=DocValuesFormat(name=Direct), dvFloat=DocValuesFormat(name=Lucene54), bdv1=DocValuesFormat(name=Lucene54), bdv1_c=DocValuesFormat(name=Lucene54), dvPacked=DocValuesFormat(name=Asserting), dvByte=DocValuesFormat(name=Asserting), ndv1_c=DocValuesFormat(name=Lucene54), dvBytesDerefVar=DocValuesFormat(name=Lucene54), ndv2_c=DocValuesFormat(name=Asserting), dvSortedNumeric=DocValuesFormat(name=Asserting), dvBytesDerefFixed=DocValuesFormat(name=Direct)}, maxPointsInLeafNode=71, maxMBSortInHeap=6.808269795210495, sim=RandomSimilarity(queryNorm=false,coord=crazy): {}, locale=qu-BO, timezone=Asia/Tel_Aviv
[junit4] 2> NOTE: Linux 3.19.0-51-generic i386/Oracle Corporation 9-ea (32-bit)/cpus=12,threads=1,free=43939272,total=64880640
[junit4] 2> NOTE: All tests run in this JVM: [TestBackwardsCompatibility]
[junit4] Completed [2/4 (1!)] on J0 in 6.06s, 27 tests, 1 failure, 1 error, 6 skipped <<< FAILURES!
[...truncated 28 lines...]
BUILD FAILED
/home/jenkins/workspace/Lucene-Solr-trunk-Linux/build.xml:740: The following error occurred while executing this line:
/home/jenkins/workspace/Lucene-Solr-trunk-Linux/build.xml:684: The following error occurred while executing this line:
/home/jenkins/workspace/Lucene-Solr-trunk-Linux/build.xml:59: The following error occurred while executing this line:
/home/jenkins/workspace/Lucene-Solr-trunk-Linux/lucene/build.xml:476: The following error occurred while executing this line:
/home/jenkins/workspace/Lucene-Solr-trunk-Linux/lucene/common-build.xml:2187: The following error occurred while executing this line:
/home/jenkins/workspace/Lucene-Solr-trunk-Linux/lucene/module-build.xml:58: The following error occurred while executing this line:
/home/jenkins/workspace/Lucene-Solr-trunk-Linux/lucene/common-build.xml:1457: The following error occurred while executing this line:
/home/jenkins/workspace/Lucene-Solr-trunk-Linux/lucene/common-build.xml:1014: There were test failures: 4 suites, 152 tests, 1 error, 1 failure, 11 ignored (11 assumptions) [seed: 6C3A9137EFD84782]
Total time: 22 minutes 31 seconds
Build step 'Invoke Ant' marked build as failure
Archiving artifacts
[WARNINGS] Skipping publisher since build result is FAILURE
Recording test results
Email was triggered for: Failure - Any
Sending email for trigger: Failure - Any
[JENKINS-EA] Lucene-Solr-trunk-Linux (64bit/jdk-9-ea+107) - Build #
16073 - Still Failing!
Posted by Policeman Jenkins Server <je...@thetaphi.de>.
Build: http://jenkins.thetaphi.de/job/Lucene-Solr-trunk-Linux/16073/
Java: 64bit/jdk-9-ea+107 -XX:+UseCompressedOops -XX:+UseParallelGC
1 tests failed.
FAILED: org.apache.lucene.search.TestRegexpRandom2.testRegexps
Error Message:
7
Stack Trace:
java.lang.ArrayIndexOutOfBoundsException: 7
at __randomizedtesting.SeedInfo.seed([A2BABF3F6475CABA:43E6FE2EBADF9D32]:0)
at org.apache.lucene.util.automaton.MinimizationOperations.minimize(MinimizationOperations.java:235)
at org.apache.lucene.util.automaton.RegExp.toAutomatonInternal(RegExp.java:515)
at org.apache.lucene.util.automaton.RegExp.toAutomaton(RegExp.java:495)
at org.apache.lucene.util.automaton.RegExp.toAutomaton(RegExp.java:466)
at org.apache.lucene.search.RegexpQuery.<init>(RegexpQuery.java:109)
at org.apache.lucene.search.RegexpQuery.<init>(RegexpQuery.java:79)
at org.apache.lucene.search.TestRegexpRandom2.assertSame(TestRegexpRandom2.java:168)
at org.apache.lucene.search.TestRegexpRandom2.testRegexps(TestRegexpRandom2.java:160)
at sun.reflect.NativeMethodAccessorImpl.invoke0(Native Method)
at sun.reflect.NativeMethodAccessorImpl.invoke(NativeMethodAccessorImpl.java:62)
at sun.reflect.DelegatingMethodAccessorImpl.invoke(DelegatingMethodAccessorImpl.java:43)
at java.lang.reflect.Method.invoke(Method.java:520)
at com.carrotsearch.randomizedtesting.RandomizedRunner.invoke(RandomizedRunner.java:1764)
at com.carrotsearch.randomizedtesting.RandomizedRunner$8.evaluate(RandomizedRunner.java:871)
at com.carrotsearch.randomizedtesting.RandomizedRunner$9.evaluate(RandomizedRunner.java:907)
at com.carrotsearch.randomizedtesting.RandomizedRunner$10.evaluate(RandomizedRunner.java:921)
at org.apache.lucene.util.TestRuleSetupTeardownChained$1.evaluate(TestRuleSetupTeardownChained.java:49)
at org.apache.lucene.util.AbstractBeforeAfterRule$1.evaluate(AbstractBeforeAfterRule.java:45)
at org.apache.lucene.util.TestRuleThreadAndTestName$1.evaluate(TestRuleThreadAndTestName.java:48)
at org.apache.lucene.util.TestRuleIgnoreAfterMaxFailures$1.evaluate(TestRuleIgnoreAfterMaxFailures.java:64)
at org.apache.lucene.util.TestRuleMarkFailure$1.evaluate(TestRuleMarkFailure.java:47)
at com.carrotsearch.randomizedtesting.rules.StatementAdapter.evaluate(StatementAdapter.java:36)
at com.carrotsearch.randomizedtesting.ThreadLeakControl$StatementRunner.run(ThreadLeakControl.java:367)
at com.carrotsearch.randomizedtesting.ThreadLeakControl.forkTimeoutingTask(ThreadLeakControl.java:809)
at com.carrotsearch.randomizedtesting.ThreadLeakControl$3.evaluate(ThreadLeakControl.java:460)
at com.carrotsearch.randomizedtesting.RandomizedRunner.runSingleTest(RandomizedRunner.java:880)
at com.carrotsearch.randomizedtesting.RandomizedRunner$5.evaluate(RandomizedRunner.java:781)
at com.carrotsearch.randomizedtesting.RandomizedRunner$6.evaluate(RandomizedRunner.java:816)
at com.carrotsearch.randomizedtesting.RandomizedRunner$7.evaluate(RandomizedRunner.java:827)
at org.apache.lucene.util.AbstractBeforeAfterRule$1.evaluate(AbstractBeforeAfterRule.java:45)
at com.carrotsearch.randomizedtesting.rules.StatementAdapter.evaluate(StatementAdapter.java:36)
at org.apache.lucene.util.TestRuleStoreClassName$1.evaluate(TestRuleStoreClassName.java:41)
at com.carrotsearch.randomizedtesting.rules.NoShadowingOrOverridesOnMethodsRule$1.evaluate(NoShadowingOrOverridesOnMethodsRule.java:40)
at com.carrotsearch.randomizedtesting.rules.NoShadowingOrOverridesOnMethodsRule$1.evaluate(NoShadowingOrOverridesOnMethodsRule.java:40)
at com.carrotsearch.randomizedtesting.rules.StatementAdapter.evaluate(StatementAdapter.java:36)
at com.carrotsearch.randomizedtesting.rules.StatementAdapter.evaluate(StatementAdapter.java:36)
at com.carrotsearch.randomizedtesting.rules.StatementAdapter.evaluate(StatementAdapter.java:36)
at org.apache.lucene.util.TestRuleAssertionsRequired$1.evaluate(TestRuleAssertionsRequired.java:53)
at org.apache.lucene.util.TestRuleMarkFailure$1.evaluate(TestRuleMarkFailure.java:47)
at org.apache.lucene.util.TestRuleIgnoreAfterMaxFailures$1.evaluate(TestRuleIgnoreAfterMaxFailures.java:64)
at org.apache.lucene.util.TestRuleIgnoreTestSuites$1.evaluate(TestRuleIgnoreTestSuites.java:54)
at com.carrotsearch.randomizedtesting.rules.StatementAdapter.evaluate(StatementAdapter.java:36)
at com.carrotsearch.randomizedtesting.ThreadLeakControl$StatementRunner.run(ThreadLeakControl.java:367)
at java.lang.Thread.run(Thread.java:804)
Build Log:
[...truncated 537 lines...]
[junit4] Suite: org.apache.lucene.search.TestRegexpRandom2
[junit4] 2> NOTE: reproduce with: ant test -Dtestcase=TestRegexpRandom2 -Dtests.method=testRegexps -Dtests.seed=A2BABF3F6475CABA -Dtests.multiplier=3 -Dtests.slow=true -Dtests.locale=el -Dtests.timezone=America/Yakutat -Dtests.asserts=true -Dtests.file.encoding=ISO-8859-1
[junit4] ERROR 6.47s J2 | TestRegexpRandom2.testRegexps <<<
[junit4] > Throwable #1: java.lang.ArrayIndexOutOfBoundsException: 7
[junit4] > at __randomizedtesting.SeedInfo.seed([A2BABF3F6475CABA:43E6FE2EBADF9D32]:0)
[junit4] > at org.apache.lucene.util.automaton.MinimizationOperations.minimize(MinimizationOperations.java:235)
[junit4] > at org.apache.lucene.util.automaton.RegExp.toAutomatonInternal(RegExp.java:515)
[junit4] > at org.apache.lucene.util.automaton.RegExp.toAutomaton(RegExp.java:495)
[junit4] > at org.apache.lucene.util.automaton.RegExp.toAutomaton(RegExp.java:466)
[junit4] > at org.apache.lucene.search.RegexpQuery.<init>(RegexpQuery.java:109)
[junit4] > at org.apache.lucene.search.RegexpQuery.<init>(RegexpQuery.java:79)
[junit4] > at org.apache.lucene.search.TestRegexpRandom2.assertSame(TestRegexpRandom2.java:168)
[junit4] > at org.apache.lucene.search.TestRegexpRandom2.testRegexps(TestRegexpRandom2.java:160)
[junit4] > at java.lang.Thread.run(Thread.java:804)
[junit4] 2> NOTE: test params are: codec=Asserting(Lucene60): {=PostingsFormat(name=Memory doPackFST= false)}, docValues:{=DocValuesFormat(name=Lucene54)}, maxPointsInLeafNode=555, maxMBSortInHeap=6.429668649804494, sim=ClassicSimilarity, locale=el, timezone=America/Yakutat
[junit4] 2> NOTE: Linux 3.19.0-51-generic amd64/Oracle Corporation 9-ea (64-bit)/cpus=12,threads=1,free=442816736,total=502792192
[junit4] 2> NOTE: All tests run in this JVM: [TestSleepingLockWrapper, TestAttributeSource, TestBufferedChecksum, Test2BPositions, TestCrashCausesCorruptIndex, TestForceMergeForever, TestPointValues, TestLucene60PointFormat, TestBooleanOr, Test2BBinaryDocValues, TestConcurrentMergeScheduler, TestIndexWriterThreadsToSegments, TestTimSorterWorstCase, TestFieldReuse, TestSimpleFSDirectory, TestApproximationSearchEquivalence, TestSparseFixedBitSet, TestBagOfPositions, TestConsistentFieldNumbers, TestPrefixQuery, TestIntBlockPool, TestIndexWriterDeleteByQuery, TestSpanExplanationsOfNonMatches, TestWildcard, TestSearchForDuplicates, TestIndexableField, TestLazyProxSkipping, TestLucene50SegmentInfoFormat, TestBytesStore, TestRegexpRandom2]
[junit4] Completed [102/411 (1!)] on J2 in 6.48s, 1 test, 1 error <<< FAILURES!
[...truncated 1022 lines...]
BUILD FAILED
/home/jenkins/workspace/Lucene-Solr-trunk-Linux/build.xml:740: The following error occurred while executing this line:
/home/jenkins/workspace/Lucene-Solr-trunk-Linux/build.xml:684: The following error occurred while executing this line:
/home/jenkins/workspace/Lucene-Solr-trunk-Linux/build.xml:59: The following error occurred while executing this line:
/home/jenkins/workspace/Lucene-Solr-trunk-Linux/lucene/build.xml:50: The following error occurred while executing this line:
/home/jenkins/workspace/Lucene-Solr-trunk-Linux/lucene/common-build.xml:1457: The following error occurred while executing this line:
/home/jenkins/workspace/Lucene-Solr-trunk-Linux/lucene/common-build.xml:1014: There were test failures: 411 suites (1 ignored), 3423 tests, 1 error, 61 ignored (57 assumptions) [seed: A2BABF3F6475CABA]
Total time: 7 minutes 14 seconds
Build step 'Invoke Ant' marked build as failure
Archiving artifacts
[WARNINGS] Skipping publisher since build result is FAILURE
Recording test results
Email was triggered for: Failure - Any
Sending email for trigger: Failure - Any
[JENKINS] Lucene-Solr-trunk-Linux (64bit/jdk1.8.0_72) - Build #
16072 - Still Failing!
Posted by Policeman Jenkins Server <je...@thetaphi.de>.
Build: http://jenkins.thetaphi.de/job/Lucene-Solr-trunk-Linux/16072/
Java: 64bit/jdk1.8.0_72 -XX:-UseCompressedOops -XX:+UseSerialGC
2 tests failed.
FAILED: org.apache.lucene.index.TestBackwardsCompatibility.testUnsupportedOldIndexes
Error Message:
Cannot find resource: unsupported.5.0.0-cfs.zip
Stack Trace:
java.io.IOException: Cannot find resource: unsupported.5.0.0-cfs.zip
at __randomizedtesting.SeedInfo.seed([58ADAD3F6D267B56:A3569F1CDDBDDC0A]:0)
at org.apache.lucene.util.LuceneTestCase.getDataInputStream(LuceneTestCase.java:1930)
at org.apache.lucene.index.TestBackwardsCompatibility.testUnsupportedOldIndexes(TestBackwardsCompatibility.java:505)
at sun.reflect.NativeMethodAccessorImpl.invoke0(Native Method)
at sun.reflect.NativeMethodAccessorImpl.invoke(NativeMethodAccessorImpl.java:62)
at sun.reflect.DelegatingMethodAccessorImpl.invoke(DelegatingMethodAccessorImpl.java:43)
at java.lang.reflect.Method.invoke(Method.java:498)
at com.carrotsearch.randomizedtesting.RandomizedRunner.invoke(RandomizedRunner.java:1764)
at com.carrotsearch.randomizedtesting.RandomizedRunner$8.evaluate(RandomizedRunner.java:871)
at com.carrotsearch.randomizedtesting.RandomizedRunner$9.evaluate(RandomizedRunner.java:907)
at com.carrotsearch.randomizedtesting.RandomizedRunner$10.evaluate(RandomizedRunner.java:921)
at org.apache.lucene.util.TestRuleSetupTeardownChained$1.evaluate(TestRuleSetupTeardownChained.java:49)
at org.apache.lucene.util.AbstractBeforeAfterRule$1.evaluate(AbstractBeforeAfterRule.java:45)
at org.apache.lucene.util.TestRuleThreadAndTestName$1.evaluate(TestRuleThreadAndTestName.java:48)
at org.apache.lucene.util.TestRuleIgnoreAfterMaxFailures$1.evaluate(TestRuleIgnoreAfterMaxFailures.java:64)
at org.apache.lucene.util.TestRuleMarkFailure$1.evaluate(TestRuleMarkFailure.java:47)
at com.carrotsearch.randomizedtesting.rules.StatementAdapter.evaluate(StatementAdapter.java:36)
at com.carrotsearch.randomizedtesting.ThreadLeakControl$StatementRunner.run(ThreadLeakControl.java:367)
at com.carrotsearch.randomizedtesting.ThreadLeakControl.forkTimeoutingTask(ThreadLeakControl.java:809)
at com.carrotsearch.randomizedtesting.ThreadLeakControl$3.evaluate(ThreadLeakControl.java:460)
at com.carrotsearch.randomizedtesting.RandomizedRunner.runSingleTest(RandomizedRunner.java:880)
at com.carrotsearch.randomizedtesting.RandomizedRunner$5.evaluate(RandomizedRunner.java:781)
at com.carrotsearch.randomizedtesting.RandomizedRunner$6.evaluate(RandomizedRunner.java:816)
at com.carrotsearch.randomizedtesting.RandomizedRunner$7.evaluate(RandomizedRunner.java:827)
at org.apache.lucene.util.AbstractBeforeAfterRule$1.evaluate(AbstractBeforeAfterRule.java:45)
at com.carrotsearch.randomizedtesting.rules.StatementAdapter.evaluate(StatementAdapter.java:36)
at org.apache.lucene.util.TestRuleStoreClassName$1.evaluate(TestRuleStoreClassName.java:41)
at com.carrotsearch.randomizedtesting.rules.NoShadowingOrOverridesOnMethodsRule$1.evaluate(NoShadowingOrOverridesOnMethodsRule.java:40)
at com.carrotsearch.randomizedtesting.rules.NoShadowingOrOverridesOnMethodsRule$1.evaluate(NoShadowingOrOverridesOnMethodsRule.java:40)
at com.carrotsearch.randomizedtesting.rules.StatementAdapter.evaluate(StatementAdapter.java:36)
at com.carrotsearch.randomizedtesting.rules.StatementAdapter.evaluate(StatementAdapter.java:36)
at com.carrotsearch.randomizedtesting.rules.StatementAdapter.evaluate(StatementAdapter.java:36)
at org.apache.lucene.util.TestRuleAssertionsRequired$1.evaluate(TestRuleAssertionsRequired.java:53)
at org.apache.lucene.util.TestRuleMarkFailure$1.evaluate(TestRuleMarkFailure.java:47)
at org.apache.lucene.util.TestRuleIgnoreAfterMaxFailures$1.evaluate(TestRuleIgnoreAfterMaxFailures.java:64)
at org.apache.lucene.util.TestRuleIgnoreTestSuites$1.evaluate(TestRuleIgnoreTestSuites.java:54)
at com.carrotsearch.randomizedtesting.rules.StatementAdapter.evaluate(StatementAdapter.java:36)
at com.carrotsearch.randomizedtesting.ThreadLeakControl$StatementRunner.run(ThreadLeakControl.java:367)
at java.lang.Thread.run(Thread.java:745)
FAILED: org.apache.lucene.index.TestBackwardsCompatibility.testAllVersionsTested
Error Message:
Missing backcompat test files: 5.0.0-cfs 5.1.0-cfs 5.2.0-cfs 5.2.1-cfs 5.3.0-cfs 5.3.1-cfs 5.3.2-cfs 5.4.0-cfs 5.4.1-cfs 5.5.0-cfs
Stack Trace:
java.lang.AssertionError: Missing backcompat test files:
5.0.0-cfs
5.1.0-cfs
5.2.0-cfs
5.2.1-cfs
5.3.0-cfs
5.3.1-cfs
5.3.2-cfs
5.4.0-cfs
5.4.1-cfs
5.5.0-cfs
at __randomizedtesting.SeedInfo.seed([58ADAD3F6D267B56:4872427FD9B16D7A]:0)
at org.junit.Assert.fail(Assert.java:93)
at org.apache.lucene.index.TestBackwardsCompatibility.testAllVersionsTested(TestBackwardsCompatibility.java:495)
at sun.reflect.NativeMethodAccessorImpl.invoke0(Native Method)
at sun.reflect.NativeMethodAccessorImpl.invoke(NativeMethodAccessorImpl.java:62)
at sun.reflect.DelegatingMethodAccessorImpl.invoke(DelegatingMethodAccessorImpl.java:43)
at java.lang.reflect.Method.invoke(Method.java:498)
at com.carrotsearch.randomizedtesting.RandomizedRunner.invoke(RandomizedRunner.java:1764)
at com.carrotsearch.randomizedtesting.RandomizedRunner$8.evaluate(RandomizedRunner.java:871)
at com.carrotsearch.randomizedtesting.RandomizedRunner$9.evaluate(RandomizedRunner.java:907)
at com.carrotsearch.randomizedtesting.RandomizedRunner$10.evaluate(RandomizedRunner.java:921)
at org.apache.lucene.util.TestRuleSetupTeardownChained$1.evaluate(TestRuleSetupTeardownChained.java:49)
at org.apache.lucene.util.AbstractBeforeAfterRule$1.evaluate(AbstractBeforeAfterRule.java:45)
at org.apache.lucene.util.TestRuleThreadAndTestName$1.evaluate(TestRuleThreadAndTestName.java:48)
at org.apache.lucene.util.TestRuleIgnoreAfterMaxFailures$1.evaluate(TestRuleIgnoreAfterMaxFailures.java:64)
at org.apache.lucene.util.TestRuleMarkFailure$1.evaluate(TestRuleMarkFailure.java:47)
at com.carrotsearch.randomizedtesting.rules.StatementAdapter.evaluate(StatementAdapter.java:36)
at com.carrotsearch.randomizedtesting.ThreadLeakControl$StatementRunner.run(ThreadLeakControl.java:367)
at com.carrotsearch.randomizedtesting.ThreadLeakControl.forkTimeoutingTask(ThreadLeakControl.java:809)
at com.carrotsearch.randomizedtesting.ThreadLeakControl$3.evaluate(ThreadLeakControl.java:460)
at com.carrotsearch.randomizedtesting.RandomizedRunner.runSingleTest(RandomizedRunner.java:880)
at com.carrotsearch.randomizedtesting.RandomizedRunner$5.evaluate(RandomizedRunner.java:781)
at com.carrotsearch.randomizedtesting.RandomizedRunner$6.evaluate(RandomizedRunner.java:816)
at com.carrotsearch.randomizedtesting.RandomizedRunner$7.evaluate(RandomizedRunner.java:827)
at org.apache.lucene.util.AbstractBeforeAfterRule$1.evaluate(AbstractBeforeAfterRule.java:45)
at com.carrotsearch.randomizedtesting.rules.StatementAdapter.evaluate(StatementAdapter.java:36)
at org.apache.lucene.util.TestRuleStoreClassName$1.evaluate(TestRuleStoreClassName.java:41)
at com.carrotsearch.randomizedtesting.rules.NoShadowingOrOverridesOnMethodsRule$1.evaluate(NoShadowingOrOverridesOnMethodsRule.java:40)
at com.carrotsearch.randomizedtesting.rules.NoShadowingOrOverridesOnMethodsRule$1.evaluate(NoShadowingOrOverridesOnMethodsRule.java:40)
at com.carrotsearch.randomizedtesting.rules.StatementAdapter.evaluate(StatementAdapter.java:36)
at com.carrotsearch.randomizedtesting.rules.StatementAdapter.evaluate(StatementAdapter.java:36)
at com.carrotsearch.randomizedtesting.rules.StatementAdapter.evaluate(StatementAdapter.java:36)
at org.apache.lucene.util.TestRuleAssertionsRequired$1.evaluate(TestRuleAssertionsRequired.java:53)
at org.apache.lucene.util.TestRuleMarkFailure$1.evaluate(TestRuleMarkFailure.java:47)
at org.apache.lucene.util.TestRuleIgnoreAfterMaxFailures$1.evaluate(TestRuleIgnoreAfterMaxFailures.java:64)
at org.apache.lucene.util.TestRuleIgnoreTestSuites$1.evaluate(TestRuleIgnoreTestSuites.java:54)
at com.carrotsearch.randomizedtesting.rules.StatementAdapter.evaluate(StatementAdapter.java:36)
at com.carrotsearch.randomizedtesting.ThreadLeakControl$StatementRunner.run(ThreadLeakControl.java:367)
at java.lang.Thread.run(Thread.java:745)
Build Log:
[...truncated 4225 lines...]
[junit4] Suite: org.apache.lucene.index.TestBackwardsCompatibility
[junit4] 2> NOTE: reproduce with: ant test -Dtestcase=TestBackwardsCompatibility -Dtests.method=testUnsupportedOldIndexes -Dtests.seed=58ADAD3F6D267B56 -Dtests.multiplier=3 -Dtests.slow=true -Dtests.locale=ko -Dtests.timezone=Antarctica/DumontDUrville -Dtests.asserts=true -Dtests.file.encoding=ISO-8859-1
[junit4] ERROR 1.31s J0 | TestBackwardsCompatibility.testUnsupportedOldIndexes <<<
[junit4] > Throwable #1: java.io.IOException: Cannot find resource: unsupported.5.0.0-cfs.zip
[junit4] > at __randomizedtesting.SeedInfo.seed([58ADAD3F6D267B56:A3569F1CDDBDDC0A]:0)
[junit4] > at org.apache.lucene.util.LuceneTestCase.getDataInputStream(LuceneTestCase.java:1930)
[junit4] > at org.apache.lucene.index.TestBackwardsCompatibility.testUnsupportedOldIndexes(TestBackwardsCompatibility.java:505)
[junit4] > at java.lang.Thread.run(Thread.java:745)
[junit4] IGNOR/A 0.01s J0 | TestBackwardsCompatibility.testCreateMoreTermsIndex
[junit4] > Assumption #1: backcompat creation tests must be run with -Dtests.bwcdir=/path/to/write/indexes
[junit4] IGNOR/A 0.00s J0 | TestBackwardsCompatibility.testCreateSingleSegmentCFS
[junit4] > Assumption #1: backcompat creation tests must be run with -Dtests.bwcdir=/path/to/write/indexes
[junit4] IGNOR/A 0.00s J0 | TestBackwardsCompatibility.testCreateNoCFS
[junit4] > Assumption #1: backcompat creation tests must be run with -Dtests.bwcdir=/path/to/write/indexes
[junit4] 2> NOTE: reproduce with: ant test -Dtestcase=TestBackwardsCompatibility -Dtests.method=testAllVersionsTested -Dtests.seed=58ADAD3F6D267B56 -Dtests.multiplier=3 -Dtests.slow=true -Dtests.locale=ko -Dtests.timezone=Antarctica/DumontDUrville -Dtests.asserts=true -Dtests.file.encoding=ISO-8859-1
[junit4] FAILURE 0.00s J0 | TestBackwardsCompatibility.testAllVersionsTested <<<
[junit4] > Throwable #1: java.lang.AssertionError: Missing backcompat test files:
[junit4] > 5.0.0-cfs
[junit4] > 5.1.0-cfs
[junit4] > 5.2.0-cfs
[junit4] > 5.2.1-cfs
[junit4] > 5.3.0-cfs
[junit4] > 5.3.1-cfs
[junit4] > 5.3.2-cfs
[junit4] > 5.4.0-cfs
[junit4] > 5.4.1-cfs
[junit4] > 5.5.0-cfs
[junit4] > at __randomizedtesting.SeedInfo.seed([58ADAD3F6D267B56:4872427FD9B16D7A]:0)
[junit4] > at org.apache.lucene.index.TestBackwardsCompatibility.testAllVersionsTested(TestBackwardsCompatibility.java:495)
[junit4] > at java.lang.Thread.run(Thread.java:745)
[junit4] IGNOR/A 0.01s J0 | TestBackwardsCompatibility.testCreateSingleSegmentNoCFS
[junit4] > Assumption #1: backcompat creation tests must be run with -Dtests.bwcdir=/path/to/write/indexes
[junit4] IGNOR/A 0.01s J0 | TestBackwardsCompatibility.testCreateCFS
[junit4] > Assumption #1: backcompat creation tests must be run with -Dtests.bwcdir=/path/to/write/indexes
[junit4] IGNOR/A 0.01s J0 | TestBackwardsCompatibility.testCreateIndexWithDocValuesUpdates
[junit4] > Assumption #1: backcompat creation tests must be run with -Dtests.bwcdir=/path/to/write/indexes
[junit4] 2> NOTE: leaving temporary files on disk at: /home/jenkins/workspace/Lucene-Solr-trunk-Linux/lucene/build/backward-codecs/test/J0/temp/lucene.index.TestBackwardsCompatibility_58ADAD3F6D267B56-001
[junit4] 2> NOTE: test params are: codec=CheapBastard, sim=ClassicSimilarity, locale=ko, timezone=Antarctica/DumontDUrville
[junit4] 2> NOTE: Linux 3.19.0-51-generic amd64/Oracle Corporation 1.8.0_72 (64-bit)/cpus=12,threads=1,free=489522480,total=508887040
[junit4] 2> NOTE: All tests run in this JVM: [TestBackwardsCompatibility]
[junit4] Completed [2/4 (1!)] on J0 in 4.98s, 27 tests, 1 failure, 1 error, 6 skipped <<< FAILURES!
[...truncated 28 lines...]
BUILD FAILED
/home/jenkins/workspace/Lucene-Solr-trunk-Linux/build.xml:740: The following error occurred while executing this line:
/home/jenkins/workspace/Lucene-Solr-trunk-Linux/build.xml:684: The following error occurred while executing this line:
/home/jenkins/workspace/Lucene-Solr-trunk-Linux/build.xml:59: The following error occurred while executing this line:
/home/jenkins/workspace/Lucene-Solr-trunk-Linux/lucene/build.xml:476: The following error occurred while executing this line:
/home/jenkins/workspace/Lucene-Solr-trunk-Linux/lucene/common-build.xml:2187: The following error occurred while executing this line:
/home/jenkins/workspace/Lucene-Solr-trunk-Linux/lucene/module-build.xml:58: The following error occurred while executing this line:
/home/jenkins/workspace/Lucene-Solr-trunk-Linux/lucene/common-build.xml:1457: The following error occurred while executing this line:
/home/jenkins/workspace/Lucene-Solr-trunk-Linux/lucene/common-build.xml:1014: There were test failures: 4 suites, 152 tests, 1 error, 1 failure, 11 ignored (11 assumptions) [seed: 58ADAD3F6D267B56]
Total time: 11 minutes 33 seconds
Build step 'Invoke Ant' marked build as failure
Archiving artifacts
[WARNINGS] Skipping publisher since build result is FAILURE
Recording test results
Email was triggered for: Failure - Any
Sending email for trigger: Failure - Any
Re: [JENKINS] Lucene-Solr-trunk-Linux (64bit/jdk1.8.0_72) - Build #
16071 - Still Failing!
Posted by Michael McCandless <lu...@mikemccandless.com>.
I'm working on this...
Mike McCandless
http://blog.mikemccandless.com
On Wed, Mar 2, 2016 at 5:15 AM, Policeman Jenkins Server
<je...@thetaphi.de> wrote:
> Build: http://jenkins.thetaphi.de/job/Lucene-Solr-trunk-Linux/16071/
> Java: 64bit/jdk1.8.0_72 -XX:+UseCompressedOops -XX:+UseConcMarkSweepGC
>
> 2 tests failed.
> FAILED: org.apache.lucene.index.TestBackwardsCompatibility.testAllVersionsTested
>
> Error Message:
> Missing backcompat test files: 5.0.0-cfs 5.1.0-cfs 5.2.0-cfs 5.2.1-cfs 5.3.0-cfs 5.3.1-cfs 5.3.2-cfs 5.4.0-cfs 5.4.1-cfs 5.5.0-cfs
>
> Stack Trace:
> java.lang.AssertionError: Missing backcompat test files:
> 5.0.0-cfs
> 5.1.0-cfs
> 5.2.0-cfs
> 5.2.1-cfs
> 5.3.0-cfs
> 5.3.1-cfs
> 5.3.2-cfs
> 5.4.0-cfs
> 5.4.1-cfs
> 5.5.0-cfs
>
> at __randomizedtesting.SeedInfo.seed([45D38B2EC2376FC8:550C646E76A079E4]:0)
> at org.junit.Assert.fail(Assert.java:93)
> at org.apache.lucene.index.TestBackwardsCompatibility.testAllVersionsTested(TestBackwardsCompatibility.java:495)
> at sun.reflect.NativeMethodAccessorImpl.invoke0(Native Method)
> at sun.reflect.NativeMethodAccessorImpl.invoke(NativeMethodAccessorImpl.java:62)
> at sun.reflect.DelegatingMethodAccessorImpl.invoke(DelegatingMethodAccessorImpl.java:43)
> at java.lang.reflect.Method.invoke(Method.java:498)
> at com.carrotsearch.randomizedtesting.RandomizedRunner.invoke(RandomizedRunner.java:1764)
> at com.carrotsearch.randomizedtesting.RandomizedRunner$8.evaluate(RandomizedRunner.java:871)
> at com.carrotsearch.randomizedtesting.RandomizedRunner$9.evaluate(RandomizedRunner.java:907)
> at com.carrotsearch.randomizedtesting.RandomizedRunner$10.evaluate(RandomizedRunner.java:921)
> at org.apache.lucene.util.TestRuleSetupTeardownChained$1.evaluate(TestRuleSetupTeardownChained.java:49)
> at org.apache.lucene.util.AbstractBeforeAfterRule$1.evaluate(AbstractBeforeAfterRule.java:45)
> at org.apache.lucene.util.TestRuleThreadAndTestName$1.evaluate(TestRuleThreadAndTestName.java:48)
> at org.apache.lucene.util.TestRuleIgnoreAfterMaxFailures$1.evaluate(TestRuleIgnoreAfterMaxFailures.java:64)
> at org.apache.lucene.util.TestRuleMarkFailure$1.evaluate(TestRuleMarkFailure.java:47)
> at com.carrotsearch.randomizedtesting.rules.StatementAdapter.evaluate(StatementAdapter.java:36)
> at com.carrotsearch.randomizedtesting.ThreadLeakControl$StatementRunner.run(ThreadLeakControl.java:367)
> at com.carrotsearch.randomizedtesting.ThreadLeakControl.forkTimeoutingTask(ThreadLeakControl.java:809)
> at com.carrotsearch.randomizedtesting.ThreadLeakControl$3.evaluate(ThreadLeakControl.java:460)
> at com.carrotsearch.randomizedtesting.RandomizedRunner.runSingleTest(RandomizedRunner.java:880)
> at com.carrotsearch.randomizedtesting.RandomizedRunner$5.evaluate(RandomizedRunner.java:781)
> at com.carrotsearch.randomizedtesting.RandomizedRunner$6.evaluate(RandomizedRunner.java:816)
> at com.carrotsearch.randomizedtesting.RandomizedRunner$7.evaluate(RandomizedRunner.java:827)
> at org.apache.lucene.util.AbstractBeforeAfterRule$1.evaluate(AbstractBeforeAfterRule.java:45)
> at com.carrotsearch.randomizedtesting.rules.StatementAdapter.evaluate(StatementAdapter.java:36)
> at org.apache.lucene.util.TestRuleStoreClassName$1.evaluate(TestRuleStoreClassName.java:41)
> at com.carrotsearch.randomizedtesting.rules.NoShadowingOrOverridesOnMethodsRule$1.evaluate(NoShadowingOrOverridesOnMethodsRule.java:40)
> at com.carrotsearch.randomizedtesting.rules.NoShadowingOrOverridesOnMethodsRule$1.evaluate(NoShadowingOrOverridesOnMethodsRule.java:40)
> at com.carrotsearch.randomizedtesting.rules.StatementAdapter.evaluate(StatementAdapter.java:36)
> at com.carrotsearch.randomizedtesting.rules.StatementAdapter.evaluate(StatementAdapter.java:36)
> at com.carrotsearch.randomizedtesting.rules.StatementAdapter.evaluate(StatementAdapter.java:36)
> at org.apache.lucene.util.TestRuleAssertionsRequired$1.evaluate(TestRuleAssertionsRequired.java:53)
> at org.apache.lucene.util.TestRuleMarkFailure$1.evaluate(TestRuleMarkFailure.java:47)
> at org.apache.lucene.util.TestRuleIgnoreAfterMaxFailures$1.evaluate(TestRuleIgnoreAfterMaxFailures.java:64)
> at org.apache.lucene.util.TestRuleIgnoreTestSuites$1.evaluate(TestRuleIgnoreTestSuites.java:54)
> at com.carrotsearch.randomizedtesting.rules.StatementAdapter.evaluate(StatementAdapter.java:36)
> at com.carrotsearch.randomizedtesting.ThreadLeakControl$StatementRunner.run(ThreadLeakControl.java:367)
> at java.lang.Thread.run(Thread.java:745)
>
>
> FAILED: org.apache.lucene.index.TestBackwardsCompatibility.testUnsupportedOldIndexes
>
> Error Message:
> Cannot find resource: unsupported.5.0.0-cfs.zip
>
> Stack Trace:
> java.io.IOException: Cannot find resource: unsupported.5.0.0-cfs.zip
> at __randomizedtesting.SeedInfo.seed([45D38B2EC2376FC8:BE28B90D72ACC894]:0)
> at org.apache.lucene.util.LuceneTestCase.getDataInputStream(LuceneTestCase.java:1930)
> at org.apache.lucene.index.TestBackwardsCompatibility.testUnsupportedOldIndexes(TestBackwardsCompatibility.java:505)
> at sun.reflect.NativeMethodAccessorImpl.invoke0(Native Method)
> at sun.reflect.NativeMethodAccessorImpl.invoke(NativeMethodAccessorImpl.java:62)
> at sun.reflect.DelegatingMethodAccessorImpl.invoke(DelegatingMethodAccessorImpl.java:43)
> at java.lang.reflect.Method.invoke(Method.java:498)
> at com.carrotsearch.randomizedtesting.RandomizedRunner.invoke(RandomizedRunner.java:1764)
> at com.carrotsearch.randomizedtesting.RandomizedRunner$8.evaluate(RandomizedRunner.java:871)
> at com.carrotsearch.randomizedtesting.RandomizedRunner$9.evaluate(RandomizedRunner.java:907)
> at com.carrotsearch.randomizedtesting.RandomizedRunner$10.evaluate(RandomizedRunner.java:921)
> at org.apache.lucene.util.TestRuleSetupTeardownChained$1.evaluate(TestRuleSetupTeardownChained.java:49)
> at org.apache.lucene.util.AbstractBeforeAfterRule$1.evaluate(AbstractBeforeAfterRule.java:45)
> at org.apache.lucene.util.TestRuleThreadAndTestName$1.evaluate(TestRuleThreadAndTestName.java:48)
> at org.apache.lucene.util.TestRuleIgnoreAfterMaxFailures$1.evaluate(TestRuleIgnoreAfterMaxFailures.java:64)
> at org.apache.lucene.util.TestRuleMarkFailure$1.evaluate(TestRuleMarkFailure.java:47)
> at com.carrotsearch.randomizedtesting.rules.StatementAdapter.evaluate(StatementAdapter.java:36)
> at com.carrotsearch.randomizedtesting.ThreadLeakControl$StatementRunner.run(ThreadLeakControl.java:367)
> at com.carrotsearch.randomizedtesting.ThreadLeakControl.forkTimeoutingTask(ThreadLeakControl.java:809)
> at com.carrotsearch.randomizedtesting.ThreadLeakControl$3.evaluate(ThreadLeakControl.java:460)
> at com.carrotsearch.randomizedtesting.RandomizedRunner.runSingleTest(RandomizedRunner.java:880)
> at com.carrotsearch.randomizedtesting.RandomizedRunner$5.evaluate(RandomizedRunner.java:781)
> at com.carrotsearch.randomizedtesting.RandomizedRunner$6.evaluate(RandomizedRunner.java:816)
> at com.carrotsearch.randomizedtesting.RandomizedRunner$7.evaluate(RandomizedRunner.java:827)
> at org.apache.lucene.util.AbstractBeforeAfterRule$1.evaluate(AbstractBeforeAfterRule.java:45)
> at com.carrotsearch.randomizedtesting.rules.StatementAdapter.evaluate(StatementAdapter.java:36)
> at org.apache.lucene.util.TestRuleStoreClassName$1.evaluate(TestRuleStoreClassName.java:41)
> at com.carrotsearch.randomizedtesting.rules.NoShadowingOrOverridesOnMethodsRule$1.evaluate(NoShadowingOrOverridesOnMethodsRule.java:40)
> at com.carrotsearch.randomizedtesting.rules.NoShadowingOrOverridesOnMethodsRule$1.evaluate(NoShadowingOrOverridesOnMethodsRule.java:40)
> at com.carrotsearch.randomizedtesting.rules.StatementAdapter.evaluate(StatementAdapter.java:36)
> at com.carrotsearch.randomizedtesting.rules.StatementAdapter.evaluate(StatementAdapter.java:36)
> at com.carrotsearch.randomizedtesting.rules.StatementAdapter.evaluate(StatementAdapter.java:36)
> at org.apache.lucene.util.TestRuleAssertionsRequired$1.evaluate(TestRuleAssertionsRequired.java:53)
> at org.apache.lucene.util.TestRuleMarkFailure$1.evaluate(TestRuleMarkFailure.java:47)
> at org.apache.lucene.util.TestRuleIgnoreAfterMaxFailures$1.evaluate(TestRuleIgnoreAfterMaxFailures.java:64)
> at org.apache.lucene.util.TestRuleIgnoreTestSuites$1.evaluate(TestRuleIgnoreTestSuites.java:54)
> at com.carrotsearch.randomizedtesting.rules.StatementAdapter.evaluate(StatementAdapter.java:36)
> at com.carrotsearch.randomizedtesting.ThreadLeakControl$StatementRunner.run(ThreadLeakControl.java:367)
> at java.lang.Thread.run(Thread.java:745)
>
>
>
>
> Build Log:
> [...truncated 4240 lines...]
> [junit4] Suite: org.apache.lucene.index.TestBackwardsCompatibility
> [junit4] IGNOR/A 0.01s J2 | TestBackwardsCompatibility.testCreateIndexWithDocValuesUpdates
> [junit4] > Assumption #1: backcompat creation tests must be run with -Dtests.bwcdir=/path/to/write/indexes
> [junit4] IGNOR/A 0.00s J2 | TestBackwardsCompatibility.testCreateMoreTermsIndex
> [junit4] > Assumption #1: backcompat creation tests must be run with -Dtests.bwcdir=/path/to/write/indexes
> [junit4] 2> NOTE: reproduce with: ant test -Dtestcase=TestBackwardsCompatibility -Dtests.method=testAllVersionsTested -Dtests.seed=45D38B2EC2376FC8 -Dtests.multiplier=3 -Dtests.slow=true -Dtests.locale=be -Dtests.timezone=Africa/Lome -Dtests.asserts=true -Dtests.file.encoding=UTF-8
> [junit4] FAILURE 0.01s J2 | TestBackwardsCompatibility.testAllVersionsTested <<<
> [junit4] > Throwable #1: java.lang.AssertionError: Missing backcompat test files:
> [junit4] > 5.0.0-cfs
> [junit4] > 5.1.0-cfs
> [junit4] > 5.2.0-cfs
> [junit4] > 5.2.1-cfs
> [junit4] > 5.3.0-cfs
> [junit4] > 5.3.1-cfs
> [junit4] > 5.3.2-cfs
> [junit4] > 5.4.0-cfs
> [junit4] > 5.4.1-cfs
> [junit4] > 5.5.0-cfs
> [junit4] > at __randomizedtesting.SeedInfo.seed([45D38B2EC2376FC8:550C646E76A079E4]:0)
> [junit4] > at org.apache.lucene.index.TestBackwardsCompatibility.testAllVersionsTested(TestBackwardsCompatibility.java:495)
> [junit4] > at java.lang.Thread.run(Thread.java:745)
> [junit4] 2> NOTE: reproduce with: ant test -Dtestcase=TestBackwardsCompatibility -Dtests.method=testUnsupportedOldIndexes -Dtests.seed=45D38B2EC2376FC8 -Dtests.multiplier=3 -Dtests.slow=true -Dtests.locale=be -Dtests.timezone=Africa/Lome -Dtests.asserts=true -Dtests.file.encoding=UTF-8
> [junit4] ERROR 1.59s J2 | TestBackwardsCompatibility.testUnsupportedOldIndexes <<<
> [junit4] > Throwable #1: java.io.IOException: Cannot find resource: unsupported.5.0.0-cfs.zip
> [junit4] > at __randomizedtesting.SeedInfo.seed([45D38B2EC2376FC8:BE28B90D72ACC894]:0)
> [junit4] > at org.apache.lucene.util.LuceneTestCase.getDataInputStream(LuceneTestCase.java:1930)
> [junit4] > at org.apache.lucene.index.TestBackwardsCompatibility.testUnsupportedOldIndexes(TestBackwardsCompatibility.java:505)
> [junit4] > at java.lang.Thread.run(Thread.java:745)
> [junit4] IGNOR/A 0.00s J2 | TestBackwardsCompatibility.testCreateCFS
> [junit4] > Assumption #1: backcompat creation tests must be run with -Dtests.bwcdir=/path/to/write/indexes
> [junit4] IGNOR/A 0.00s J2 | TestBackwardsCompatibility.testCreateNoCFS
> [junit4] > Assumption #1: backcompat creation tests must be run with -Dtests.bwcdir=/path/to/write/indexes
> [junit4] IGNOR/A 0.00s J2 | TestBackwardsCompatibility.testCreateSingleSegmentNoCFS
> [junit4] > Assumption #1: backcompat creation tests must be run with -Dtests.bwcdir=/path/to/write/indexes
> [junit4] IGNOR/A 0.00s J2 | TestBackwardsCompatibility.testCreateSingleSegmentCFS
> [junit4] > Assumption #1: backcompat creation tests must be run with -Dtests.bwcdir=/path/to/write/indexes
> [junit4] 2> NOTE: leaving temporary files on disk at: /home/jenkins/workspace/Lucene-Solr-trunk-Linux/lucene/build/backward-codecs/test/J2/temp/lucene.index.TestBackwardsCompatibility_45D38B2EC2376FC8-001
> [junit4] 2> NOTE: test params are: codec=FastCompressingStoredFields(storedFieldsFormat=CompressingStoredFieldsFormat(compressionMode=FAST, chunkSize=1, maxDocsPerChunk=4, blockSize=2), termVectorsFormat=CompressingTermVectorsFormat(compressionMode=FAST, chunkSize=1, blockSize=2)), sim=ClassicSimilarity, locale=be, timezone=Africa/Lome
> [junit4] 2> NOTE: Linux 3.19.0-51-generic amd64/Oracle Corporation 1.8.0_72 (64-bit)/cpus=12,threads=1,free=411336536,total=508887040
> [junit4] 2> NOTE: All tests run in this JVM: [TestMaxPositionInOldIndex, TestBackwardsCompatibility]
> [junit4] Completed [2/4 (1!)] on J2 in 4.40s, 27 tests, 1 failure, 1 error, 6 skipped <<< FAILURES!
>
> [...truncated 28 lines...]
> BUILD FAILED
> /home/jenkins/workspace/Lucene-Solr-trunk-Linux/build.xml:740: The following error occurred while executing this line:
> /home/jenkins/workspace/Lucene-Solr-trunk-Linux/build.xml:684: The following error occurred while executing this line:
> /home/jenkins/workspace/Lucene-Solr-trunk-Linux/build.xml:59: The following error occurred while executing this line:
> /home/jenkins/workspace/Lucene-Solr-trunk-Linux/lucene/build.xml:476: The following error occurred while executing this line:
> /home/jenkins/workspace/Lucene-Solr-trunk-Linux/lucene/common-build.xml:2187: The following error occurred while executing this line:
> /home/jenkins/workspace/Lucene-Solr-trunk-Linux/lucene/module-build.xml:58: The following error occurred while executing this line:
> /home/jenkins/workspace/Lucene-Solr-trunk-Linux/lucene/common-build.xml:1457: The following error occurred while executing this line:
> /home/jenkins/workspace/Lucene-Solr-trunk-Linux/lucene/common-build.xml:1014: There were test failures: 4 suites, 152 tests, 1 error, 1 failure, 11 ignored (11 assumptions) [seed: 45D38B2EC2376FC8]
>
> Total time: 11 minutes 21 seconds
> Build step 'Invoke Ant' marked build as failure
> Archiving artifacts
> [WARNINGS] Skipping publisher since build result is FAILURE
> Recording test results
> Email was triggered for: Failure - Any
> Sending email for trigger: Failure - Any
>
>
>
>
> ---------------------------------------------------------------------
> To unsubscribe, e-mail: dev-unsubscribe@lucene.apache.org
> For additional commands, e-mail: dev-help@lucene.apache.org
---------------------------------------------------------------------
To unsubscribe, e-mail: dev-unsubscribe@lucene.apache.org
For additional commands, e-mail: dev-help@lucene.apache.org
[JENKINS] Lucene-Solr-trunk-Linux (64bit/jdk1.8.0_72) - Build #
16071 - Still Failing!
Posted by Policeman Jenkins Server <je...@thetaphi.de>.
Build: http://jenkins.thetaphi.de/job/Lucene-Solr-trunk-Linux/16071/
Java: 64bit/jdk1.8.0_72 -XX:+UseCompressedOops -XX:+UseConcMarkSweepGC
2 tests failed.
FAILED: org.apache.lucene.index.TestBackwardsCompatibility.testAllVersionsTested
Error Message:
Missing backcompat test files: 5.0.0-cfs 5.1.0-cfs 5.2.0-cfs 5.2.1-cfs 5.3.0-cfs 5.3.1-cfs 5.3.2-cfs 5.4.0-cfs 5.4.1-cfs 5.5.0-cfs
Stack Trace:
java.lang.AssertionError: Missing backcompat test files:
5.0.0-cfs
5.1.0-cfs
5.2.0-cfs
5.2.1-cfs
5.3.0-cfs
5.3.1-cfs
5.3.2-cfs
5.4.0-cfs
5.4.1-cfs
5.5.0-cfs
at __randomizedtesting.SeedInfo.seed([45D38B2EC2376FC8:550C646E76A079E4]:0)
at org.junit.Assert.fail(Assert.java:93)
at org.apache.lucene.index.TestBackwardsCompatibility.testAllVersionsTested(TestBackwardsCompatibility.java:495)
at sun.reflect.NativeMethodAccessorImpl.invoke0(Native Method)
at sun.reflect.NativeMethodAccessorImpl.invoke(NativeMethodAccessorImpl.java:62)
at sun.reflect.DelegatingMethodAccessorImpl.invoke(DelegatingMethodAccessorImpl.java:43)
at java.lang.reflect.Method.invoke(Method.java:498)
at com.carrotsearch.randomizedtesting.RandomizedRunner.invoke(RandomizedRunner.java:1764)
at com.carrotsearch.randomizedtesting.RandomizedRunner$8.evaluate(RandomizedRunner.java:871)
at com.carrotsearch.randomizedtesting.RandomizedRunner$9.evaluate(RandomizedRunner.java:907)
at com.carrotsearch.randomizedtesting.RandomizedRunner$10.evaluate(RandomizedRunner.java:921)
at org.apache.lucene.util.TestRuleSetupTeardownChained$1.evaluate(TestRuleSetupTeardownChained.java:49)
at org.apache.lucene.util.AbstractBeforeAfterRule$1.evaluate(AbstractBeforeAfterRule.java:45)
at org.apache.lucene.util.TestRuleThreadAndTestName$1.evaluate(TestRuleThreadAndTestName.java:48)
at org.apache.lucene.util.TestRuleIgnoreAfterMaxFailures$1.evaluate(TestRuleIgnoreAfterMaxFailures.java:64)
at org.apache.lucene.util.TestRuleMarkFailure$1.evaluate(TestRuleMarkFailure.java:47)
at com.carrotsearch.randomizedtesting.rules.StatementAdapter.evaluate(StatementAdapter.java:36)
at com.carrotsearch.randomizedtesting.ThreadLeakControl$StatementRunner.run(ThreadLeakControl.java:367)
at com.carrotsearch.randomizedtesting.ThreadLeakControl.forkTimeoutingTask(ThreadLeakControl.java:809)
at com.carrotsearch.randomizedtesting.ThreadLeakControl$3.evaluate(ThreadLeakControl.java:460)
at com.carrotsearch.randomizedtesting.RandomizedRunner.runSingleTest(RandomizedRunner.java:880)
at com.carrotsearch.randomizedtesting.RandomizedRunner$5.evaluate(RandomizedRunner.java:781)
at com.carrotsearch.randomizedtesting.RandomizedRunner$6.evaluate(RandomizedRunner.java:816)
at com.carrotsearch.randomizedtesting.RandomizedRunner$7.evaluate(RandomizedRunner.java:827)
at org.apache.lucene.util.AbstractBeforeAfterRule$1.evaluate(AbstractBeforeAfterRule.java:45)
at com.carrotsearch.randomizedtesting.rules.StatementAdapter.evaluate(StatementAdapter.java:36)
at org.apache.lucene.util.TestRuleStoreClassName$1.evaluate(TestRuleStoreClassName.java:41)
at com.carrotsearch.randomizedtesting.rules.NoShadowingOrOverridesOnMethodsRule$1.evaluate(NoShadowingOrOverridesOnMethodsRule.java:40)
at com.carrotsearch.randomizedtesting.rules.NoShadowingOrOverridesOnMethodsRule$1.evaluate(NoShadowingOrOverridesOnMethodsRule.java:40)
at com.carrotsearch.randomizedtesting.rules.StatementAdapter.evaluate(StatementAdapter.java:36)
at com.carrotsearch.randomizedtesting.rules.StatementAdapter.evaluate(StatementAdapter.java:36)
at com.carrotsearch.randomizedtesting.rules.StatementAdapter.evaluate(StatementAdapter.java:36)
at org.apache.lucene.util.TestRuleAssertionsRequired$1.evaluate(TestRuleAssertionsRequired.java:53)
at org.apache.lucene.util.TestRuleMarkFailure$1.evaluate(TestRuleMarkFailure.java:47)
at org.apache.lucene.util.TestRuleIgnoreAfterMaxFailures$1.evaluate(TestRuleIgnoreAfterMaxFailures.java:64)
at org.apache.lucene.util.TestRuleIgnoreTestSuites$1.evaluate(TestRuleIgnoreTestSuites.java:54)
at com.carrotsearch.randomizedtesting.rules.StatementAdapter.evaluate(StatementAdapter.java:36)
at com.carrotsearch.randomizedtesting.ThreadLeakControl$StatementRunner.run(ThreadLeakControl.java:367)
at java.lang.Thread.run(Thread.java:745)
FAILED: org.apache.lucene.index.TestBackwardsCompatibility.testUnsupportedOldIndexes
Error Message:
Cannot find resource: unsupported.5.0.0-cfs.zip
Stack Trace:
java.io.IOException: Cannot find resource: unsupported.5.0.0-cfs.zip
at __randomizedtesting.SeedInfo.seed([45D38B2EC2376FC8:BE28B90D72ACC894]:0)
at org.apache.lucene.util.LuceneTestCase.getDataInputStream(LuceneTestCase.java:1930)
at org.apache.lucene.index.TestBackwardsCompatibility.testUnsupportedOldIndexes(TestBackwardsCompatibility.java:505)
at sun.reflect.NativeMethodAccessorImpl.invoke0(Native Method)
at sun.reflect.NativeMethodAccessorImpl.invoke(NativeMethodAccessorImpl.java:62)
at sun.reflect.DelegatingMethodAccessorImpl.invoke(DelegatingMethodAccessorImpl.java:43)
at java.lang.reflect.Method.invoke(Method.java:498)
at com.carrotsearch.randomizedtesting.RandomizedRunner.invoke(RandomizedRunner.java:1764)
at com.carrotsearch.randomizedtesting.RandomizedRunner$8.evaluate(RandomizedRunner.java:871)
at com.carrotsearch.randomizedtesting.RandomizedRunner$9.evaluate(RandomizedRunner.java:907)
at com.carrotsearch.randomizedtesting.RandomizedRunner$10.evaluate(RandomizedRunner.java:921)
at org.apache.lucene.util.TestRuleSetupTeardownChained$1.evaluate(TestRuleSetupTeardownChained.java:49)
at org.apache.lucene.util.AbstractBeforeAfterRule$1.evaluate(AbstractBeforeAfterRule.java:45)
at org.apache.lucene.util.TestRuleThreadAndTestName$1.evaluate(TestRuleThreadAndTestName.java:48)
at org.apache.lucene.util.TestRuleIgnoreAfterMaxFailures$1.evaluate(TestRuleIgnoreAfterMaxFailures.java:64)
at org.apache.lucene.util.TestRuleMarkFailure$1.evaluate(TestRuleMarkFailure.java:47)
at com.carrotsearch.randomizedtesting.rules.StatementAdapter.evaluate(StatementAdapter.java:36)
at com.carrotsearch.randomizedtesting.ThreadLeakControl$StatementRunner.run(ThreadLeakControl.java:367)
at com.carrotsearch.randomizedtesting.ThreadLeakControl.forkTimeoutingTask(ThreadLeakControl.java:809)
at com.carrotsearch.randomizedtesting.ThreadLeakControl$3.evaluate(ThreadLeakControl.java:460)
at com.carrotsearch.randomizedtesting.RandomizedRunner.runSingleTest(RandomizedRunner.java:880)
at com.carrotsearch.randomizedtesting.RandomizedRunner$5.evaluate(RandomizedRunner.java:781)
at com.carrotsearch.randomizedtesting.RandomizedRunner$6.evaluate(RandomizedRunner.java:816)
at com.carrotsearch.randomizedtesting.RandomizedRunner$7.evaluate(RandomizedRunner.java:827)
at org.apache.lucene.util.AbstractBeforeAfterRule$1.evaluate(AbstractBeforeAfterRule.java:45)
at com.carrotsearch.randomizedtesting.rules.StatementAdapter.evaluate(StatementAdapter.java:36)
at org.apache.lucene.util.TestRuleStoreClassName$1.evaluate(TestRuleStoreClassName.java:41)
at com.carrotsearch.randomizedtesting.rules.NoShadowingOrOverridesOnMethodsRule$1.evaluate(NoShadowingOrOverridesOnMethodsRule.java:40)
at com.carrotsearch.randomizedtesting.rules.NoShadowingOrOverridesOnMethodsRule$1.evaluate(NoShadowingOrOverridesOnMethodsRule.java:40)
at com.carrotsearch.randomizedtesting.rules.StatementAdapter.evaluate(StatementAdapter.java:36)
at com.carrotsearch.randomizedtesting.rules.StatementAdapter.evaluate(StatementAdapter.java:36)
at com.carrotsearch.randomizedtesting.rules.StatementAdapter.evaluate(StatementAdapter.java:36)
at org.apache.lucene.util.TestRuleAssertionsRequired$1.evaluate(TestRuleAssertionsRequired.java:53)
at org.apache.lucene.util.TestRuleMarkFailure$1.evaluate(TestRuleMarkFailure.java:47)
at org.apache.lucene.util.TestRuleIgnoreAfterMaxFailures$1.evaluate(TestRuleIgnoreAfterMaxFailures.java:64)
at org.apache.lucene.util.TestRuleIgnoreTestSuites$1.evaluate(TestRuleIgnoreTestSuites.java:54)
at com.carrotsearch.randomizedtesting.rules.StatementAdapter.evaluate(StatementAdapter.java:36)
at com.carrotsearch.randomizedtesting.ThreadLeakControl$StatementRunner.run(ThreadLeakControl.java:367)
at java.lang.Thread.run(Thread.java:745)
Build Log:
[...truncated 4240 lines...]
[junit4] Suite: org.apache.lucene.index.TestBackwardsCompatibility
[junit4] IGNOR/A 0.01s J2 | TestBackwardsCompatibility.testCreateIndexWithDocValuesUpdates
[junit4] > Assumption #1: backcompat creation tests must be run with -Dtests.bwcdir=/path/to/write/indexes
[junit4] IGNOR/A 0.00s J2 | TestBackwardsCompatibility.testCreateMoreTermsIndex
[junit4] > Assumption #1: backcompat creation tests must be run with -Dtests.bwcdir=/path/to/write/indexes
[junit4] 2> NOTE: reproduce with: ant test -Dtestcase=TestBackwardsCompatibility -Dtests.method=testAllVersionsTested -Dtests.seed=45D38B2EC2376FC8 -Dtests.multiplier=3 -Dtests.slow=true -Dtests.locale=be -Dtests.timezone=Africa/Lome -Dtests.asserts=true -Dtests.file.encoding=UTF-8
[junit4] FAILURE 0.01s J2 | TestBackwardsCompatibility.testAllVersionsTested <<<
[junit4] > Throwable #1: java.lang.AssertionError: Missing backcompat test files:
[junit4] > 5.0.0-cfs
[junit4] > 5.1.0-cfs
[junit4] > 5.2.0-cfs
[junit4] > 5.2.1-cfs
[junit4] > 5.3.0-cfs
[junit4] > 5.3.1-cfs
[junit4] > 5.3.2-cfs
[junit4] > 5.4.0-cfs
[junit4] > 5.4.1-cfs
[junit4] > 5.5.0-cfs
[junit4] > at __randomizedtesting.SeedInfo.seed([45D38B2EC2376FC8:550C646E76A079E4]:0)
[junit4] > at org.apache.lucene.index.TestBackwardsCompatibility.testAllVersionsTested(TestBackwardsCompatibility.java:495)
[junit4] > at java.lang.Thread.run(Thread.java:745)
[junit4] 2> NOTE: reproduce with: ant test -Dtestcase=TestBackwardsCompatibility -Dtests.method=testUnsupportedOldIndexes -Dtests.seed=45D38B2EC2376FC8 -Dtests.multiplier=3 -Dtests.slow=true -Dtests.locale=be -Dtests.timezone=Africa/Lome -Dtests.asserts=true -Dtests.file.encoding=UTF-8
[junit4] ERROR 1.59s J2 | TestBackwardsCompatibility.testUnsupportedOldIndexes <<<
[junit4] > Throwable #1: java.io.IOException: Cannot find resource: unsupported.5.0.0-cfs.zip
[junit4] > at __randomizedtesting.SeedInfo.seed([45D38B2EC2376FC8:BE28B90D72ACC894]:0)
[junit4] > at org.apache.lucene.util.LuceneTestCase.getDataInputStream(LuceneTestCase.java:1930)
[junit4] > at org.apache.lucene.index.TestBackwardsCompatibility.testUnsupportedOldIndexes(TestBackwardsCompatibility.java:505)
[junit4] > at java.lang.Thread.run(Thread.java:745)
[junit4] IGNOR/A 0.00s J2 | TestBackwardsCompatibility.testCreateCFS
[junit4] > Assumption #1: backcompat creation tests must be run with -Dtests.bwcdir=/path/to/write/indexes
[junit4] IGNOR/A 0.00s J2 | TestBackwardsCompatibility.testCreateNoCFS
[junit4] > Assumption #1: backcompat creation tests must be run with -Dtests.bwcdir=/path/to/write/indexes
[junit4] IGNOR/A 0.00s J2 | TestBackwardsCompatibility.testCreateSingleSegmentNoCFS
[junit4] > Assumption #1: backcompat creation tests must be run with -Dtests.bwcdir=/path/to/write/indexes
[junit4] IGNOR/A 0.00s J2 | TestBackwardsCompatibility.testCreateSingleSegmentCFS
[junit4] > Assumption #1: backcompat creation tests must be run with -Dtests.bwcdir=/path/to/write/indexes
[junit4] 2> NOTE: leaving temporary files on disk at: /home/jenkins/workspace/Lucene-Solr-trunk-Linux/lucene/build/backward-codecs/test/J2/temp/lucene.index.TestBackwardsCompatibility_45D38B2EC2376FC8-001
[junit4] 2> NOTE: test params are: codec=FastCompressingStoredFields(storedFieldsFormat=CompressingStoredFieldsFormat(compressionMode=FAST, chunkSize=1, maxDocsPerChunk=4, blockSize=2), termVectorsFormat=CompressingTermVectorsFormat(compressionMode=FAST, chunkSize=1, blockSize=2)), sim=ClassicSimilarity, locale=be, timezone=Africa/Lome
[junit4] 2> NOTE: Linux 3.19.0-51-generic amd64/Oracle Corporation 1.8.0_72 (64-bit)/cpus=12,threads=1,free=411336536,total=508887040
[junit4] 2> NOTE: All tests run in this JVM: [TestMaxPositionInOldIndex, TestBackwardsCompatibility]
[junit4] Completed [2/4 (1!)] on J2 in 4.40s, 27 tests, 1 failure, 1 error, 6 skipped <<< FAILURES!
[...truncated 28 lines...]
BUILD FAILED
/home/jenkins/workspace/Lucene-Solr-trunk-Linux/build.xml:740: The following error occurred while executing this line:
/home/jenkins/workspace/Lucene-Solr-trunk-Linux/build.xml:684: The following error occurred while executing this line:
/home/jenkins/workspace/Lucene-Solr-trunk-Linux/build.xml:59: The following error occurred while executing this line:
/home/jenkins/workspace/Lucene-Solr-trunk-Linux/lucene/build.xml:476: The following error occurred while executing this line:
/home/jenkins/workspace/Lucene-Solr-trunk-Linux/lucene/common-build.xml:2187: The following error occurred while executing this line:
/home/jenkins/workspace/Lucene-Solr-trunk-Linux/lucene/module-build.xml:58: The following error occurred while executing this line:
/home/jenkins/workspace/Lucene-Solr-trunk-Linux/lucene/common-build.xml:1457: The following error occurred while executing this line:
/home/jenkins/workspace/Lucene-Solr-trunk-Linux/lucene/common-build.xml:1014: There were test failures: 4 suites, 152 tests, 1 error, 1 failure, 11 ignored (11 assumptions) [seed: 45D38B2EC2376FC8]
Total time: 11 minutes 21 seconds
Build step 'Invoke Ant' marked build as failure
Archiving artifacts
[WARNINGS] Skipping publisher since build result is FAILURE
Recording test results
Email was triggered for: Failure - Any
Sending email for trigger: Failure - Any