You are viewing a plain text version of this content. The canonical link for it is here.
Posted to builds@beam.apache.org by Apache Jenkins Server <je...@builds.apache.org> on 2020/02/12 06:56:06 UTC

Build failed in Jenkins: beam_PerformanceTests_MongoDBIO_IT #2744

See <https://builds.apache.org/job/beam_PerformanceTests_MongoDBIO_IT/2744/display/redirect?page=changes>

Changes:

[ehudm] [BEAM-8095] Remove no_xdist for test

[ehudm] fix lint

[valentyn] Cleanup MappingProxy reducer since dill supports it natively now.


------------------------------------------
[...truncated 208.89 KB...]

Total Jars: 56 (includes project)
Total Time: 9.335s [9335ms]
Average Time/Jar: 0.1666964285714s [166.6964285714ms]
*******************
:sdks:java:harness:shadowJar (Thread[Execution worker for ':' Thread 8,5,main]) completed. Took 9.949 secs.
:runners:java-fn-execution:compileJava (Thread[Execution worker for ':' Thread 8,5,main]) started.

> Task :runners:java-fn-execution:compileJava
Build cache key for task ':runners:java-fn-execution:compileJava' is cb12b7c846fd5a859b37031044078361
Task ':runners:java-fn-execution:compileJava' is not up-to-date because:
  No history is available.
Origin for org.gradle.api.internal.tasks.execution.ExecuteActionsTaskExecuter$TaskExecution@482551f6: {executionTime=24114, hostName=apache-beam-jenkins-8, operatingSystem=Linux, buildInvocationId=dqjerh7mxfe7lo3gajrknncqxa, creationTime=1581418799882, identity=:runners:java-fn-execution:compileJava, type=org.gradle.api.internal.tasks.execution.ExecuteActionsTaskExecuter.TaskExecution, userName=jenkins, gradleVersion=5.2.1, rootPath=/home/jenkins/jenkins-slave/workspace/beam_PostCommit_Python35_VR_Flink/src}
Unpacked trees for task ':runners:java-fn-execution:compileJava' from cache.

> Task :runners:java-fn-execution:compileJava FROM-CACHE
:runners:java-fn-execution:compileJava (Thread[Execution worker for ':' Thread 8,5,main]) completed. Took 2.82 secs.
:runners:java-fn-execution:classes (Thread[Execution worker for ':' Thread 8,5,main]) started.

> Task :runners:java-fn-execution:classes UP-TO-DATE
Skipping task ':runners:java-fn-execution:classes' as it has no actions.
:runners:java-fn-execution:classes (Thread[Execution worker for ':' Thread 8,5,main]) completed. Took 0.0 secs.
:runners:java-fn-execution:jar (Thread[Execution worker for ':' Thread 8,5,main]) started.

> Task :runners:java-fn-execution:jar
Build cache key for task ':runners:java-fn-execution:jar' is a6f96ebeac6a6202a16455a8d4f833ef
Caching disabled for task ':runners:java-fn-execution:jar': Caching has not been enabled for the task
Task ':runners:java-fn-execution:jar' is not up-to-date because:
  No history is available.
:runners:java-fn-execution:jar (Thread[Execution worker for ':' Thread 8,5,main]) completed. Took 0.047 secs.
:runners:direct-java:compileJava (Thread[Execution worker for ':' Thread 8,5,main]) started.
:runners:google-cloud-dataflow-java:worker:legacy-worker:compileJava (Thread[Execution worker for ':' Thread 10,5,main]) started.

> Task :runners:direct-java:compileJava FROM-CACHE
Build cache key for task ':runners:direct-java:compileJava' is 6a9cc0876ee4a4c70286f03bee7912a8
Task ':runners:direct-java:compileJava' is not up-to-date because:
  No history is available.
Origin for org.gradle.api.internal.tasks.execution.ExecuteActionsTaskExecuter$TaskExecution@6b880f6f: {executionTime=8853, hostName=apache-beam-jenkins-8, operatingSystem=Linux, buildInvocationId=om5jbj5vo5fexfiwpm75zdqo6e, creationTime=1581422482647, identity=:runners:direct-java:compileJava, type=org.gradle.api.internal.tasks.execution.ExecuteActionsTaskExecuter.TaskExecution, userName=jenkins, gradleVersion=5.2.1, rootPath=/home/jenkins/jenkins-slave/workspace/beam_PostCommit_Java_Nexmark_Dataflow/src}
Unpacked trees for task ':runners:direct-java:compileJava' from cache.
:runners:direct-java:compileJava (Thread[Execution worker for ':' Thread 8,5,main]) completed. Took 0.101 secs.
:runners:direct-java:classes (Thread[Execution worker for ':' Thread 8,5,main]) started.

> Task :runners:direct-java:classes UP-TO-DATE
Skipping task ':runners:direct-java:classes' as it has no actions.
:runners:direct-java:classes (Thread[Execution worker for ':' Thread 8,5,main]) completed. Took 0.0 secs.
:runners:direct-java:shadowJar (Thread[Execution worker for ':' Thread 6,5,main]) started.

> Task :runners:google-cloud-dataflow-java:worker:legacy-worker:compileJava FROM-CACHE
file or directory '<https://builds.apache.org/job/beam_PerformanceTests_MongoDBIO_IT/ws/src/runners/google-cloud-dataflow-java/worker/legacy-worker/src/main/java',> not found
Build cache key for task ':runners:google-cloud-dataflow-java:worker:legacy-worker:compileJava' is a922dea3ab84ef61e310c6acd7232e4d
Task ':runners:google-cloud-dataflow-java:worker:legacy-worker:compileJava' is not up-to-date because:
  No history is available.
Origin for org.gradle.api.internal.tasks.execution.ExecuteActionsTaskExecuter$TaskExecution@56f6fd86: {executionTime=20514, hostName=apache-beam-jenkins-8, operatingSystem=Linux, buildInvocationId=74meojmefrcdlmv46dyph4qupq, creationTime=1581465685533, identity=:runners:google-cloud-dataflow-java:worker:legacy-worker:compileJava, type=org.gradle.api.internal.tasks.execution.ExecuteActionsTaskExecuter.TaskExecution, userName=jenkins, gradleVersion=5.2.1, rootPath=/home/jenkins/jenkins-slave/workspace/beam_PostCommit_Java_Nexmark_Dataflow/src}
Unpacked trees for task ':runners:google-cloud-dataflow-java:worker:legacy-worker:compileJava' from cache.
:runners:google-cloud-dataflow-java:worker:legacy-worker:compileJava (Thread[Execution worker for ':' Thread 10,5,main]) completed. Took 0.264 secs.
:runners:google-cloud-dataflow-java:worker:legacy-worker:classes (Thread[Execution worker for ':' Thread 10,5,main]) started.

> Task :runners:google-cloud-dataflow-java:worker:legacy-worker:classes UP-TO-DATE
Skipping task ':runners:google-cloud-dataflow-java:worker:legacy-worker:classes' as it has no actions.
:runners:google-cloud-dataflow-java:worker:legacy-worker:classes (Thread[Execution worker for ':' Thread 10,5,main]) completed. Took 0.0 secs.
:runners:google-cloud-dataflow-java:worker:legacy-worker:shadowJar (Thread[Execution worker for ':' Thread 10,5,main]) started.

> Task :runners:direct-java:shadowJar
Build cache key for task ':runners:direct-java:shadowJar' is a538b78c9f99da70a88f26719015653e
Caching disabled for task ':runners:direct-java:shadowJar': Caching has not been enabled for the task
Task ':runners:direct-java:shadowJar' is not up-to-date because:
  No history is available.
Custom actions are attached to task ':runners:direct-java:shadowJar'.
*******************
GRADLE SHADOW STATS

Total Jars: 6 (includes project)
Total Time: 0.609s [609ms]
Average Time/Jar: 0.1015s [101.5ms]
*******************
:runners:direct-java:shadowJar (Thread[Execution worker for ':' Thread 6,5,main]) completed. Took 0.795 secs.
:sdks:java:io:google-cloud-platform:compileTestJava (Thread[Execution worker for ':' Thread 6,5,main]) started.

> Task :sdks:java:io:google-cloud-platform:compileTestJava FROM-CACHE
Build cache key for task ':sdks:java:io:google-cloud-platform:compileTestJava' is 5e7beb0fa03f12445098b1553c1fa3d6
Task ':sdks:java:io:google-cloud-platform:compileTestJava' is not up-to-date because:
  No history is available.
Origin for org.gradle.api.internal.tasks.execution.ExecuteActionsTaskExecuter$TaskExecution@525be0a0: {executionTime=12288, hostName=apache-beam-jenkins-8, operatingSystem=Linux, buildInvocationId=cr47jc5zwfdaxfwd224bshgcjm, creationTime=1581451587415, identity=:sdks:java:io:google-cloud-platform:compileTestJava, type=org.gradle.api.internal.tasks.execution.ExecuteActionsTaskExecuter.TaskExecution, userName=jenkins, gradleVersion=5.2.1, rootPath=/home/jenkins/jenkins-slave/workspace/beam_PostCommit_Java_ValidatesRunner_PortabilityApi_Dataflow/src}
Unpacked trees for task ':sdks:java:io:google-cloud-platform:compileTestJava' from cache.
:sdks:java:io:google-cloud-platform:compileTestJava (Thread[Execution worker for ':' Thread 6,5,main]) completed. Took 0.265 secs.
:sdks:java:io:google-cloud-platform:testClasses (Thread[Execution worker for ':' Thread 6,5,main]) started.

> Task :sdks:java:io:google-cloud-platform:testClasses UP-TO-DATE
Skipping task ':sdks:java:io:google-cloud-platform:testClasses' as it has no actions.
:sdks:java:io:google-cloud-platform:testClasses (Thread[Execution worker for ':' Thread 6,5,main]) completed. Took 0.0 secs.
:sdks:java:io:google-cloud-platform:testJar (Thread[Execution worker for ':' Thread 6,5,main]) started.

> Task :sdks:java:io:google-cloud-platform:testJar
Build cache key for task ':sdks:java:io:google-cloud-platform:testJar' is 46084c08581072aaf3fe31242a944279
Caching disabled for task ':sdks:java:io:google-cloud-platform:testJar': Caching has not been enabled for the task
Task ':sdks:java:io:google-cloud-platform:testJar' is not up-to-date because:
  No history is available.
:sdks:java:io:google-cloud-platform:testJar (Thread[Execution worker for ':' Thread 6,5,main]) completed. Took 0.055 secs.
:runners:google-cloud-dataflow-java:compileTestJava (Thread[Execution worker for ':' Thread 6,5,main]) started.

> Task :runners:google-cloud-dataflow-java:compileTestJava FROM-CACHE
Build cache key for task ':runners:google-cloud-dataflow-java:compileTestJava' is 21355c78a1cee739303798e17005f710
Task ':runners:google-cloud-dataflow-java:compileTestJava' is not up-to-date because:
  No history is available.
Origin for org.gradle.api.internal.tasks.execution.ExecuteActionsTaskExecuter$TaskExecution@75584dca: {executionTime=6768, hostName=apache-beam-jenkins-8, operatingSystem=Linux, buildInvocationId=cr47jc5zwfdaxfwd224bshgcjm, creationTime=1581451594316, identity=:runners:google-cloud-dataflow-java:compileTestJava, type=org.gradle.api.internal.tasks.execution.ExecuteActionsTaskExecuter.TaskExecution, userName=jenkins, gradleVersion=5.2.1, rootPath=/home/jenkins/jenkins-slave/workspace/beam_PostCommit_Java_ValidatesRunner_PortabilityApi_Dataflow/src}
Unpacked trees for task ':runners:google-cloud-dataflow-java:compileTestJava' from cache.
:runners:google-cloud-dataflow-java:compileTestJava (Thread[Execution worker for ':' Thread 6,5,main]) completed. Took 0.12 secs.
:runners:google-cloud-dataflow-java:testClasses (Thread[Execution worker for ':' Thread 6,5,main]) started.

> Task :runners:google-cloud-dataflow-java:testClasses UP-TO-DATE
Skipping task ':runners:google-cloud-dataflow-java:testClasses' as it has no actions.
:runners:google-cloud-dataflow-java:testClasses (Thread[Execution worker for ':' Thread 6,5,main]) completed. Took 0.0 secs.
:runners:google-cloud-dataflow-java:testJar (Thread[Execution worker for ':' Thread 6,5,main]) started.

> Task :runners:google-cloud-dataflow-java:testJar
Build cache key for task ':runners:google-cloud-dataflow-java:testJar' is b8762fce019bcb911f2fa23c2bb566e4
Caching disabled for task ':runners:google-cloud-dataflow-java:testJar': Caching has not been enabled for the task
Task ':runners:google-cloud-dataflow-java:testJar' is not up-to-date because:
  No history is available.
:runners:google-cloud-dataflow-java:testJar (Thread[Execution worker for ':' Thread 6,5,main]) completed. Took 0.028 secs.

> Task :runners:google-cloud-dataflow-java:worker:legacy-worker:shadowJar
Build cache key for task ':runners:google-cloud-dataflow-java:worker:legacy-worker:shadowJar' is 985dc3227676c0e90ddb31103161eff2
Caching disabled for task ':runners:google-cloud-dataflow-java:worker:legacy-worker:shadowJar': Caching has not been enabled for the task
Task ':runners:google-cloud-dataflow-java:worker:legacy-worker:shadowJar' is not up-to-date because:
  No history is available.
Custom actions are attached to task ':runners:google-cloud-dataflow-java:worker:legacy-worker:shadowJar'.
*******************
GRADLE SHADOW STATS

Total Jars: 16 (includes project)
Total Time: 3.377s [3377ms]
Average Time/Jar: 0.2110625s [211.0625ms]
*******************
:runners:google-cloud-dataflow-java:worker:legacy-worker:shadowJar (Thread[Execution worker for ':' Thread 10,5,main]) completed. Took 4.224 secs.
:sdks:java:io:mongodb:integrationTest (Thread[Execution worker for ':' Thread 10,5,main]) started.
Gradle Test Executor 1 started executing tests.

> Task :sdks:java:io:mongodb:integrationTest
Build cache key for task ':sdks:java:io:mongodb:integrationTest' is 1a426c92619c78dc9d9800e3ca2856a2
Task ':sdks:java:io:mongodb:integrationTest' is not up-to-date because:
  Task.upToDateWhen is false.
Custom actions are attached to task ':sdks:java:io:mongodb:integrationTest'.
Starting process 'Gradle Test Executor 1'. Working directory: <https://builds.apache.org/job/beam_PerformanceTests_MongoDBIO_IT/ws/src/sdks/java/io/mongodb> Command: /usr/lib/jvm/java-8-openjdk-amd64/bin/java -DbeamTestPipelineOptions=["--tempRoot=gs://temp-storage-for-perf-tests","--project=apache-beam-testing","--numberOfRecords=10000000","--bigQueryDataset=beam_performance","--bigQueryTable=mongodbioit_results","--mongoDBDatabaseName=beam","--mongoDBHostName=34.69.222.57","--mongoDBPort=27017","--runner=DataflowRunner","--autoscalingAlgorithm=NONE","--numWorkers=5","--workerHarnessContainerImage=","--dataflowWorkerJar=${dataflowWorkerJar}"] -Djava.security.manager=worker.org.gradle.process.internal.worker.child.BootstrapSecurityManager -Dorg.gradle.native=false -Xmx2g -Dfile.encoding=UTF-8 -Duser.country=US -Duser.language=en -Duser.variant -ea -cp /home/jenkins/.gradle/caches/5.2.1/workerMain/gradle-worker.jar worker.org.gradle.process.internal.worker.GradleWorkerMain 'Gradle Test Executor 1'
Successfully started process 'Gradle Test Executor 1'

org.apache.beam.sdk.io.mongodb.MongoDBIOIT STANDARD_ERROR
    SLF4J: Class path contains multiple SLF4J bindings.
    SLF4J: Found binding in [jar:<https://builds.apache.org/job/beam_PerformanceTests_MongoDBIO_IT/ws/src/runners/google-cloud-dataflow-java/worker/legacy-worker/build/libs/beam-runners-google-cloud-dataflow-java-legacy-worker-2.20.0-SNAPSHOT.jar!/org/slf4j/impl/StaticLoggerBinder.class]>
    SLF4J: Found binding in [jar:file:/home/jenkins/.gradle/caches/modules-2/files-2.1/org.slf4j/slf4j-jdk14/1.7.25/bccda40ebc8067491b32a88f49615a747d20082d/slf4j-jdk14-1.7.25.jar!/org/slf4j/impl/StaticLoggerBinder.class]
    SLF4J: See http://www.slf4j.org/codes.html#multiple_bindings for an explanation.
    SLF4J: Actual binding is of type [org.slf4j.impl.JDK14LoggerFactory]
    Feb 12, 2020 6:55:42 AM com.mongodb.diagnostics.logging.SLF4JLogger info
    INFO: Cluster created with settings {hosts=[34.69.222.57:27017], mode=SINGLE, requiredClusterType=UNKNOWN, serverSelectionTimeout='30000 ms', maxWaitQueueSize=500}

org.apache.beam.sdk.io.mongodb.MongoDBIOIT > testWriteAndRead STANDARD_ERROR
    Feb 12, 2020 6:55:42 AM com.mongodb.diagnostics.logging.SLF4JLogger info
    INFO: Cluster description not yet available. Waiting for 30000 ms before timing out
    Feb 12, 2020 6:55:52 AM com.mongodb.diagnostics.logging.SLF4JLogger info
    INFO: Exception in monitor thread while connecting to server 34.69.222.57:27017
    com.mongodb.MongoSocketOpenException: Exception opening socket
    	at com.mongodb.internal.connection.SocketChannelStream.open(SocketChannelStream.java:63)
    	at com.mongodb.internal.connection.InternalStreamConnection.open(InternalStreamConnection.java:126)
    	at com.mongodb.internal.connection.DefaultServerMonitor$ServerMonitorRunnable.run(DefaultServerMonitor.java:117)
    	at java.lang.Thread.run(Thread.java:748)
    Caused by: java.net.SocketTimeoutException
    	at sun.nio.ch.SocketAdaptor.connect(SocketAdaptor.java:129)
    	at com.mongodb.internal.connection.SocketStreamHelper.initialize(SocketStreamHelper.java:64)
    	at com.mongodb.internal.connection.SocketChannelStream.initializeSocketChannel(SocketChannelStream.java:72)
    	at com.mongodb.internal.connection.SocketChannelStream.open(SocketChannelStream.java:60)
    	... 3 more

    Feb 12, 2020 6:55:52 AM com.mongodb.diagnostics.logging.SLF4JLogger info
    INFO: Opened connection [connectionId{localValue:2, serverValue:1}] to 34.69.222.57:27017
    Feb 12, 2020 6:55:52 AM com.mongodb.diagnostics.logging.SLF4JLogger info
    INFO: Monitor thread successfully connected to server with description ServerDescription{address=34.69.222.57:27017, type=STANDALONE, state=CONNECTED, ok=true, version=ServerVersion{versionList=[4, 2, 3]}, minWireVersion=0, maxWireVersion=8, maxDocumentSize=16777216, logicalSessionTimeoutMinutes=30, roundTripTimeNanos=3603619}
    Feb 12, 2020 6:56:02 AM com.mongodb.diagnostics.logging.SLF4JLogger info
    INFO: Closed connection [connectionId{localValue:3}] to 34.69.222.57:27017 because there was a socket exception raised by this connection.

org.apache.beam.sdk.io.mongodb.MongoDBIOIT > testWriteAndRead FAILED
    com.mongodb.MongoSocketOpenException: Exception opening socket
        at com.mongodb.internal.connection.SocketChannelStream.open(SocketChannelStream.java:63)
        at com.mongodb.internal.connection.InternalStreamConnection.open(InternalStreamConnection.java:126)
        at com.mongodb.internal.connection.UsageTrackingInternalConnection.open(UsageTrackingInternalConnection.java:50)
        at com.mongodb.internal.connection.DefaultConnectionPool$PooledConnection.open(DefaultConnectionPool.java:390)
        at com.mongodb.internal.connection.DefaultConnectionPool.get(DefaultConnectionPool.java:106)
        at com.mongodb.internal.connection.DefaultConnectionPool.get(DefaultConnectionPool.java:92)
        at com.mongodb.internal.connection.DefaultServer.getConnection(DefaultServer.java:85)
        at com.mongodb.binding.ClusterBinding$ClusterBindingConnectionSource.getConnection(ClusterBinding.java:115)
        at com.mongodb.operation.CommandOperationHelper.executeWrappedCommandProtocol(CommandOperationHelper.java:211)
        at com.mongodb.operation.CommandOperationHelper.executeWrappedCommandProtocol(CommandOperationHelper.java:205)
        at com.mongodb.operation.CommandOperationHelper.executeWrappedCommandProtocol(CommandOperationHelper.java:115)
        at com.mongodb.operation.CommandOperationHelper.executeWrappedCommandProtocol(CommandOperationHelper.java:108)
        at com.mongodb.operation.CommandReadOperation.execute(CommandReadOperation.java:56)
        at com.mongodb.client.internal.MongoClientDelegate$DelegateOperationExecutor.execute(MongoClientDelegate.java:179)
        at com.mongodb.client.internal.MongoDatabaseImpl.executeCommand(MongoDatabaseImpl.java:182)
        at com.mongodb.client.internal.MongoDatabaseImpl.runCommand(MongoDatabaseImpl.java:151)
        at com.mongodb.client.internal.MongoDatabaseImpl.runCommand(MongoDatabaseImpl.java:146)
        at com.mongodb.client.internal.MongoDatabaseImpl.runCommand(MongoDatabaseImpl.java:136)
        at org.apache.beam.sdk.io.mongodb.MongoDBIOIT.getCollectionSizeInBytes(MongoDBIOIT.java:192)
        at org.apache.beam.sdk.io.mongodb.MongoDBIOIT.testWriteAndRead(MongoDBIOIT.java:153)

        Caused by:
        java.net.SocketTimeoutException
            at sun.nio.ch.SocketAdaptor.connect(SocketAdaptor.java:129)
            at com.mongodb.internal.connection.SocketStreamHelper.initialize(SocketStreamHelper.java:64)
            at com.mongodb.internal.connection.SocketChannelStream.initializeSocketChannel(SocketChannelStream.java:72)
            at com.mongodb.internal.connection.SocketChannelStream.open(SocketChannelStream.java:60)
            ... 19 more

org.apache.beam.sdk.io.mongodb.MongoDBIOIT STANDARD_ERROR
    Feb 12, 2020 6:56:02 AM com.mongodb.diagnostics.logging.SLF4JLogger info
    INFO: Cluster description not yet available. Waiting for 30000 ms before timing out
    Feb 12, 2020 6:56:03 AM com.mongodb.diagnostics.logging.SLF4JLogger info
    INFO: Opened connection [connectionId{localValue:4, serverValue:2}] to 34.69.222.57:27017

Gradle Test Executor 1 finished executing tests.

> Task :sdks:java:io:mongodb:integrationTest FAILED

1 test completed, 1 failed
Finished generating test XML results (0.016 secs) into: <https://builds.apache.org/job/beam_PerformanceTests_MongoDBIO_IT/ws/src/sdks/java/io/mongodb/build/test-results/integrationTest>
Generating HTML test report...
Finished generating test html results (0.026 secs) into: <https://builds.apache.org/job/beam_PerformanceTests_MongoDBIO_IT/ws/src/sdks/java/io/mongodb/build/reports/tests/integrationTest>
:sdks:java:io:mongodb:integrationTest (Thread[Execution worker for ':' Thread 10,5,main]) completed. Took 24.295 secs.

FAILURE: Build failed with an exception.

* What went wrong:
Execution failed for task ':sdks:java:io:mongodb:integrationTest'.
> There were failing tests. See the report at: file://<https://builds.apache.org/job/beam_PerformanceTests_MongoDBIO_IT/ws/src/sdks/java/io/mongodb/build/reports/tests/integrationTest/index.html>

* Try:
Run with --stacktrace option to get the stack trace. Run with --debug option to get more log output. Run with --scan to get full insights.

* Get more help at https://help.gradle.org

Deprecated Gradle features were used in this build, making it incompatible with Gradle 6.0.
Use '--warning-mode all' to show the individual deprecation warnings.
See https://docs.gradle.org/5.2.1/userguide/command_line_interface.html#sec:command_line_warnings

BUILD FAILED in 1m 7s
79 actionable tasks: 51 executed, 28 from cache

Publishing build scan...
https://gradle.com/s/reemk4s2edi7w

Build step 'Invoke Gradle script' changed build result to FAILURE
Build step 'Invoke Gradle script' marked build as failure

---------------------------------------------------------------------
To unsubscribe, e-mail: builds-unsubscribe@beam.apache.org
For additional commands, e-mail: builds-help@beam.apache.org


Jenkins build is back to normal : beam_PerformanceTests_MongoDBIO_IT #2745

Posted by Apache Jenkins Server <je...@builds.apache.org>.
See <https://builds.apache.org/job/beam_PerformanceTests_MongoDBIO_IT/2745/display/redirect?page=changes>


---------------------------------------------------------------------
To unsubscribe, e-mail: builds-unsubscribe@beam.apache.org
For additional commands, e-mail: builds-help@beam.apache.org