You are viewing a plain text version of this content. The canonical link for it is here.
Posted to builds@mesos.apache.org by Apache Jenkins Server <je...@builds.apache.org> on 2017/04/16 13:02:55 UTC
Build failed in Jenkins: Mesos-Buildbot » autotools,gcc,--verbose,GLOG_v=1 MESOS_VERBOSE=1,ubuntu:14.04,(docker||Hadoop)&&(!ubuntu-us1)&&(!ubuntu-eu2) #3502
See <https://builds.apache.org/job/Mesos-Buildbot/BUILDTOOL=autotools,COMPILER=gcc,CONFIGURATION=--verbose,ENVIRONMENT=GLOG_v=1%20MESOS_VERBOSE=1,OS=ubuntu%3A14.04,label_exp=(docker%7C%7CHadoop)&&(!ubuntu-us1)&&(!ubuntu-eu2)/3502/display/redirect>
------------------------------------------
Started by upstream project "Mesos-Buildbot" build number 3502
originally caused by:
Started by an SCM change
[EnvInject] - Loading node environment variables.
Building remotely on H0 (Hadoop) in workspace <https://builds.apache.org/job/Mesos-Buildbot/BUILDTOOL=autotools,COMPILER=gcc,CONFIGURATION=--verbose,ENVIRONMENT=GLOG_v=1%20MESOS_VERBOSE=1,OS=ubuntu%3A14.04,label_exp=(docker%7C%7CHadoop)&&(!ubuntu-us1)&&(!ubuntu-eu2)/ws/>
Wiping out workspace first.
Cloning the remote Git repository
Cloning repository https://git-wip-us.apache.org/repos/asf/mesos.git
> git init <https://builds.apache.org/job/Mesos-Buildbot/BUILDTOOL=autotools,COMPILER=gcc,CONFIGURATION=--verbose,ENVIRONMENT=GLOG_v=1%20MESOS_VERBOSE=1,OS=ubuntu%3A14.04,label_exp=(docker%7C%7CHadoop)&&(!ubuntu-us1)&&(!ubuntu-eu2)/ws/> # timeout=10
Fetching upstream changes from https://git-wip-us.apache.org/repos/asf/mesos.git
> git --version # timeout=10
> git fetch --tags --progress https://git-wip-us.apache.org/repos/asf/mesos.git +refs/heads/*:refs/remotes/origin/*
> git config remote.origin.url https://git-wip-us.apache.org/repos/asf/mesos.git # timeout=10
> git config --add remote.origin.fetch +refs/heads/*:refs/remotes/origin/* # timeout=10
> git config remote.origin.url https://git-wip-us.apache.org/repos/asf/mesos.git # timeout=10
Fetching upstream changes from https://git-wip-us.apache.org/repos/asf/mesos.git
> git fetch --tags --progress https://git-wip-us.apache.org/repos/asf/mesos.git +refs/heads/*:refs/remotes/origin/*
Checking out Revision b7e27cfac378c9e0a81596081fa4c65c7cea301a (refs/tags/0.16.0-rc5, refs/tags/0.16.0)
> git config core.sparsecheckout # timeout=10
> git checkout -f b7e27cfac378c9e0a81596081fa4c65c7cea301a
First time build. Skipping changelog.
[ff2fd4d4] $ /bin/bash -xe /tmp/hudson4102021608940706733.sh
+ '[' refs/tags/0.16.0-rc5 = origin/1.0.x ']'
+ ./support/jenkins/buildbot.sh
/tmp/hudson4102021608940706733.sh: line 6: ./support/jenkins/buildbot.sh: No such file or directory
Build step 'Execute shell' marked build as failure
Jenkins build is back to normal : Mesos-Buildbot » autotools,gcc,--verbose,GLOG_v=1 MESOS_VERBOSE=1,ubuntu:14.04,(docker||Hadoop)&&(!ubuntu-us1)&&(!ubuntu-eu2) #3519
Posted by Apache Jenkins Server <je...@builds.apache.org>.
See <https://builds.apache.org/job/Mesos-Buildbot/BUILDTOOL=autotools,COMPILER=gcc,CONFIGURATION=--verbose,ENVIRONMENT=GLOG_v=1%20MESOS_VERBOSE=1,OS=ubuntu%3A14.04,label_exp=(docker%7C%7CHadoop)&&(!ubuntu-us1)&&(!ubuntu-eu2)/3519/display/redirect?page=changes>
Build failed in Jenkins: Mesos-Buildbot » autotools,gcc,--verbose,GLOG_v=1 MESOS_VERBOSE=1,ubuntu:14.04,(docker||Hadoop)&&(!ubuntu-us1)&&(!ubuntu-eu2) #3518
Posted by Apache Jenkins Server <je...@builds.apache.org>.
See <https://builds.apache.org/job/Mesos-Buildbot/BUILDTOOL=autotools,COMPILER=gcc,CONFIGURATION=--verbose,ENVIRONMENT=GLOG_v=1%20MESOS_VERBOSE=1,OS=ubuntu%3A14.04,label_exp=(docker%7C%7CHadoop)&&(!ubuntu-us1)&&(!ubuntu-eu2)/3518/display/redirect?page=changes>
Changes:
[haosdent] Fixed health check bug when running agents with `docker_mesos_image`.
------------------------------------------
[...truncated 10.90 MB...]
I0416 19:20:07.954735 30682 status_update_manager.cpp:395] Received status update acknowledgement (UUID: 28f7bc08-c13b-4dd4-9460-dd33e481ed11) for task 1 of framework d5d4b958-1080-4357-906e-83c236778074-0000
I0416 19:20:07.955138 30677 slave.cpp:3504] Status update manager successfully handled status update acknowledgement (UUID: 28f7bc08-c13b-4dd4-9460-dd33e481ed11) for task 1 of framework d5d4b958-1080-4357-906e-83c236778074-0000
I0416 19:20:07.955693 30689 slave.cpp:4723] Sending message for framework d5d4b958-1080-4357-906e-83c236778074-0000 to scheduler-f8abad51-9522-4232-a543-93152d2d78fd@172.17.0.2:35545
I0416 19:20:07.955948 30676 sched.cpp:1177] Scheduler::frameworkMessage took 72581ns
I0416 19:20:07.956446 30656 sched.cpp:2021] Asked to stop the driver
I0416 19:20:07.956627 30687 sched.cpp:1203] Stopping framework d5d4b958-1080-4357-906e-83c236778074-0000
I0416 19:20:07.956881 30685 master.cpp:7782] Processing TEARDOWN call for framework d5d4b958-1080-4357-906e-83c236778074-0000 (default) at scheduler-f8abad51-9522-4232-a543-93152d2d78fd@172.17.0.2:35545
I0416 19:20:07.956924 30685 master.cpp:7794] Removing framework d5d4b958-1080-4357-906e-83c236778074-0000 (default) at scheduler-f8abad51-9522-4232-a543-93152d2d78fd@172.17.0.2:35545
I0416 19:20:07.956950 30685 master.cpp:3165] Deactivating framework d5d4b958-1080-4357-906e-83c236778074-0000 (default) at scheduler-f8abad51-9522-4232-a543-93152d2d78fd@172.17.0.2:35545
I0416 19:20:07.957149 30690 hierarchical.cpp:376] Deactivated framework d5d4b958-1080-4357-906e-83c236778074-0000
I0416 19:20:07.957242 30690 slave.cpp:3057] Asked to shut down framework d5d4b958-1080-4357-906e-83c236778074-0000 by master@172.17.0.2:35545
I0416 19:20:07.957280 30690 slave.cpp:3082] Shutting down framework d5d4b958-1080-4357-906e-83c236778074-0000
I0416 19:20:07.957280 30685 master.cpp:8362] Updating the state of task 1 of framework d5d4b958-1080-4357-906e-83c236778074-0000 (latest state: TASK_KILLED, status update state: TASK_KILLED)
I0416 19:20:07.957345 30690 slave.cpp:5475] Shutting down executor 'default' of framework d5d4b958-1080-4357-906e-83c236778074-0000 at executor(74)@172.17.0.2:35545
I0416 19:20:07.957504 30678 exec.cpp:415] Executor asked to shutdown
I0416 19:20:07.957557 30678 exec.cpp:430] Executor::shutdown took 20994ns
I0416 19:20:07.957808 30689 slave.cpp:4787] Got exited event for executor(74)@172.17.0.2:35545
I0416 19:20:07.958693 30685 master.cpp:8456] Removing task 1 with resources cpus(*)(allocated: *):2; mem(*)(allocated: *):1024; disk(*)(allocated: *):1024; ports(*)(allocated: *):[31000-32000] of framework d5d4b958-1080-4357-906e-83c236778074-0000 on agent d5d4b958-1080-4357-906e-83c236778074-S0 at slave(190)@172.17.0.2:35545 (3177f292084c)
I0416 19:20:07.958853 30682 hierarchical.cpp:1116] Recovered cpus(*)(allocated: *):2; mem(*)(allocated: *):1024; disk(*)(allocated: *):1024; ports(*)(allocated: *):[31000-32000] (total: cpus(*):2; mem(*):1024; disk(*):1024; ports(*):[31000-32000], allocated: {}) on agent d5d4b958-1080-4357-906e-83c236778074-S0 from framework d5d4b958-1080-4357-906e-83c236778074-0000
I0416 19:20:07.959182 30685 master.cpp:8485] Removing executor 'default' with resources {} of framework d5d4b958-1080-4357-906e-83c236778074-0000 on agent d5d4b958-1080-4357-906e-83c236778074-S0 at slave(190)@172.17.0.2:35545 (3177f292084c)
I0416 19:20:07.959718 30675 slave.cpp:5161] Executor 'default' of framework d5d4b958-1080-4357-906e-83c236778074-0000 exited with status 0
I0416 19:20:07.959844 30675 slave.cpp:5261] Cleaning up executor 'default' of framework d5d4b958-1080-4357-906e-83c236778074-0000 at executor(74)@172.17.0.2:35545
I0416 19:20:07.960233 30677 gc.cpp:55] Scheduling '/tmp/MasterTest_FrameworkMessage_7zSyWC/slaves/d5d4b958-1080-4357-906e-83c236778074-S0/frameworks/d5d4b958-1080-4357-906e-83c236778074-0000/executors/default/runs/ed6433bf-21f1-4031-afa8-4c5c28dea3af' for gc 6.99998888794963days in the future
W0416 19:20:07.960445 30685 master.cpp:6384] Ignoring unknown exited executor 'default' of framework d5d4b958-1080-4357-906e-83c236778074-0000 on agent d5d4b958-1080-4357-906e-83c236778074-S0 at slave(190)@172.17.0.2:35545 (3177f292084c)
I0416 19:20:07.960474 30675 slave.cpp:5349] Cleaning up framework d5d4b958-1080-4357-906e-83c236778074-0000
I0416 19:20:07.960484 30679 gc.cpp:55] Scheduling '/tmp/MasterTest_FrameworkMessage_7zSyWC/slaves/d5d4b958-1080-4357-906e-83c236778074-S0/frameworks/d5d4b958-1080-4357-906e-83c236778074-0000/executors/default' for gc 6.9999888845037days in the future
I0416 19:20:07.960721 30687 status_update_manager.cpp:285] Closing status update streams for framework d5d4b958-1080-4357-906e-83c236778074-0000
I0416 19:20:07.960734 30678 hierarchical.cpp:323] Removed framework d5d4b958-1080-4357-906e-83c236778074-0000
I0416 19:20:07.960783 30687 status_update_manager.cpp:531] Cleaning up status update stream for task 1 of framework d5d4b958-1080-4357-906e-83c236778074-0000
I0416 19:20:07.960868 30681 gc.cpp:55] Scheduling '/tmp/MasterTest_FrameworkMessage_7zSyWC/slaves/d5d4b958-1080-4357-906e-83c236778074-S0/frameworks/d5d4b958-1080-4357-906e-83c236778074-0000' for gc 6.99998888013926days in the future
I0416 19:20:07.960891 30675 slave.cpp:790] Agent terminating
I0416 19:20:07.961333 30686 master.cpp:1318] Agent d5d4b958-1080-4357-906e-83c236778074-S0 at slave(190)@172.17.0.2:35545 (3177f292084c) disconnected
I0416 19:20:07.961370 30686 master.cpp:3202] Disconnecting agent d5d4b958-1080-4357-906e-83c236778074-S0 at slave(190)@172.17.0.2:35545 (3177f292084c)
I0416 19:20:07.961469 30686 master.cpp:3221] Deactivating agent d5d4b958-1080-4357-906e-83c236778074-S0 at slave(190)@172.17.0.2:35545 (3177f292084c)
I0416 19:20:07.961706 30684 hierarchical.cpp:655] Agent d5d4b958-1080-4357-906e-83c236778074-S0 deactivated
I0416 19:20:07.964838 30679 master.cpp:1157] Master terminating
I0416 19:20:07.965704 30684 hierarchical.cpp:560] Removed agent d5d4b958-1080-4357-906e-83c236778074-S0
[ OK ] MasterTest.FrameworkMessage (87 ms)
[ RUN ] MasterTest.MultipleExecutors
I0416 19:20:07.975637 30656 cluster.cpp:162] Creating default 'local' authorizer
I0416 19:20:07.978971 30679 master.cpp:438] Master 572e0698-e823-4529-a3a6-ce86560cf6ca (3177f292084c) started on 172.17.0.2:35545
I0416 19:20:07.979005 30679 master.cpp:440] Flags at startup: --acls="" --agent_ping_timeout="15secs" --agent_reregister_timeout="10mins" --allocation_interval="1secs" --allocator="HierarchicalDRF" --authenticate_agents="true" --authenticate_frameworks="true" --authenticate_http_frameworks="true" --authenticate_http_readonly="true" --authenticate_http_readwrite="true" --authenticators="crammd5" --authorizers="local" --credentials="/tmp/pRJNme/credentials" --framework_sorter="drf" --help="false" --hostname_lookup="true" --http_authenticators="basic" --http_framework_authenticators="basic" --initialize_driver_logging="true" --log_auto_initialize="true" --logbufsecs="0" --logging_level="INFO" --max_agent_ping_timeouts="5" --max_completed_frameworks="50" --max_completed_tasks_per_framework="1000" --max_unreachable_tasks_per_framework="1000" --port="5050" --quiet="false" --recovery_agent_removal_limit="100%" --registry="in_memory" --registry_fetch_timeout="1mins" --registry_gc_interval="15mins" --registry_max_agent_age="2weeks" --registry_max_agent_count="102400" --registry_store_timeout="100secs" --registry_strict="false" --root_submissions="true" --user_sorter="drf" --version="false" --webui_dir="/mesos/mesos-1.3.0/_inst/share/mesos/webui" --work_dir="/tmp/pRJNme/master" --zk_session_timeout="10secs"
I0416 19:20:07.979374 30679 master.cpp:490] Master only allowing authenticated frameworks to register
I0416 19:20:07.979388 30679 master.cpp:504] Master only allowing authenticated agents to register
I0416 19:20:07.979395 30679 master.cpp:517] Master only allowing authenticated HTTP frameworks to register
I0416 19:20:07.979409 30679 credentials.hpp:37] Loading credentials for authentication from '/tmp/pRJNme/credentials'
I0416 19:20:07.979775 30679 master.cpp:562] Using default 'crammd5' authenticator
I0416 19:20:07.979943 30679 http.cpp:975] Creating default 'basic' HTTP authenticator for realm 'mesos-master-readonly'
I0416 19:20:07.980185 30679 http.cpp:975] Creating default 'basic' HTTP authenticator for realm 'mesos-master-readwrite'
I0416 19:20:07.980351 30679 http.cpp:975] Creating default 'basic' HTTP authenticator for realm 'mesos-master-scheduler'
I0416 19:20:07.980615 30679 master.cpp:642] Authorization enabled
I0416 19:20:07.980864 30675 whitelist_watcher.cpp:77] No whitelist given
I0416 19:20:07.980887 30678 hierarchical.cpp:159] Initialized hierarchical allocator process
I0416 19:20:07.983944 30677 master.cpp:2166] Elected as the leading master!
I0416 19:20:07.983979 30677 master.cpp:1705] Recovering from registrar
I0416 19:20:07.984159 30678 registrar.cpp:331] Recovering registrar
I0416 19:20:07.985144 30684 registrar.cpp:364] Successfully fetched the registry (0B) in 922112ns
I0416 19:20:07.985266 30684 registrar.cpp:463] Applied 1 operations in 19832ns; attempting to update the registry
I0416 19:20:07.986351 30685 registrar.cpp:508] Successfully updated the registry in 992us
I0416 19:20:07.986542 30685 registrar.cpp:394] Successfully recovered registrar
I0416 19:20:07.987298 30678 master.cpp:1804] Recovered 0 agents from the registry (129B); allowing 10mins for agents to re-register
I0416 19:20:07.987418 30676 hierarchical.cpp:186] Skipping recovery of hierarchical allocator: nothing to recover
I0416 19:20:07.993079 30656 cluster.cpp:448] Creating default 'local' authorizer
I0416 19:20:07.995060 30687 slave.cpp:225] Mesos agent started on (191)@172.17.0.2:35545
I0416 19:20:07.995093 30687 slave.cpp:226] Flags at startup: --acls="" --appc_simple_discovery_uri_prefix="http://" --appc_store_dir="/tmp/mesos/store/appc" --authenticate_http_readonly="true" --authenticate_http_readwrite="true" --authenticatee="crammd5" --authentication_backoff_factor="1secs" --authorizer="local" --cgroups_cpu_enable_pids_and_tids_count="false" --cgroups_enable_cfs="false" --cgroups_hierarchy="/sys/fs/cgroup" --cgroups_limit_swap="false" --cgroups_root="mesos" --container_disk_watch_interval="15secs" --containerizers="mesos" --credential="/tmp/MasterTest_MultipleExecutors_RiWUo2/credential" --default_role="*" --disk_watch_interval="1mins" --docker="docker" --docker_kill_orphans="true" --docker_registry="https://registry-1.docker.io" --docker_remove_delay="6hrs" --docker_socket="/var/run/docker.sock" --docker_stop_timeout="0ns" --docker_store_dir="/tmp/mesos/store/docker" --docker_volume_checkpoint_dir="/var/run/mesos/isolators/docker/volume" --enforce_container_disk_quota="false" --executor_registration_timeout="1mins" --executor_shutdown_grace_period="5secs" --fetcher_cache_dir="/tmp/MasterTest_MultipleExecutors_RiWUo2/fetch" --fetcher_cache_size="2GB" --frameworks_home="" --gc_delay="1weeks" --gc_disk_headroom="0.1" --hadoop_home="" --help="false" --hostname_lookup="true" --http_command_executor="false" --http_credentials="/tmp/MasterTest_MultipleExecutors_RiWUo2/http_credentials" --http_heartbeat_interval="30secs" --initialize_driver_logging="true" --isolation="posix/cpu,posix/mem" --launcher="posix" --launcher_dir="/mesos/mesos-1.3.0/_build/src" --logbufsecs="0" --logging_level="INFO" --max_completed_executors_per_framework="150" --oversubscribed_resources_interval="15secs" --perf_duration="10secs" --perf_interval="1mins" --port="5051" --qos_correction_interval_min="0ns" --quiet="false" --recover="reconnect" --recovery_timeout="15mins" --registration_backoff_factor="10ms" --resources="cpus:2;gpus:0;mem:1024;disk:1024;ports:[31000-32000]" --revocable_cpu_low_priority="true" --runtime_dir="/tmp/MasterTest_MultipleExecutors_RiWUo2" --sandbox_directory="/mnt/mesos/sandbox" --strict="true" --switch_user="true" --systemd_enable_support="true" --systemd_runtime_directory="/run/systemd/system" --version="false" --work_dir="/tmp/MasterTest_MultipleExecutors_nizQnD"
I0416 19:20:07.995566 30687 credentials.hpp:86] Loading credential for authentication from '/tmp/MasterTest_MultipleExecutors_RiWUo2/credential'
I0416 19:20:07.995751 30687 slave.cpp:258] Agent using credential for: test-principal
I0416 19:20:07.995780 30687 credentials.hpp:37] Loading credentials for authentication from '/tmp/MasterTest_MultipleExecutors_RiWUo2/http_credentials'
I0416 19:20:07.996071 30687 http.cpp:975] Creating default 'basic' HTTP authenticator for realm 'mesos-agent-readonly'
I0416 19:20:07.996244 30687 http.cpp:975] Creating default 'basic' HTTP authenticator for realm 'mesos-agent-readwrite'
I0416 19:20:07.996736 30656 sched.cpp:232] Version: 1.3.0
I0416 19:20:07.997400 30681 sched.cpp:336] New master detected at master@172.17.0.2:35545
I0416 19:20:07.997499 30681 sched.cpp:407] Authenticating with master master@172.17.0.2:35545
I0416 19:20:07.997520 30681 sched.cpp:414] Using default CRAM-MD5 authenticatee
I0416 19:20:07.997632 30687 slave.cpp:525] Agent resources: cpus(*):2; mem(*):1024; disk(*):1024; ports(*):[31000-32000]
I0416 19:20:07.997706 30687 slave.cpp:533] Agent attributes: [ ]
I0416 19:20:07.997719 30687 slave.cpp:538] Agent hostname: 3177f292084c
I0416 19:20:07.997767 30683 authenticatee.cpp:121] Creating new client SASL connection
I0416 19:20:07.998078 30680 master.cpp:7269] Authenticating scheduler-e5933329-d922-4661-9c33-1940082a1c2f@172.17.0.2:35545
I0416 19:20:07.998208 30679 authenticator.cpp:414] Starting authentication session for crammd5-authenticatee(425)@172.17.0.2:35545
I0416 19:20:07.998435 30689 status_update_manager.cpp:177] Pausing sending status updates
I0416 19:20:07.998488 30684 authenticator.cpp:98] Creating new server SASL connection
I0416 19:20:07.998762 30677 authenticatee.cpp:213] Received SASL authentication mechanisms: CRAM-MD5
I0416 19:20:07.998793 30677 authenticatee.cpp:239] Attempting to authenticate with mechanism 'CRAM-MD5'
I0416 19:20:07.998929 30681 authenticator.cpp:204] Received SASL authentication start
I0416 19:20:07.999004 30681 authenticator.cpp:326] Authentication requires more steps
I0416 19:20:07.999128 30683 state.cpp:62] Recovering state from '/tmp/MasterTest_MultipleExecutors_nizQnD/meta'
I0416 19:20:07.999263 30679 authenticatee.cpp:259] Received SASL authentication step
I0416 19:20:07.999444 30685 authenticator.cpp:232] Received SASL authentication step
I0416 19:20:07.999457 30679 status_update_manager.cpp:203] Recovering status update manager
I0416 19:20:07.999498 30685 auxprop.cpp:109] Request to lookup properties for user: 'test-principal' realm: '3177f292084c' server FQDN: '3177f292084c' SASL_AUXPROP_VERIFY_AGAINST_HASH: false SASL_AUXPROP_OVERRIDE: false SASL_AUXPROP_AUTHZID: false
I0416 19:20:07.999521 30685 auxprop.cpp:181] Looking up auxiliary property '*userPassword'
I0416 19:20:07.999567 30685 auxprop.cpp:181] Looking up auxiliary property '*cmusaslsecretCRAM-MD5'
I0416 19:20:07.999605 30685 auxprop.cpp:109] Request to lookup properties for user: 'test-principal' realm: '3177f292084c' server FQDN: '3177f292084c' SASL_AUXPROP_VERIFY_AGAINST_HASH: false SASL_AUXPROP_OVERRIDE: false SASL_AUXPROP_AUTHZID: true
I0416 19:20:07.999634 30685 auxprop.cpp:131] Skipping auxiliary property '*userPassword' since SASL_AUXPROP_AUTHZID == true
I0416 19:20:07.999658 30685 auxprop.cpp:131] Skipping auxiliary property '*cmusaslsecretCRAM-MD5' since SASL_AUXPROP_AUTHZID == true
I0416 19:20:07.999686 30685 authenticator.cpp:318] Authentication success
I0416 19:20:07.999837 30677 authenticatee.cpp:299] Authentication success
I0416 19:20:07.999898 30684 master.cpp:7299] Successfully authenticated principal 'test-principal' at scheduler-e5933329-d922-4661-9c33-1940082a1c2f@172.17.0.2:35545
I0416 19:20:07.999964 30680 slave.cpp:5963] Finished recovery
I0416 19:20:07.999977 30690 authenticator.cpp:432] Authentication session cleanup for crammd5-authenticatee(425)@172.17.0.2:35545
I0416 19:20:08.000212 30685 sched.cpp:513] Successfully authenticated with master master@172.17.0.2:35545
I0416 19:20:08.000237 30685 sched.cpp:836] Sending SUBSCRIBE call to master@172.17.0.2:35545
I0416 19:20:08.000340 30685 sched.cpp:869] Will retry registration in 1.091639454secs if necessary
I0416 19:20:08.000423 30680 slave.cpp:6145] Querying resource estimator for oversubscribable resources
I0416 19:20:08.000596 30676 master.cpp:2818] Received SUBSCRIBE call for framework 'default' at scheduler-e5933329-d922-4661-9c33-1940082a1c2f@172.17.0.2:35545
I0416 19:20:08.000712 30676 master.cpp:2202] Authorizing framework principal 'test-principal' to receive offers for roles '{ * }'
I0416 19:20:08.000718 30680 slave.cpp:918] New master detected at master@172.17.0.2:35545
I0416 19:20:08.000766 30690 status_update_manager.cpp:177] Pausing sending status updates
I0416 19:20:08.000870 30680 slave.cpp:953] Detecting new master
I0416 19:20:08.001019 30680 slave.cpp:6159] Received oversubscribable resources {} from the resource estimator
I0416 19:20:08.001204 30683 master.cpp:2895] Subscribing framework default with checkpointing disabled and capabilities [ ]
I0416 19:20:08.001687 30682 sched.cpp:759] Framework registered with 572e0698-e823-4529-a3a6-ce86560cf6ca-0000
I0416 19:20:08.001741 30682 sched.cpp:773] Scheduler::registered took 27844ns
I0416 19:20:08.001888 30681 hierarchical.cpp:271] Added framework 572e0698-e823-4529-a3a6-ce86560cf6ca-0000
I0416 19:20:08.002035 30681 hierarchical.cpp:1862] No allocations performed
I0416 19:20:08.002082 30681 hierarchical.cpp:1952] No inverse offers to send out!
I0416 19:20:08.002213 30681 hierarchical.cpp:1446] Performed allocation for 0 agents in 221673ns
I0416 19:20:08.008213 30688 slave.cpp:980] Authenticating with master master@172.17.0.2:35545
I0416 19:20:08.008298 30688 slave.cpp:991] Using default CRAM-MD5 authenticatee
I0416 19:20:08.008615 30675 authenticatee.cpp:121] Creating new client SASL connection
I0416 19:20:08.009001 30679 master.cpp:7269] Authenticating slave(191)@172.17.0.2:35545
I0416 19:20:08.009147 30675 authenticator.cpp:414] Starting authentication session for crammd5-authenticatee(426)@172.17.0.2:35545
I0416 19:20:08.009414 30687 authenticator.cpp:98] Creating new server SASL connection
I0416 19:20:08.009711 30678 authenticatee.cpp:213] Received SASL authentication mechanisms: CRAM-MD5
I0416 19:20:08.009748 30678 authenticatee.cpp:239] Attempting to authenticate with mechanism 'CRAM-MD5'
I0416 19:20:08.009917 30690 authenticator.cpp:204] Received SASL authentication start
I0416 19:20:08.009996 30690 authenticator.cpp:326] Authentication requires more steps
I0416 19:20:08.010120 30690 authenticatee.cpp:259] Received SASL authentication step
I0416 19:20:08.010304 30688 authenticator.cpp:232] Received SASL authentication step
I0416 19:20:08.010416 30688 auxprop.cpp:109] Request to lookup properties for user: 'test-principal' realm: '3177f292084c' server FQDN: '3177f292084c' SASL_AUXPROP_VERIFY_AGAINST_HASH: false SASL_AUXPROP_OVERRIDE: false SASL_AUXPROP_AUTHZID: false
I0416 19:20:08.010483 30688 auxprop.cpp:181] Looking up auxiliary property '*userPassword'
I0416 19:20:08.010581 30688 auxprop.cpp:181] Looking up auxiliary property '*cmusaslsecretCRAM-MD5'
I0416 19:20:08.010633 30688 auxprop.cpp:109] Request to lookup properties for user: 'test-principal' realm: '3177f292084c' server FQDN: '3177f292084c' SASL_AUXPROP_VERIFY_AGAINST_HASH: false SASL_AUXPROP_OVERRIDE: false SASL_AUXPROP_AUTHZID: true
I0416 19:20:08.010664 30688 auxprop.cpp:131] Skipping auxiliary property '*userPassword' since SASL_AUXPROP_AUTHZID == true
I0416 19:20:08.010685 30688 auxprop.cpp:131] Skipping auxiliary property '*cmusaslsecretCRAM-MD5' since SASL_AUXPROP_AUTHZID == true
I0416 19:20:08.010715 30688 authenticator.cpp:318] Authentication success
I0416 19:20:08.010896 30690 authenticatee.cpp:299] Authentication success
I0416 19:20:08.010979 30675 master.cpp:7299] Successfully authenticated principal 'test-principal' at slave(191)@172.17.0.2:35545
I0416 19:20:08.011301 30676 slave.cpp:1075] Successfully authenticated with master master@172.17.0.2:35545
I0416 19:20:08.011327 30690 authenticator.cpp:432] Authentication session cleanup for crammd5-authenticatee(426)@172.17.0.2:35545
I0416 19:20:08.011559 30676 slave.cpp:1503] Will retry registration in 10.425156ms if necessary
I0416 19:20:08.011811 30680 master.cpp:5454] Registering agent at slave(191)@172.17.0.2:35545 (3177f292084c) with id 572e0698-e823-4529-a3a6-ce86560cf6ca-S0
I0416 19:20:08.012377 30678 registrar.cpp:463] Applied 1 operations in 70001ns; attempting to update the registry
I0416 19:20:08.014575 30678 registrar.cpp:508] Successfully updated the registry in 2.107904ms
I0416 19:20:08.015550 30683 slave.cpp:4745] Received ping from slave-observer(188)@172.17.0.2:35545
I0416 19:20:08.015632 30681 master.cpp:5528] Registered agent 572e0698-e823-4529-a3a6-ce86560cf6ca-S0 at slave(191)@172.17.0.2:35545 (3177f292084c) with cpus(*):2; mem(*):1024; disk(*):1024; ports(*):[31000-32000]
I0416 19:20:08.015841 30683 slave.cpp:1121] Registered with master master@172.17.0.2:35545; given agent ID 572e0698-e823-4529-a3a6-ce86560cf6ca-S0
I0416 19:20:08.015874 30683 fetcher.cpp:94] Clearing fetcher cache
I0416 19:20:08.016141 30677 status_update_manager.cpp:184] Resuming sending status updates
I0416 19:20:08.016222 30684 hierarchical.cpp:527] Added agent 572e0698-e823-4529-a3a6-ce86560cf6ca-S0 (3177f292084c) with cpus(*):2; mem(*):1024; disk(*):1024; ports(*):[31000-32000] (allocated: {})
I0416 19:20:08.016470 30683 slave.cpp:1149] Checkpointing SlaveInfo to '/tmp/MasterTest_MultipleExecutors_nizQnD/meta/slaves/572e0698-e823-4529-a3a6-ce86560cf6ca-S0/slave.info'
I0416 19:20:08.016958 30683 slave.cpp:1187] Forwarding total oversubscribed resources {}
I0416 19:20:08.017163 30688 master.cpp:6115] Received update of agent 572e0698-e823-4529-a3a6-ce86560cf6ca-S0 at slave(191)@172.17.0.2:35545 (3177f292084c) with total oversubscribed resources {}
I0416 19:20:08.018499 30684 hierarchical.cpp:1952] No inverse offers to send out!
I0416 19:20:08.018568 30684 hierarchical.cpp:1446] Performed allocation for 1 agents in 2.172669ms
I0416 19:20:08.019098 30683 master.cpp:7098] Sending 1 offers to framework 572e0698-e823-4529-a3a6-ce86560cf6ca-0000 (default) at scheduler-e5933329-d922-4661-9c33-1940082a1c2f@172.17.0.2:35545
I0416 19:20:08.019668 30683 sched.cpp:933] Scheduler::resourceOffers took 179132ns
I0416 19:20:08.022352 30685 master.cpp:3856] Processing ACCEPT call for offers: [ 572e0698-e823-4529-a3a6-ce86560cf6ca-O0 ] on agent 572e0698-e823-4529-a3a6-ce86560cf6ca-S0 at slave(191)@172.17.0.2:35545 (3177f292084c) for framework 572e0698-e823-4529-a3a6-ce86560cf6ca-0000 (default) at scheduler-e5933329-d922-4661-9c33-1940082a1c2f@172.17.0.2:35545
I0416 19:20:08.022465 30685 master.cpp:3432] Authorizing framework principal 'test-principal' to launch task 1
I0416 19:20:08.022724 30685 master.cpp:3432] Authorizing framework principal 'test-principal' to launch task 2
W0416 19:20:08.025024 30685 validation.cpp:1113] Executor 'executor-1' for task '1' uses less CPUs (None) than the minimum required (0.01). Please update your executor, as this will be mandatory in future releases.
W0416 19:20:08.025068 30685 validation.cpp:1125] Executor 'executor-1' for task '1' uses less memory (None) than the minimum required (32MB). Please update your executor, as this will be mandatory in future releases.
I0416 19:20:08.025653 30685 master.cpp:9114] Adding task 1 with resources cpus(*)(allocated: *):1; mem(*)(allocated: *):512 on agent 572e0698-e823-4529-a3a6-ce86560cf6ca-S0 at slave(191)@172.17.0.2:35545 (3177f292084c)
I0416 19:20:08.025889 30685 master.cpp:4506] Launching task 1 of framework 572e0698-e823-4529-a3a6-ce86560cf6ca-0000 (default) at scheduler-e5933329-d922-4661-9c33-1940082a1c2f@172.17.0.2:35545 with resources cpus(*)(allocated: *):1; mem(*)(allocated: *):512 on agent 572e0698-e823-4529-a3a6-ce86560cf6ca-S0 at slave(191)@172.17.0.2:35545 (3177f292084c)
I0416 19:20:08.026392 30681 slave.cpp:1613] Got assigned task '1' for framework 572e0698-e823-4529-a3a6-ce86560cf6ca-0000
W0416 19:20:08.027277 30685 validation.cpp:1113] Executor 'executor-2' for task '2' uses less CPUs (None) than the minimum required (0.01). Please update your executor, as this will be mandatory in future releases.
W0416 19:20:08.027317 30685 validation.cpp:1125] Executor 'executor-2' for task '2' uses less memory (None) than the minimum required (32MB). Please update your executor, as this will be mandatory in future releases.
I0416 19:20:08.027444 30681 slave.cpp:1894] Authorizing task '1' for framework 572e0698-e823-4529-a3a6-ce86560cf6ca-0000
I0416 19:20:08.027537 30681 slave.cpp:6582] Authorizing framework principal 'test-principal' to launch task 1
I0416 19:20:08.027750 30685 master.cpp:9114] Adding task 2 with resources cpus(*)(allocated: *):1; mem(*)(allocated: *):512 on agent 572e0698-e823-4529-a3a6-ce86560cf6ca-S0 at slave(191)@172.17.0.2:35545 (3177f292084c)
I0416 19:20:08.028331 30685 master.cpp:4506] Launching task 2 of framework 572e0698-e823-4529-a3a6-ce86560cf6ca-0000 (default) at scheduler-e5933329-d922-4661-9c33-1940082a1c2f@172.17.0.2:35545 with resources cpus(*)(allocated: *):1; mem(*)(allocated: *):512 on agent 572e0698-e823-4529-a3a6-ce86560cf6ca-S0 at slave(191)@172.17.0.2:35545 (3177f292084c)
I0416 19:20:08.028910 30686 slave.cpp:1613] Got assigned task '2' for framework 572e0698-e823-4529-a3a6-ce86560cf6ca-0000
I0416 19:20:08.029577 30686 slave.cpp:2081] Launching task '1' for framework 572e0698-e823-4529-a3a6-ce86560cf6ca-0000
I0416 19:20:08.030252 30686 paths.cpp:556] Trying to chown '/tmp/MasterTest_MultipleExecutors_nizQnD/slaves/572e0698-e823-4529-a3a6-ce86560cf6ca-S0/frameworks/572e0698-e823-4529-a3a6-ce86560cf6ca-0000/executors/executor-1/runs/bd0c46e1-5744-430b-bda0-7ffabab612d3' to user 'mesos'
I0416 19:20:08.030572 30686 slave.cpp:6926] Launching executor 'executor-1' of framework 572e0698-e823-4529-a3a6-ce86560cf6ca-0000 with resources {} in work directory '/tmp/MasterTest_MultipleExecutors_nizQnD/slaves/572e0698-e823-4529-a3a6-ce86560cf6ca-S0/frameworks/572e0698-e823-4529-a3a6-ce86560cf6ca-0000/executors/executor-1/runs/bd0c46e1-5744-430b-bda0-7ffabab612d3'
I0416 19:20:08.031059 30680 hierarchical.cpp:852] Updated allocation of framework 572e0698-e823-4529-a3a6-ce86560cf6ca-0000 on agent 572e0698-e823-4529-a3a6-ce86560cf6ca-S0 from cpus(*)(allocated: *):2; mem(*)(allocated: *):1024; disk(*)(allocated: *):1024; ports(*)(allocated: *):[31000-32000] to cpus(*)(allocated: *):2; mem(*)(allocated: *):1024; disk(*)(allocated: *):1024; ports(*)(allocated: *):[31000-32000]
I0416 19:20:08.031261 30686 slave.cpp:2310] Queued task '1' for executor 'executor-1' of framework 572e0698-e823-4529-a3a6-ce86560cf6ca-0000
I0416 19:20:08.031409 30686 slave.cpp:1894] Authorizing task '2' for framework 572e0698-e823-4529-a3a6-ce86560cf6ca-0000
I0416 19:20:08.031469 30686 slave.cpp:6582] Authorizing framework principal 'test-principal' to launch task 2
I0416 19:20:08.031689 30680 hierarchical.cpp:1116] Recovered ports(*)(allocated: *):[31000-32000]; disk(*)(allocated: *):1024 (total: cpus(*):2; mem(*):1024; disk(*):1024; ports(*):[31000-32000], allocated: cpus(*)(allocated: *):2; mem(*)(allocated: *):1024) on agent 572e0698-e823-4529-a3a6-ce86560cf6ca-S0 from framework 572e0698-e823-4529-a3a6-ce86560cf6ca-0000
I0416 19:20:08.031745 30680 hierarchical.cpp:1153] Framework 572e0698-e823-4529-a3a6-ce86560cf6ca-0000 filtered agent 572e0698-e823-4529-a3a6-ce86560cf6ca-S0 for 5secs
I0416 19:20:08.032006 30686 slave.cpp:871] Successfully attached file '/tmp/MasterTest_MultipleExecutors_nizQnD/slaves/572e0698-e823-4529-a3a6-ce86560cf6ca-S0/frameworks/572e0698-e823-4529-a3a6-ce86560cf6ca-0000/executors/executor-1/runs/bd0c46e1-5744-430b-bda0-7ffabab612d3'
I0416 19:20:08.032433 30680 slave.cpp:2081] Launching task '2' for framework 572e0698-e823-4529-a3a6-ce86560cf6ca-0000
I0416 19:20:08.032966 30680 paths.cpp:556] Trying to chown '/tmp/MasterTest_MultipleExecutors_nizQnD/slaves/572e0698-e823-4529-a3a6-ce86560cf6ca-S0/frameworks/572e0698-e823-4529-a3a6-ce86560cf6ca-0000/executors/executor-2/runs/e1eeb491-6c0b-4f8e-a12c-44a4d8e6bb44' to user 'mesos'
I0416 19:20:08.033262 30680 slave.cpp:6926] Launching executor 'executor-2' of framework 572e0698-e823-4529-a3a6-ce86560cf6ca-0000 with resources {} in work directory '/tmp/MasterTest_MultipleExecutors_nizQnD/slaves/572e0698-e823-4529-a3a6-ce86560cf6ca-S0/frameworks/572e0698-e823-4529-a3a6-ce86560cf6ca-0000/executors/executor-2/runs/e1eeb491-6c0b-4f8e-a12c-44a4d8e6bb44'
*** Aborted at 1492370408 (unix time) try "date -d @1492370408" if you are using GNU date ***
PC: @ 0x2b8083c4482d (unknown)
I0416 19:20:08.034000 30676 exec.cpp:162] Version: 1.3.0
*** SIGSEGV (@0xf0) received by PID 30656 (TID 0x2b808c8bb700) from PID 240; stack trace: ***
I0416 19:20:08.034373 30679 exec.cpp:212] Executor started at: executor(75)@172.17.0.2:35545 with pid 30656
@ 0x2b80d53922d7 (unknown)
@ 0x2b80d53965b9 (unknown)
@ 0x2b80839fb330 (unknown)
@ 0x2b8083c4482d (unknown)
@ 0x2b807946c307 os::getenv()
@ 0x2b80808c62b3 mesos::internal::slave::executorEnvironment()
@ 0x2b808089de50 mesos::internal::slave::Slave::launchExecutor()
@ 0x2b8080899796 mesos::internal::slave::Slave::__run()
@ 0x2b80808f7a67 _ZZN7process8dispatchIN5mesos8internal5slave5SlaveERKNS_6FutureISt4listIbSaIbEEEERKNS1_13FrameworkInfoERKNS1_12ExecutorInfoERK6OptionINS1_8TaskInfoEERKSI_INS1_13TaskGroupInfoEES9_SC_SF_SK_SO_EEvRKNS_3PIDIT_EEMSS_FvT0_T1_T2_T3_T4_ET5_T6_T7_T8_T9_ENKUlPNS_11ProcessBaseEE_clES19_
@ 0x2b80809318fc _ZNSt17_Function_handlerIFvPN7process11ProcessBaseEEZNS0_8dispatchIN5mesos8internal5slave5SlaveERKNS0_6FutureISt4listIbSaIbEEEERKNS5_13FrameworkInfoERKNS5_12ExecutorInfoERK6OptionINS5_8TaskInfoEERKSM_INS5_13TaskGroupInfoEESD_SG_SJ_SO_SS_EEvRKNS0_3PIDIT_EEMSW_FvT0_T1_T2_T3_T4_ET5_T6_T7_T8_T9_EUlS2_E_E9_M_invokeERKSt9_Any_dataS2_
@ 0x2b808169175b std::function<>::operator()()
@ 0x2b8081677549 process::ProcessBase::visit()
@ 0x2b8081681e82 process::DispatchEvent::visit()
@ 0x2b80794407f6 process::ProcessBase::serve()
@ 0x2b8081673872 process::ProcessManager::resume()
@ 0x2b80816700b6 _ZZN7process14ProcessManager12init_threadsEvENKUt_clEv
@ 0x2b80816815bc _ZNSt12_Bind_simpleIFZN7process14ProcessManager12init_threadsEvEUt_vEE9_M_invokeIIEEEvSt12_Index_tupleIIXspT_EEE
@ 0x2b8081681513 _ZNSt12_Bind_simpleIFZN7process14ProcessManager12init_threadsEvEUt_vEEclEv
@ 0x2b80816814ac _ZNSt6thread5_ImplISt12_Bind_simpleIFZN7process14ProcessManager12init_threadsEvEUt_vEEE6_M_runEv
@ 0x2b808327ca60 (unknown)
@ 0x2b80839f3184 start_thread
@ 0x2b8083d06bed (unknown)
make[4]: *** [check-local] Segmentation fault
make[4]: Leaving directory `/mesos/mesos-1.3.0/_build/src'
make[3]: *** [check-am] Error 2
make[3]: Leaving directory `/mesos/mesos-1.3.0/_build/src'
make[2]: *** [check] Error 2
make[2]: Leaving directory `/mesos/mesos-1.3.0/_build/src'
make[1]: *** [check-recursive] Error 1
make[1]: Leaving directory `/mesos/mesos-1.3.0/_build'
make: *** [distcheck] Error 1
+ docker rmi mesos-1492367280-25363
Untagged: mesos-1492367280-25363:latest
Deleted: sha256:5002d541ef3cc25c5a9aeea6096acb3f8f5fada1288ed9e291261f52f0c15843
Deleted: sha256:9eef55b8c80495493d15bcd7ad6e017ca06ab4d5699cc9b07bd8755cde3045bb
Deleted: sha256:191dd8d239e49bf94b197e8f1f33bf71b99fc6a44c9537325551fba86ffc4748
Deleted: sha256:0ba6e28a101839b229ea50c6d871bf1a3a76a51300f087ee62f41f77001ea34a
Deleted: sha256:3596b2a374df44068e8b54cc0641443245dac619c6920e02c744fa60f8ac44ee
Deleted: sha256:29c4625426d8ed2dc222492138971f5a4d3bf6543da3d6fa5e33a61f6b5c7600
Deleted: sha256:feb8412c303facf7c6b97460498d58695d4fb3ac7cc9b1c6c7544c937323db0f
Deleted: sha256:04bc9f92e3aaab6f3964dc57bdff4551e7fb0ea70721bd0fdfa2deb8cbd3437c
Deleted: sha256:c8e4a29070a38f7123ab7591df63fb89462333c9cb256bc2180182bf52204cf2
Deleted: sha256:b2f6428e976484d5193b4da7aec89de1061fbc2d8bb2ed3cdf5f0350bbeb2988
Deleted: sha256:00ff7b579f6eda091ab5287b5cb9650626d663cddfa6a19e5843cbcaf3108c77
Deleted: sha256:3c118c2dba260db18775d3414a334e70df0ac1f1288138ca2561e8c384254b17
Deleted: sha256:fe57b3f7199caf225a46cc8778f96bfb81771379d4731c531737b1309d8dbc1d
Deleted: sha256:63b5ab3591d9a8739c7fac89707e226d5f3ce87ee89c01f5953f019298eae439
Deleted: sha256:86d12f026722595778d939a8d2fa53142490806412dc9bf3e71c3f9daaa1160e
Deleted: sha256:7c5f63b8c71b9e36d3cd412e3284af2b826c2d7d732ecfeb5e10f47ea04fee96
Deleted: sha256:d96fa3e68461f4e96f19d4a5e2b4b57581b9443451326edb471c13e2f5ef210b
Deleted: sha256:3beb8e8770e1838317960baf98b8cdb309df8bbff2a0202722c57ef57d5d7778
Deleted: sha256:3608771429d257bb300f259cd1f8a64009b3b5299ed6b517e47bcf2d6fd2e513
Deleted: sha256:68358dc42d92505deb93e98bc860be3eb9b159fe2206d384a127ec2da3438268
Deleted: sha256:6b8226ec040bd18e3c813bf1ad022b91db0841ffe686a693b59403a968133695
Deleted: sha256:4be341521e100c51dbe9e6fc61f81d4488fa0b17542b92bf256b051088299529
Deleted: sha256:2f6f44584bd7c8ac4dc24da984b63b9a7a1b36c953157613cd130a7af24a8659
Deleted: sha256:f5b9a32d48ef1718b8b2af65b4b3753edeb86cc60f43fb69292d2b828738d199
Build step 'Execute shell' marked build as failure
Build failed in Jenkins: Mesos-Buildbot » autotools,gcc,--verbose,GLOG_v=1 MESOS_VERBOSE=1,ubuntu:14.04,(docker||Hadoop)&&(!ubuntu-us1)&&(!ubuntu-eu2) #3517
Posted by Apache Jenkins Server <je...@builds.apache.org>.
See <https://builds.apache.org/job/Mesos-Buildbot/BUILDTOOL=autotools,COMPILER=gcc,CONFIGURATION=--verbose,ENVIRONMENT=GLOG_v=1%20MESOS_VERBOSE=1,OS=ubuntu%3A14.04,label_exp=(docker%7C%7CHadoop)&&(!ubuntu-us1)&&(!ubuntu-eu2)/3517/display/redirect>
------------------------------------------
Started by upstream project "Mesos-Buildbot" build number 3517
originally caused by:
Started by an SCM change
[EnvInject] - Loading node environment variables.
Building remotely on H0 (Hadoop) in workspace <https://builds.apache.org/job/Mesos-Buildbot/BUILDTOOL=autotools,COMPILER=gcc,CONFIGURATION=--verbose,ENVIRONMENT=GLOG_v=1%20MESOS_VERBOSE=1,OS=ubuntu%3A14.04,label_exp=(docker%7C%7CHadoop)&&(!ubuntu-us1)&&(!ubuntu-eu2)/ws/>
Wiping out workspace first.
Cloning the remote Git repository
Cloning repository https://git-wip-us.apache.org/repos/asf/mesos.git
> git init <https://builds.apache.org/job/Mesos-Buildbot/BUILDTOOL=autotools,COMPILER=gcc,CONFIGURATION=--verbose,ENVIRONMENT=GLOG_v=1%20MESOS_VERBOSE=1,OS=ubuntu%3A14.04,label_exp=(docker%7C%7CHadoop)&&(!ubuntu-us1)&&(!ubuntu-eu2)/ws/> # timeout=10
Fetching upstream changes from https://git-wip-us.apache.org/repos/asf/mesos.git
> git --version # timeout=10
> git fetch --tags --progress https://git-wip-us.apache.org/repos/asf/mesos.git +refs/heads/*:refs/remotes/origin/*
> git config remote.origin.url https://git-wip-us.apache.org/repos/asf/mesos.git # timeout=10
> git config --add remote.origin.fetch +refs/heads/*:refs/remotes/origin/* # timeout=10
> git config remote.origin.url https://git-wip-us.apache.org/repos/asf/mesos.git # timeout=10
Fetching upstream changes from https://git-wip-us.apache.org/repos/asf/mesos.git
> git fetch --tags --progress https://git-wip-us.apache.org/repos/asf/mesos.git +refs/heads/*:refs/remotes/origin/*
Checking out Revision c46b9c8ed2fb0cdb58c90fe6fc71dc9e2f49d98c (refs/tags/0.25.1, refs/tags/0.25.1-rc4)
> git config core.sparsecheckout # timeout=10
> git checkout -f c46b9c8ed2fb0cdb58c90fe6fc71dc9e2f49d98c
First time build. Skipping changelog.
[ff2fd4d4] $ /bin/bash -xe /tmp/hudson317558527506340293.sh
+ '[' refs/tags/0.25.1 = origin/1.0.x ']'
+ ./support/jenkins/buildbot.sh
/tmp/hudson317558527506340293.sh: line 6: ./support/jenkins/buildbot.sh: No such file or directory
Build step 'Execute shell' marked build as failure
Build failed in Jenkins: Mesos-Buildbot » autotools,gcc,--verbose,GLOG_v=1 MESOS_VERBOSE=1,ubuntu:14.04,(docker||Hadoop)&&(!ubuntu-us1)&&(!ubuntu-eu2) #3516
Posted by Apache Jenkins Server <je...@builds.apache.org>.
See <https://builds.apache.org/job/Mesos-Buildbot/BUILDTOOL=autotools,COMPILER=gcc,CONFIGURATION=--verbose,ENVIRONMENT=GLOG_v=1%20MESOS_VERBOSE=1,OS=ubuntu%3A14.04,label_exp=(docker%7C%7CHadoop)&&(!ubuntu-us1)&&(!ubuntu-eu2)/3516/display/redirect>
------------------------------------------
Started by upstream project "Mesos-Buildbot" build number 3516
originally caused by:
Started by an SCM change
Started by an SCM change
[EnvInject] - Loading node environment variables.
Building remotely on H0 (Hadoop) in workspace <https://builds.apache.org/job/Mesos-Buildbot/BUILDTOOL=autotools,COMPILER=gcc,CONFIGURATION=--verbose,ENVIRONMENT=GLOG_v=1%20MESOS_VERBOSE=1,OS=ubuntu%3A14.04,label_exp=(docker%7C%7CHadoop)&&(!ubuntu-us1)&&(!ubuntu-eu2)/ws/>
Wiping out workspace first.
Cloning the remote Git repository
Cloning repository https://git-wip-us.apache.org/repos/asf/mesos.git
> git init <https://builds.apache.org/job/Mesos-Buildbot/BUILDTOOL=autotools,COMPILER=gcc,CONFIGURATION=--verbose,ENVIRONMENT=GLOG_v=1%20MESOS_VERBOSE=1,OS=ubuntu%3A14.04,label_exp=(docker%7C%7CHadoop)&&(!ubuntu-us1)&&(!ubuntu-eu2)/ws/> # timeout=10
Fetching upstream changes from https://git-wip-us.apache.org/repos/asf/mesos.git
> git --version # timeout=10
> git fetch --tags --progress https://git-wip-us.apache.org/repos/asf/mesos.git +refs/heads/*:refs/remotes/origin/*
> git config remote.origin.url https://git-wip-us.apache.org/repos/asf/mesos.git # timeout=10
> git config --add remote.origin.fetch +refs/heads/*:refs/remotes/origin/* # timeout=10
> git config remote.origin.url https://git-wip-us.apache.org/repos/asf/mesos.git # timeout=10
Fetching upstream changes from https://git-wip-us.apache.org/repos/asf/mesos.git
> git fetch --tags --progress https://git-wip-us.apache.org/repos/asf/mesos.git +refs/heads/*:refs/remotes/origin/*
Checking out Revision e2eb20b864b119e5f2d0f5b167c435c393f1104a (refs/tags/0.24.2, refs/tags/0.24.2-rc5)
> git config core.sparsecheckout # timeout=10
> git checkout -f e2eb20b864b119e5f2d0f5b167c435c393f1104a
First time build. Skipping changelog.
[ff2fd4d4] $ /bin/bash -xe /tmp/hudson5555319340995631397.sh
+ '[' refs/tags/0.24.2 = origin/1.0.x ']'
+ ./support/jenkins/buildbot.sh
/tmp/hudson5555319340995631397.sh: line 6: ./support/jenkins/buildbot.sh: No such file or directory
Build step 'Execute shell' marked build as failure
Build failed in Jenkins: Mesos-Buildbot » autotools,gcc,--verbose,GLOG_v=1 MESOS_VERBOSE=1,ubuntu:14.04,(docker||Hadoop)&&(!ubuntu-us1)&&(!ubuntu-eu2) #3515
Posted by Apache Jenkins Server <je...@builds.apache.org>.
See <https://builds.apache.org/job/Mesos-Buildbot/BUILDTOOL=autotools,COMPILER=gcc,CONFIGURATION=--verbose,ENVIRONMENT=GLOG_v=1%20MESOS_VERBOSE=1,OS=ubuntu%3A14.04,label_exp=(docker%7C%7CHadoop)&&(!ubuntu-us1)&&(!ubuntu-eu2)/3515/display/redirect>
------------------------------------------
Started by upstream project "Mesos-Buildbot" build number 3515
originally caused by:
Started by an SCM change
[EnvInject] - Loading node environment variables.
Building remotely on H0 (Hadoop) in workspace <https://builds.apache.org/job/Mesos-Buildbot/BUILDTOOL=autotools,COMPILER=gcc,CONFIGURATION=--verbose,ENVIRONMENT=GLOG_v=1%20MESOS_VERBOSE=1,OS=ubuntu%3A14.04,label_exp=(docker%7C%7CHadoop)&&(!ubuntu-us1)&&(!ubuntu-eu2)/ws/>
Wiping out workspace first.
Cloning the remote Git repository
Cloning repository https://git-wip-us.apache.org/repos/asf/mesos.git
> git init <https://builds.apache.org/job/Mesos-Buildbot/BUILDTOOL=autotools,COMPILER=gcc,CONFIGURATION=--verbose,ENVIRONMENT=GLOG_v=1%20MESOS_VERBOSE=1,OS=ubuntu%3A14.04,label_exp=(docker%7C%7CHadoop)&&(!ubuntu-us1)&&(!ubuntu-eu2)/ws/> # timeout=10
Fetching upstream changes from https://git-wip-us.apache.org/repos/asf/mesos.git
> git --version # timeout=10
> git fetch --tags --progress https://git-wip-us.apache.org/repos/asf/mesos.git +refs/heads/*:refs/remotes/origin/*
> git config remote.origin.url https://git-wip-us.apache.org/repos/asf/mesos.git # timeout=10
> git config --add remote.origin.fetch +refs/heads/*:refs/remotes/origin/* # timeout=10
> git config remote.origin.url https://git-wip-us.apache.org/repos/asf/mesos.git # timeout=10
Fetching upstream changes from https://git-wip-us.apache.org/repos/asf/mesos.git
> git fetch --tags --progress https://git-wip-us.apache.org/repos/asf/mesos.git +refs/heads/*:refs/remotes/origin/*
Checking out Revision f81b5ed368ae359ad8fd472c2d1b8bbb50d1948c (refs/tags/0.24.2-rc1)
> git config core.sparsecheckout # timeout=10
> git checkout -f f81b5ed368ae359ad8fd472c2d1b8bbb50d1948c
First time build. Skipping changelog.
[ff2fd4d4] $ /bin/bash -xe /tmp/hudson1352372746225111887.sh
+ '[' refs/tags/0.24.2-rc1 = origin/1.0.x ']'
+ ./support/jenkins/buildbot.sh
/tmp/hudson1352372746225111887.sh: line 6: ./support/jenkins/buildbot.sh: No such file or directory
Build step 'Execute shell' marked build as failure
Build failed in Jenkins: Mesos-Buildbot » autotools,gcc,--verbose,GLOG_v=1 MESOS_VERBOSE=1,ubuntu:14.04,(docker||Hadoop)&&(!ubuntu-us1)&&(!ubuntu-eu2) #3514
Posted by Apache Jenkins Server <je...@builds.apache.org>.
See <https://builds.apache.org/job/Mesos-Buildbot/BUILDTOOL=autotools,COMPILER=gcc,CONFIGURATION=--verbose,ENVIRONMENT=GLOG_v=1%20MESOS_VERBOSE=1,OS=ubuntu%3A14.04,label_exp=(docker%7C%7CHadoop)&&(!ubuntu-us1)&&(!ubuntu-eu2)/3514/display/redirect>
------------------------------------------
Started by upstream project "Mesos-Buildbot" build number 3514
originally caused by:
Started by an SCM change
[EnvInject] - Loading node environment variables.
Building remotely on H0 (Hadoop) in workspace <https://builds.apache.org/job/Mesos-Buildbot/BUILDTOOL=autotools,COMPILER=gcc,CONFIGURATION=--verbose,ENVIRONMENT=GLOG_v=1%20MESOS_VERBOSE=1,OS=ubuntu%3A14.04,label_exp=(docker%7C%7CHadoop)&&(!ubuntu-us1)&&(!ubuntu-eu2)/ws/>
Wiping out workspace first.
Cloning the remote Git repository
Cloning repository https://git-wip-us.apache.org/repos/asf/mesos.git
> git init <https://builds.apache.org/job/Mesos-Buildbot/BUILDTOOL=autotools,COMPILER=gcc,CONFIGURATION=--verbose,ENVIRONMENT=GLOG_v=1%20MESOS_VERBOSE=1,OS=ubuntu%3A14.04,label_exp=(docker%7C%7CHadoop)&&(!ubuntu-us1)&&(!ubuntu-eu2)/ws/> # timeout=10
Fetching upstream changes from https://git-wip-us.apache.org/repos/asf/mesos.git
> git --version # timeout=10
> git fetch --tags --progress https://git-wip-us.apache.org/repos/asf/mesos.git +refs/heads/*:refs/remotes/origin/*
> git config remote.origin.url https://git-wip-us.apache.org/repos/asf/mesos.git # timeout=10
> git config --add remote.origin.fetch +refs/heads/*:refs/remotes/origin/* # timeout=10
> git config remote.origin.url https://git-wip-us.apache.org/repos/asf/mesos.git # timeout=10
Fetching upstream changes from https://git-wip-us.apache.org/repos/asf/mesos.git
> git fetch --tags --progress https://git-wip-us.apache.org/repos/asf/mesos.git +refs/heads/*:refs/remotes/origin/*
Checking out Revision 9965e96b6a4db89813731236427fbeeda92c0cd2 (refs/tags/0.26.0-rc1)
> git config core.sparsecheckout # timeout=10
> git checkout -f 9965e96b6a4db89813731236427fbeeda92c0cd2
First time build. Skipping changelog.
[ff2fd4d4] $ /bin/bash -xe /tmp/hudson6062653593914890259.sh
+ '[' refs/tags/0.26.0-rc1 = origin/1.0.x ']'
+ ./support/jenkins/buildbot.sh
/tmp/hudson6062653593914890259.sh: line 6: ./support/jenkins/buildbot.sh: No such file or directory
Build step 'Execute shell' marked build as failure
Build failed in Jenkins: Mesos-Buildbot » autotools,gcc,--verbose,GLOG_v=1 MESOS_VERBOSE=1,ubuntu:14.04,(docker||Hadoop)&&(!ubuntu-us1)&&(!ubuntu-eu2) #3513
Posted by Apache Jenkins Server <je...@builds.apache.org>.
See <https://builds.apache.org/job/Mesos-Buildbot/BUILDTOOL=autotools,COMPILER=gcc,CONFIGURATION=--verbose,ENVIRONMENT=GLOG_v=1%20MESOS_VERBOSE=1,OS=ubuntu%3A14.04,label_exp=(docker%7C%7CHadoop)&&(!ubuntu-us1)&&(!ubuntu-eu2)/3513/display/redirect>
------------------------------------------
Started by upstream project "Mesos-Buildbot" build number 3513
originally caused by:
Started by an SCM change
Started by an SCM change
[EnvInject] - Loading node environment variables.
Building remotely on H0 (Hadoop) in workspace <https://builds.apache.org/job/Mesos-Buildbot/BUILDTOOL=autotools,COMPILER=gcc,CONFIGURATION=--verbose,ENVIRONMENT=GLOG_v=1%20MESOS_VERBOSE=1,OS=ubuntu%3A14.04,label_exp=(docker%7C%7CHadoop)&&(!ubuntu-us1)&&(!ubuntu-eu2)/ws/>
Wiping out workspace first.
Cloning the remote Git repository
Cloning repository https://git-wip-us.apache.org/repos/asf/mesos.git
> git init <https://builds.apache.org/job/Mesos-Buildbot/BUILDTOOL=autotools,COMPILER=gcc,CONFIGURATION=--verbose,ENVIRONMENT=GLOG_v=1%20MESOS_VERBOSE=1,OS=ubuntu%3A14.04,label_exp=(docker%7C%7CHadoop)&&(!ubuntu-us1)&&(!ubuntu-eu2)/ws/> # timeout=10
Fetching upstream changes from https://git-wip-us.apache.org/repos/asf/mesos.git
> git --version # timeout=10
> git fetch --tags --progress https://git-wip-us.apache.org/repos/asf/mesos.git +refs/heads/*:refs/remotes/origin/*
> git config remote.origin.url https://git-wip-us.apache.org/repos/asf/mesos.git # timeout=10
> git config --add remote.origin.fetch +refs/heads/*:refs/remotes/origin/* # timeout=10
> git config remote.origin.url https://git-wip-us.apache.org/repos/asf/mesos.git # timeout=10
Fetching upstream changes from https://git-wip-us.apache.org/repos/asf/mesos.git
> git fetch --tags --progress https://git-wip-us.apache.org/repos/asf/mesos.git +refs/heads/*:refs/remotes/origin/*
Checking out Revision c76b7c062321cf07473f495e973b9ba78a6b7283 (refs/tags/0.25.0-rc1)
> git config core.sparsecheckout # timeout=10
> git checkout -f c76b7c062321cf07473f495e973b9ba78a6b7283
First time build. Skipping changelog.
[ff2fd4d4] $ /bin/bash -xe /tmp/hudson424225190255789213.sh
+ '[' refs/tags/0.25.0-rc1 = origin/1.0.x ']'
+ ./support/jenkins/buildbot.sh
/tmp/hudson424225190255789213.sh: line 6: ./support/jenkins/buildbot.sh: No such file or directory
Build step 'Execute shell' marked build as failure
Build failed in Jenkins: Mesos-Buildbot » autotools,gcc,--verbose,GLOG_v=1 MESOS_VERBOSE=1,ubuntu:14.04,(docker||Hadoop)&&(!ubuntu-us1)&&(!ubuntu-eu2) #3512
Posted by Apache Jenkins Server <je...@builds.apache.org>.
See <https://builds.apache.org/job/Mesos-Buildbot/BUILDTOOL=autotools,COMPILER=gcc,CONFIGURATION=--verbose,ENVIRONMENT=GLOG_v=1%20MESOS_VERBOSE=1,OS=ubuntu%3A14.04,label_exp=(docker%7C%7CHadoop)&&(!ubuntu-us1)&&(!ubuntu-eu2)/3512/display/redirect>
------------------------------------------
Started by upstream project "Mesos-Buildbot" build number 3512
originally caused by:
Started by an SCM change
[EnvInject] - Loading node environment variables.
Building remotely on H0 (Hadoop) in workspace <https://builds.apache.org/job/Mesos-Buildbot/BUILDTOOL=autotools,COMPILER=gcc,CONFIGURATION=--verbose,ENVIRONMENT=GLOG_v=1%20MESOS_VERBOSE=1,OS=ubuntu%3A14.04,label_exp=(docker%7C%7CHadoop)&&(!ubuntu-us1)&&(!ubuntu-eu2)/ws/>
Wiping out workspace first.
Cloning the remote Git repository
Cloning repository https://git-wip-us.apache.org/repos/asf/mesos.git
> git init <https://builds.apache.org/job/Mesos-Buildbot/BUILDTOOL=autotools,COMPILER=gcc,CONFIGURATION=--verbose,ENVIRONMENT=GLOG_v=1%20MESOS_VERBOSE=1,OS=ubuntu%3A14.04,label_exp=(docker%7C%7CHadoop)&&(!ubuntu-us1)&&(!ubuntu-eu2)/ws/> # timeout=10
Fetching upstream changes from https://git-wip-us.apache.org/repos/asf/mesos.git
> git --version # timeout=10
> git fetch --tags --progress https://git-wip-us.apache.org/repos/asf/mesos.git +refs/heads/*:refs/remotes/origin/*
> git config remote.origin.url https://git-wip-us.apache.org/repos/asf/mesos.git # timeout=10
> git config --add remote.origin.fetch +refs/heads/*:refs/remotes/origin/* # timeout=10
> git config remote.origin.url https://git-wip-us.apache.org/repos/asf/mesos.git # timeout=10
Fetching upstream changes from https://git-wip-us.apache.org/repos/asf/mesos.git
> git fetch --tags --progress https://git-wip-us.apache.org/repos/asf/mesos.git +refs/heads/*:refs/remotes/origin/*
Checking out Revision 93bc98bacf3e99ead93c253f7736cbed50d2170d (refs/tags/0.21.2, refs/tags/0.21.2-rc1)
> git config core.sparsecheckout # timeout=10
> git checkout -f 93bc98bacf3e99ead93c253f7736cbed50d2170d
First time build. Skipping changelog.
[ff2fd4d4] $ /bin/bash -xe /tmp/hudson733890893447036747.sh
+ '[' refs/tags/0.21.2 = origin/1.0.x ']'
+ ./support/jenkins/buildbot.sh
/tmp/hudson733890893447036747.sh: line 6: ./support/jenkins/buildbot.sh: No such file or directory
Build step 'Execute shell' marked build as failure
Build failed in Jenkins: Mesos-Buildbot » autotools,gcc,--verbose,GLOG_v=1 MESOS_VERBOSE=1,ubuntu:14.04,(docker||Hadoop)&&(!ubuntu-us1)&&(!ubuntu-eu2) #3511
Posted by Apache Jenkins Server <je...@builds.apache.org>.
See <https://builds.apache.org/job/Mesos-Buildbot/BUILDTOOL=autotools,COMPILER=gcc,CONFIGURATION=--verbose,ENVIRONMENT=GLOG_v=1%20MESOS_VERBOSE=1,OS=ubuntu%3A14.04,label_exp=(docker%7C%7CHadoop)&&(!ubuntu-us1)&&(!ubuntu-eu2)/3511/display/redirect>
------------------------------------------
Started by upstream project "Mesos-Buildbot" build number 3511
originally caused by:
Started by an SCM change
[EnvInject] - Loading node environment variables.
Building remotely on H0 (Hadoop) in workspace <https://builds.apache.org/job/Mesos-Buildbot/BUILDTOOL=autotools,COMPILER=gcc,CONFIGURATION=--verbose,ENVIRONMENT=GLOG_v=1%20MESOS_VERBOSE=1,OS=ubuntu%3A14.04,label_exp=(docker%7C%7CHadoop)&&(!ubuntu-us1)&&(!ubuntu-eu2)/ws/>
Wiping out workspace first.
Cloning the remote Git repository
Cloning repository https://git-wip-us.apache.org/repos/asf/mesos.git
> git init <https://builds.apache.org/job/Mesos-Buildbot/BUILDTOOL=autotools,COMPILER=gcc,CONFIGURATION=--verbose,ENVIRONMENT=GLOG_v=1%20MESOS_VERBOSE=1,OS=ubuntu%3A14.04,label_exp=(docker%7C%7CHadoop)&&(!ubuntu-us1)&&(!ubuntu-eu2)/ws/> # timeout=10
Fetching upstream changes from https://git-wip-us.apache.org/repos/asf/mesos.git
> git --version # timeout=10
> git fetch --tags --progress https://git-wip-us.apache.org/repos/asf/mesos.git +refs/heads/*:refs/remotes/origin/*
> git config remote.origin.url https://git-wip-us.apache.org/repos/asf/mesos.git # timeout=10
> git config --add remote.origin.fetch +refs/heads/*:refs/remotes/origin/* # timeout=10
> git config remote.origin.url https://git-wip-us.apache.org/repos/asf/mesos.git # timeout=10
Fetching upstream changes from https://git-wip-us.apache.org/repos/asf/mesos.git
> git fetch --tags --progress https://git-wip-us.apache.org/repos/asf/mesos.git +refs/heads/*:refs/remotes/origin/*
Checking out Revision 12e7f4599c077637516cd8415aa4706222ac0968 (refs/tags/0.22.2, refs/tags/0.22.2-rc1)
> git config core.sparsecheckout # timeout=10
> git checkout -f 12e7f4599c077637516cd8415aa4706222ac0968
First time build. Skipping changelog.
[ff2fd4d4] $ /bin/bash -xe /tmp/hudson1832744529643932189.sh
+ '[' refs/tags/0.22.2 = origin/1.0.x ']'
+ ./support/jenkins/buildbot.sh
/tmp/hudson1832744529643932189.sh: line 6: ./support/jenkins/buildbot.sh: No such file or directory
Build step 'Execute shell' marked build as failure
Build failed in Jenkins: Mesos-Buildbot » autotools,gcc,--verbose,GLOG_v=1 MESOS_VERBOSE=1,ubuntu:14.04,(docker||Hadoop)&&(!ubuntu-us1)&&(!ubuntu-eu2) #3510
Posted by Apache Jenkins Server <je...@builds.apache.org>.
See <https://builds.apache.org/job/Mesos-Buildbot/BUILDTOOL=autotools,COMPILER=gcc,CONFIGURATION=--verbose,ENVIRONMENT=GLOG_v=1%20MESOS_VERBOSE=1,OS=ubuntu%3A14.04,label_exp=(docker%7C%7CHadoop)&&(!ubuntu-us1)&&(!ubuntu-eu2)/3510/display/redirect>
------------------------------------------
Started by upstream project "Mesos-Buildbot" build number 3510
originally caused by:
Started by an SCM change
[EnvInject] - Loading node environment variables.
Building remotely on H0 (Hadoop) in workspace <https://builds.apache.org/job/Mesos-Buildbot/BUILDTOOL=autotools,COMPILER=gcc,CONFIGURATION=--verbose,ENVIRONMENT=GLOG_v=1%20MESOS_VERBOSE=1,OS=ubuntu%3A14.04,label_exp=(docker%7C%7CHadoop)&&(!ubuntu-us1)&&(!ubuntu-eu2)/ws/>
Wiping out workspace first.
Cloning the remote Git repository
Cloning repository https://git-wip-us.apache.org/repos/asf/mesos.git
> git init <https://builds.apache.org/job/Mesos-Buildbot/BUILDTOOL=autotools,COMPILER=gcc,CONFIGURATION=--verbose,ENVIRONMENT=GLOG_v=1%20MESOS_VERBOSE=1,OS=ubuntu%3A14.04,label_exp=(docker%7C%7CHadoop)&&(!ubuntu-us1)&&(!ubuntu-eu2)/ws/> # timeout=10
Fetching upstream changes from https://git-wip-us.apache.org/repos/asf/mesos.git
> git --version # timeout=10
> git fetch --tags --progress https://git-wip-us.apache.org/repos/asf/mesos.git +refs/heads/*:refs/remotes/origin/*
> git config remote.origin.url https://git-wip-us.apache.org/repos/asf/mesos.git # timeout=10
> git config --add remote.origin.fetch +refs/heads/*:refs/remotes/origin/* # timeout=10
> git config remote.origin.url https://git-wip-us.apache.org/repos/asf/mesos.git # timeout=10
Fetching upstream changes from https://git-wip-us.apache.org/repos/asf/mesos.git
> git fetch --tags --progress https://git-wip-us.apache.org/repos/asf/mesos.git +refs/heads/*:refs/remotes/origin/*
Checking out Revision a9ea8b104bf94902789d8691a21801335ccf2a9c (refs/tags/0.23.1, refs/tags/0.23.1-rc1)
> git config core.sparsecheckout # timeout=10
> git checkout -f a9ea8b104bf94902789d8691a21801335ccf2a9c
First time build. Skipping changelog.
[ff2fd4d4] $ /bin/bash -xe /tmp/hudson4386715598440274141.sh
+ '[' refs/tags/0.23.1 = origin/1.0.x ']'
+ ./support/jenkins/buildbot.sh
/tmp/hudson4386715598440274141.sh: line 6: ./support/jenkins/buildbot.sh: No such file or directory
Build step 'Execute shell' marked build as failure
Build failed in Jenkins: Mesos-Buildbot » autotools,gcc,--verbose,GLOG_v=1 MESOS_VERBOSE=1,ubuntu:14.04,(docker||Hadoop)&&(!ubuntu-us1)&&(!ubuntu-eu2) #3509
Posted by Apache Jenkins Server <je...@builds.apache.org>.
See <https://builds.apache.org/job/Mesos-Buildbot/BUILDTOOL=autotools,COMPILER=gcc,CONFIGURATION=--verbose,ENVIRONMENT=GLOG_v=1%20MESOS_VERBOSE=1,OS=ubuntu%3A14.04,label_exp=(docker%7C%7CHadoop)&&(!ubuntu-us1)&&(!ubuntu-eu2)/3509/display/redirect>
------------------------------------------
Started by upstream project "Mesos-Buildbot" build number 3509
originally caused by:
Started by an SCM change
[EnvInject] - Loading node environment variables.
Building remotely on H0 (Hadoop) in workspace <https://builds.apache.org/job/Mesos-Buildbot/BUILDTOOL=autotools,COMPILER=gcc,CONFIGURATION=--verbose,ENVIRONMENT=GLOG_v=1%20MESOS_VERBOSE=1,OS=ubuntu%3A14.04,label_exp=(docker%7C%7CHadoop)&&(!ubuntu-us1)&&(!ubuntu-eu2)/ws/>
Wiping out workspace first.
Cloning the remote Git repository
Cloning repository https://git-wip-us.apache.org/repos/asf/mesos.git
> git init <https://builds.apache.org/job/Mesos-Buildbot/BUILDTOOL=autotools,COMPILER=gcc,CONFIGURATION=--verbose,ENVIRONMENT=GLOG_v=1%20MESOS_VERBOSE=1,OS=ubuntu%3A14.04,label_exp=(docker%7C%7CHadoop)&&(!ubuntu-us1)&&(!ubuntu-eu2)/ws/> # timeout=10
Fetching upstream changes from https://git-wip-us.apache.org/repos/asf/mesos.git
> git --version # timeout=10
> git fetch --tags --progress https://git-wip-us.apache.org/repos/asf/mesos.git +refs/heads/*:refs/remotes/origin/*
> git config remote.origin.url https://git-wip-us.apache.org/repos/asf/mesos.git # timeout=10
> git config --add remote.origin.fetch +refs/heads/*:refs/remotes/origin/* # timeout=10
> git config remote.origin.url https://git-wip-us.apache.org/repos/asf/mesos.git # timeout=10
Fetching upstream changes from https://git-wip-us.apache.org/repos/asf/mesos.git
> git fetch --tags --progress https://git-wip-us.apache.org/repos/asf/mesos.git +refs/heads/*:refs/remotes/origin/*
Checking out Revision 69e99287448a3c2e24899618793573e76b250e05 (refs/tags/0.22.1-rc1)
> git config core.sparsecheckout # timeout=10
> git checkout -f 69e99287448a3c2e24899618793573e76b250e05
First time build. Skipping changelog.
[ff2fd4d4] $ /bin/bash -xe /tmp/hudson7799277933833757439.sh
+ '[' refs/tags/0.22.1-rc1 = origin/1.0.x ']'
+ ./support/jenkins/buildbot.sh
/tmp/hudson7799277933833757439.sh: line 6: ./support/jenkins/buildbot.sh: No such file or directory
Build step 'Execute shell' marked build as failure
Build failed in Jenkins: Mesos-Buildbot » autotools,gcc,--verbose,GLOG_v=1 MESOS_VERBOSE=1,ubuntu:14.04,(docker||Hadoop)&&(!ubuntu-us1)&&(!ubuntu-eu2) #3508
Posted by Apache Jenkins Server <je...@builds.apache.org>.
See <https://builds.apache.org/job/Mesos-Buildbot/BUILDTOOL=autotools,COMPILER=gcc,CONFIGURATION=--verbose,ENVIRONMENT=GLOG_v=1%20MESOS_VERBOSE=1,OS=ubuntu%3A14.04,label_exp=(docker%7C%7CHadoop)&&(!ubuntu-us1)&&(!ubuntu-eu2)/3508/display/redirect>
------------------------------------------
Started by upstream project "Mesos-Buildbot" build number 3508
originally caused by:
Started by an SCM change
Started by an SCM change
[EnvInject] - Loading node environment variables.
Building remotely on H0 (Hadoop) in workspace <https://builds.apache.org/job/Mesos-Buildbot/BUILDTOOL=autotools,COMPILER=gcc,CONFIGURATION=--verbose,ENVIRONMENT=GLOG_v=1%20MESOS_VERBOSE=1,OS=ubuntu%3A14.04,label_exp=(docker%7C%7CHadoop)&&(!ubuntu-us1)&&(!ubuntu-eu2)/ws/>
Wiping out workspace first.
Cloning the remote Git repository
Cloning repository https://git-wip-us.apache.org/repos/asf/mesos.git
> git init <https://builds.apache.org/job/Mesos-Buildbot/BUILDTOOL=autotools,COMPILER=gcc,CONFIGURATION=--verbose,ENVIRONMENT=GLOG_v=1%20MESOS_VERBOSE=1,OS=ubuntu%3A14.04,label_exp=(docker%7C%7CHadoop)&&(!ubuntu-us1)&&(!ubuntu-eu2)/ws/> # timeout=10
Fetching upstream changes from https://git-wip-us.apache.org/repos/asf/mesos.git
> git --version # timeout=10
> git fetch --tags --progress https://git-wip-us.apache.org/repos/asf/mesos.git +refs/heads/*:refs/remotes/origin/*
> git config remote.origin.url https://git-wip-us.apache.org/repos/asf/mesos.git # timeout=10
> git config --add remote.origin.fetch +refs/heads/*:refs/remotes/origin/* # timeout=10
> git config remote.origin.url https://git-wip-us.apache.org/repos/asf/mesos.git # timeout=10
Fetching upstream changes from https://git-wip-us.apache.org/repos/asf/mesos.git
> git fetch --tags --progress https://git-wip-us.apache.org/repos/asf/mesos.git +refs/heads/*:refs/remotes/origin/*
Checking out Revision 96d3f63866cabaf2396503ddfcc857e82779ab4d (refs/tags/0.22.0-rc3)
> git config core.sparsecheckout # timeout=10
> git checkout -f 96d3f63866cabaf2396503ddfcc857e82779ab4d
First time build. Skipping changelog.
[ff2fd4d4] $ /bin/bash -xe /tmp/hudson898892860788381312.sh
+ '[' refs/tags/0.22.0-rc3 = origin/1.0.x ']'
+ ./support/jenkins/buildbot.sh
/tmp/hudson898892860788381312.sh: line 6: ./support/jenkins/buildbot.sh: No such file or directory
Build step 'Execute shell' marked build as failure
Build failed in Jenkins: Mesos-Buildbot » autotools,gcc,--verbose,GLOG_v=1 MESOS_VERBOSE=1,ubuntu:14.04,(docker||Hadoop)&&(!ubuntu-us1)&&(!ubuntu-eu2) #3507
Posted by Apache Jenkins Server <je...@builds.apache.org>.
See <https://builds.apache.org/job/Mesos-Buildbot/BUILDTOOL=autotools,COMPILER=gcc,CONFIGURATION=--verbose,ENVIRONMENT=GLOG_v=1%20MESOS_VERBOSE=1,OS=ubuntu%3A14.04,label_exp=(docker%7C%7CHadoop)&&(!ubuntu-us1)&&(!ubuntu-eu2)/3507/display/redirect>
------------------------------------------
Started by upstream project "Mesos-Buildbot" build number 3507
originally caused by:
Started by an SCM change
[EnvInject] - Loading node environment variables.
Building remotely on H0 (Hadoop) in workspace <https://builds.apache.org/job/Mesos-Buildbot/BUILDTOOL=autotools,COMPILER=gcc,CONFIGURATION=--verbose,ENVIRONMENT=GLOG_v=1%20MESOS_VERBOSE=1,OS=ubuntu%3A14.04,label_exp=(docker%7C%7CHadoop)&&(!ubuntu-us1)&&(!ubuntu-eu2)/ws/>
Wiping out workspace first.
Cloning the remote Git repository
Cloning repository https://git-wip-us.apache.org/repos/asf/mesos.git
> git init <https://builds.apache.org/job/Mesos-Buildbot/BUILDTOOL=autotools,COMPILER=gcc,CONFIGURATION=--verbose,ENVIRONMENT=GLOG_v=1%20MESOS_VERBOSE=1,OS=ubuntu%3A14.04,label_exp=(docker%7C%7CHadoop)&&(!ubuntu-us1)&&(!ubuntu-eu2)/ws/> # timeout=10
Fetching upstream changes from https://git-wip-us.apache.org/repos/asf/mesos.git
> git --version # timeout=10
> git fetch --tags --progress https://git-wip-us.apache.org/repos/asf/mesos.git +refs/heads/*:refs/remotes/origin/*
> git config remote.origin.url https://git-wip-us.apache.org/repos/asf/mesos.git # timeout=10
> git config --add remote.origin.fetch +refs/heads/*:refs/remotes/origin/* # timeout=10
> git config remote.origin.url https://git-wip-us.apache.org/repos/asf/mesos.git # timeout=10
Fetching upstream changes from https://git-wip-us.apache.org/repos/asf/mesos.git
> git fetch --tags --progress https://git-wip-us.apache.org/repos/asf/mesos.git +refs/heads/*:refs/remotes/origin/*
Checking out Revision e51fb50e44b7de2e8403ead8439682b8e0bc7d59 (refs/tags/0.22.0-rc2)
> git config core.sparsecheckout # timeout=10
> git checkout -f e51fb50e44b7de2e8403ead8439682b8e0bc7d59
First time build. Skipping changelog.
[ff2fd4d4] $ /bin/bash -xe /tmp/hudson770620018395279333.sh
+ '[' refs/tags/0.22.0-rc2 = origin/1.0.x ']'
+ ./support/jenkins/buildbot.sh
/tmp/hudson770620018395279333.sh: line 6: ./support/jenkins/buildbot.sh: No such file or directory
Build step 'Execute shell' marked build as failure
Build failed in Jenkins: Mesos-Buildbot » autotools,gcc,--verbose,GLOG_v=1 MESOS_VERBOSE=1,ubuntu:14.04,(docker||Hadoop)&&(!ubuntu-us1)&&(!ubuntu-eu2) #3506
Posted by Apache Jenkins Server <je...@builds.apache.org>.
See <https://builds.apache.org/job/Mesos-Buildbot/BUILDTOOL=autotools,COMPILER=gcc,CONFIGURATION=--verbose,ENVIRONMENT=GLOG_v=1%20MESOS_VERBOSE=1,OS=ubuntu%3A14.04,label_exp=(docker%7C%7CHadoop)&&(!ubuntu-us1)&&(!ubuntu-eu2)/3506/display/redirect>
------------------------------------------
Started by upstream project "Mesos-Buildbot" build number 3506
originally caused by:
Started by an SCM change
[EnvInject] - Loading node environment variables.
Building remotely on H0 (Hadoop) in workspace <https://builds.apache.org/job/Mesos-Buildbot/BUILDTOOL=autotools,COMPILER=gcc,CONFIGURATION=--verbose,ENVIRONMENT=GLOG_v=1%20MESOS_VERBOSE=1,OS=ubuntu%3A14.04,label_exp=(docker%7C%7CHadoop)&&(!ubuntu-us1)&&(!ubuntu-eu2)/ws/>
Wiping out workspace first.
Cloning the remote Git repository
Cloning repository https://git-wip-us.apache.org/repos/asf/mesos.git
> git init <https://builds.apache.org/job/Mesos-Buildbot/BUILDTOOL=autotools,COMPILER=gcc,CONFIGURATION=--verbose,ENVIRONMENT=GLOG_v=1%20MESOS_VERBOSE=1,OS=ubuntu%3A14.04,label_exp=(docker%7C%7CHadoop)&&(!ubuntu-us1)&&(!ubuntu-eu2)/ws/> # timeout=10
Fetching upstream changes from https://git-wip-us.apache.org/repos/asf/mesos.git
> git --version # timeout=10
> git fetch --tags --progress https://git-wip-us.apache.org/repos/asf/mesos.git +refs/heads/*:refs/remotes/origin/*
> git config remote.origin.url https://git-wip-us.apache.org/repos/asf/mesos.git # timeout=10
> git config --add remote.origin.fetch +refs/heads/*:refs/remotes/origin/* # timeout=10
> git config remote.origin.url https://git-wip-us.apache.org/repos/asf/mesos.git # timeout=10
Fetching upstream changes from https://git-wip-us.apache.org/repos/asf/mesos.git
> git fetch --tags --progress https://git-wip-us.apache.org/repos/asf/mesos.git +refs/heads/*:refs/remotes/origin/*
Checking out Revision fe0a39112f3304283f970f1b08b322b1e970829d (refs/tags/0.20.1-rc3, refs/tags/0.20.1)
> git config core.sparsecheckout # timeout=10
> git checkout -f fe0a39112f3304283f970f1b08b322b1e970829d
First time build. Skipping changelog.
[ff2fd4d4] $ /bin/bash -xe /tmp/hudson3855925981668332865.sh
+ '[' refs/tags/0.20.1-rc3 = origin/1.0.x ']'
+ ./support/jenkins/buildbot.sh
/tmp/hudson3855925981668332865.sh: line 6: ./support/jenkins/buildbot.sh: No such file or directory
Build step 'Execute shell' marked build as failure
Build failed in Jenkins: Mesos-Buildbot » autotools,gcc,--verbose,GLOG_v=1 MESOS_VERBOSE=1,ubuntu:14.04,(docker||Hadoop)&&(!ubuntu-us1)&&(!ubuntu-eu2) #3505
Posted by Apache Jenkins Server <je...@builds.apache.org>.
See <https://builds.apache.org/job/Mesos-Buildbot/BUILDTOOL=autotools,COMPILER=gcc,CONFIGURATION=--verbose,ENVIRONMENT=GLOG_v=1%20MESOS_VERBOSE=1,OS=ubuntu%3A14.04,label_exp=(docker%7C%7CHadoop)&&(!ubuntu-us1)&&(!ubuntu-eu2)/3505/display/redirect>
------------------------------------------
Started by upstream project "Mesos-Buildbot" build number 3505
originally caused by:
Started by an SCM change
[EnvInject] - Loading node environment variables.
Building remotely on H0 (Hadoop) in workspace <https://builds.apache.org/job/Mesos-Buildbot/BUILDTOOL=autotools,COMPILER=gcc,CONFIGURATION=--verbose,ENVIRONMENT=GLOG_v=1%20MESOS_VERBOSE=1,OS=ubuntu%3A14.04,label_exp=(docker%7C%7CHadoop)&&(!ubuntu-us1)&&(!ubuntu-eu2)/ws/>
Wiping out workspace first.
Cloning the remote Git repository
Cloning repository https://git-wip-us.apache.org/repos/asf/mesos.git
> git init <https://builds.apache.org/job/Mesos-Buildbot/BUILDTOOL=autotools,COMPILER=gcc,CONFIGURATION=--verbose,ENVIRONMENT=GLOG_v=1%20MESOS_VERBOSE=1,OS=ubuntu%3A14.04,label_exp=(docker%7C%7CHadoop)&&(!ubuntu-us1)&&(!ubuntu-eu2)/ws/> # timeout=10
Fetching upstream changes from https://git-wip-us.apache.org/repos/asf/mesos.git
> git --version # timeout=10
> git fetch --tags --progress https://git-wip-us.apache.org/repos/asf/mesos.git +refs/heads/*:refs/remotes/origin/*
> git config remote.origin.url https://git-wip-us.apache.org/repos/asf/mesos.git # timeout=10
> git config --add remote.origin.fetch +refs/heads/*:refs/remotes/origin/* # timeout=10
> git config remote.origin.url https://git-wip-us.apache.org/repos/asf/mesos.git # timeout=10
Fetching upstream changes from https://git-wip-us.apache.org/repos/asf/mesos.git
> git fetch --tags --progress https://git-wip-us.apache.org/repos/asf/mesos.git +refs/heads/*:refs/remotes/origin/*
Checking out Revision dc0b7bf2a1a7981079b33a16b689892f9cda0d8d (refs/tags/0.19.1, refs/tags/0.19.1-rc1)
> git config core.sparsecheckout # timeout=10
> git checkout -f dc0b7bf2a1a7981079b33a16b689892f9cda0d8d
First time build. Skipping changelog.
[ff2fd4d4] $ /bin/bash -xe /tmp/hudson3134100519428859997.sh
+ '[' refs/tags/0.19.1 = origin/1.0.x ']'
+ ./support/jenkins/buildbot.sh
/tmp/hudson3134100519428859997.sh: line 6: ./support/jenkins/buildbot.sh: No such file or directory
Build step 'Execute shell' marked build as failure
Build failed in Jenkins: Mesos-Buildbot » autotools,gcc,--verbose,GLOG_v=1 MESOS_VERBOSE=1,ubuntu:14.04,(docker||Hadoop)&&(!ubuntu-us1)&&(!ubuntu-eu2) #3504
Posted by Apache Jenkins Server <je...@builds.apache.org>.
See <https://builds.apache.org/job/Mesos-Buildbot/BUILDTOOL=autotools,COMPILER=gcc,CONFIGURATION=--verbose,ENVIRONMENT=GLOG_v=1%20MESOS_VERBOSE=1,OS=ubuntu%3A14.04,label_exp=(docker%7C%7CHadoop)&&(!ubuntu-us1)&&(!ubuntu-eu2)/3504/display/redirect>
------------------------------------------
Started by upstream project "Mesos-Buildbot" build number 3504
originally caused by:
Started by an SCM change
Started by an SCM change
[EnvInject] - Loading node environment variables.
Building remotely on H0 (Hadoop) in workspace <https://builds.apache.org/job/Mesos-Buildbot/BUILDTOOL=autotools,COMPILER=gcc,CONFIGURATION=--verbose,ENVIRONMENT=GLOG_v=1%20MESOS_VERBOSE=1,OS=ubuntu%3A14.04,label_exp=(docker%7C%7CHadoop)&&(!ubuntu-us1)&&(!ubuntu-eu2)/ws/>
Wiping out workspace first.
Cloning the remote Git repository
Cloning repository https://git-wip-us.apache.org/repos/asf/mesos.git
> git init <https://builds.apache.org/job/Mesos-Buildbot/BUILDTOOL=autotools,COMPILER=gcc,CONFIGURATION=--verbose,ENVIRONMENT=GLOG_v=1%20MESOS_VERBOSE=1,OS=ubuntu%3A14.04,label_exp=(docker%7C%7CHadoop)&&(!ubuntu-us1)&&(!ubuntu-eu2)/ws/> # timeout=10
Fetching upstream changes from https://git-wip-us.apache.org/repos/asf/mesos.git
> git --version # timeout=10
> git fetch --tags --progress https://git-wip-us.apache.org/repos/asf/mesos.git +refs/heads/*:refs/remotes/origin/*
> git config remote.origin.url https://git-wip-us.apache.org/repos/asf/mesos.git # timeout=10
> git config --add remote.origin.fetch +refs/heads/*:refs/remotes/origin/* # timeout=10
> git config remote.origin.url https://git-wip-us.apache.org/repos/asf/mesos.git # timeout=10
Fetching upstream changes from https://git-wip-us.apache.org/repos/asf/mesos.git
> git fetch --tags --progress https://git-wip-us.apache.org/repos/asf/mesos.git +refs/heads/*:refs/remotes/origin/*
Checking out Revision 453b973bf93d55a3a8e5d7059e99c00ea460530e (refs/tags/0.18.2-rc1, refs/tags/0.18.2)
> git config core.sparsecheckout # timeout=10
> git checkout -f 453b973bf93d55a3a8e5d7059e99c00ea460530e
First time build. Skipping changelog.
[ff2fd4d4] $ /bin/bash -xe /tmp/hudson9192604445627608470.sh
+ '[' refs/tags/0.18.2-rc1 = origin/1.0.x ']'
+ ./support/jenkins/buildbot.sh
/tmp/hudson9192604445627608470.sh: line 6: ./support/jenkins/buildbot.sh: No such file or directory
Build step 'Execute shell' marked build as failure
Build failed in Jenkins: Mesos-Buildbot » autotools,gcc,--verbose,GLOG_v=1 MESOS_VERBOSE=1,ubuntu:14.04,(docker||Hadoop)&&(!ubuntu-us1)&&(!ubuntu-eu2) #3503
Posted by Apache Jenkins Server <je...@builds.apache.org>.
See <https://builds.apache.org/job/Mesos-Buildbot/BUILDTOOL=autotools,COMPILER=gcc,CONFIGURATION=--verbose,ENVIRONMENT=GLOG_v=1%20MESOS_VERBOSE=1,OS=ubuntu%3A14.04,label_exp=(docker%7C%7CHadoop)&&(!ubuntu-us1)&&(!ubuntu-eu2)/3503/display/redirect>
------------------------------------------
Started by upstream project "Mesos-Buildbot" build number 3503
originally caused by:
Started by an SCM change
[EnvInject] - Loading node environment variables.
Building remotely on H0 (Hadoop) in workspace <https://builds.apache.org/job/Mesos-Buildbot/BUILDTOOL=autotools,COMPILER=gcc,CONFIGURATION=--verbose,ENVIRONMENT=GLOG_v=1%20MESOS_VERBOSE=1,OS=ubuntu%3A14.04,label_exp=(docker%7C%7CHadoop)&&(!ubuntu-us1)&&(!ubuntu-eu2)/ws/>
Wiping out workspace first.
Cloning the remote Git repository
Cloning repository https://git-wip-us.apache.org/repos/asf/mesos.git
> git init <https://builds.apache.org/job/Mesos-Buildbot/BUILDTOOL=autotools,COMPILER=gcc,CONFIGURATION=--verbose,ENVIRONMENT=GLOG_v=1%20MESOS_VERBOSE=1,OS=ubuntu%3A14.04,label_exp=(docker%7C%7CHadoop)&&(!ubuntu-us1)&&(!ubuntu-eu2)/ws/> # timeout=10
Fetching upstream changes from https://git-wip-us.apache.org/repos/asf/mesos.git
> git --version # timeout=10
> git fetch --tags --progress https://git-wip-us.apache.org/repos/asf/mesos.git +refs/heads/*:refs/remotes/origin/*
> git config remote.origin.url https://git-wip-us.apache.org/repos/asf/mesos.git # timeout=10
> git config --add remote.origin.fetch +refs/heads/*:refs/remotes/origin/* # timeout=10
> git config remote.origin.url https://git-wip-us.apache.org/repos/asf/mesos.git # timeout=10
Fetching upstream changes from https://git-wip-us.apache.org/repos/asf/mesos.git
> git fetch --tags --progress https://git-wip-us.apache.org/repos/asf/mesos.git +refs/heads/*:refs/remotes/origin/*
Checking out Revision 1094c1baba95e2fce8ce76b8f46967774dde5a35 (refs/tags/0.17.0-rc2, refs/tags/0.17.0)
> git config core.sparsecheckout # timeout=10
> git checkout -f 1094c1baba95e2fce8ce76b8f46967774dde5a35
First time build. Skipping changelog.
[ff2fd4d4] $ /bin/bash -xe /tmp/hudson2177082387767729243.sh
+ '[' refs/tags/0.17.0-rc2 = origin/1.0.x ']'
+ ./support/jenkins/buildbot.sh
/tmp/hudson2177082387767729243.sh: line 6: ./support/jenkins/buildbot.sh: No such file or directory
Build step 'Execute shell' marked build as failure