You are viewing a plain text version of this content. The canonical link for it is here.
Posted to yarn-dev@hadoop.apache.org by Apache Jenkins Server <je...@builds.apache.org> on 2014/10/09 00:01:58 UTC
Failed: YARN-2493 PreCommit Build #5334
Jira: https://issues.apache.org/jira/browse/YARN-2493
Build: https://builds.apache.org/job/PreCommit-YARN-Build/5334/
###################################################################################
########################## LAST 60 LINES OF THE CONSOLE ###########################
[...truncated 3023 lines...]
NOP
{color:red}-1 overall{color}. Here are the results of testing the latest attachment
http://issues.apache.org/jira/secure/attachment/12673714/YARN-2493-20141008.1.patch
against trunk revision 2217e2f.
{color:green}+1 @author{color}. The patch does not contain any @author tags.
{color:red}-1 tests included{color}. The patch doesn't appear to include any new or modified tests.
Please justify why no new tests are needed for this patch.
Also please list what manual steps were performed to verify this patch.
{color:green}+1 javac{color}. The applied patch does not increase the total number of javac compiler warnings.
{color:green}+1 javadoc{color}. There were no new javadoc warning messages.
{color:red}-1 eclipse:eclipse{color}. The patch failed to build with eclipse:eclipse.
{color:green}+1 findbugs{color}. The patch does not introduce any new Findbugs (version 2.0.3) warnings.
{color:green}+1 release audit{color}. The applied patch does not increase the total number of release audit warnings.
{color:green}+1 core tests{color}. The patch passed unit tests in .
{color:green}+1 contrib tests{color}. The patch passed contrib unit tests.
Test results: https://builds.apache.org/job/PreCommit-YARN-Build/5334//testReport/
Console output: https://builds.apache.org/job/PreCommit-YARN-Build/5334//console
This message is automatically generated.
======================================================================
======================================================================
Adding comment to Jira.
======================================================================
======================================================================
Comment added.
76ebd48ef2375c6db8ced7e3a62b331fab4d997b logged out
======================================================================
======================================================================
Finished build.
======================================================================
======================================================================
Build step 'Execute shell' marked build as failure
Archiving artifacts
[description-setter] Could not determine description.
Recording test results
Email was triggered for: Failure
Sending email for trigger: Failure
###################################################################################
############################## FAILED TESTS (if any) ##############################
No tests ran.
Failed: YARN-2544 PreCommit Build #5337
Posted by Apache Jenkins Server <je...@builds.apache.org>.
Jira: https://issues.apache.org/jira/browse/YARN-2544
Build: https://builds.apache.org/job/PreCommit-YARN-Build/5337/
###################################################################################
########################## LAST 60 LINES OF THE CONSOLE ###########################
[...truncated 3491 lines...]
{color:red}-1 overall{color}. Here are the results of testing the latest attachment
http://issues.apache.org/jira/secure/attachment/12673766/YARN-2544-20141008.2.patch
against trunk revision a169051.
{color:green}+1 @author{color}. The patch does not contain any @author tags.
{color:green}+1 tests included{color}. The patch appears to include 2 new or modified test files.
{color:green}+1 javac{color}. The applied patch does not increase the total number of javac compiler warnings.
{color:red}-1 javadoc{color}. The javadoc tool appears to have generated 12 warning messages.
See https://builds.apache.org/job/PreCommit-YARN-Build/5337//artifact/patchprocess/diffJavadocWarnings.txt for details.
{color:green}+1 eclipse:eclipse{color}. The patch built with eclipse:eclipse.
{color:green}+1 findbugs{color}. The patch does not introduce any new Findbugs (version 2.0.3) warnings.
{color:red}-1 release audit{color}. The applied patch generated 1 release audit warnings.
{color:red}-1 core tests{color}. The patch failed these unit tests in hadoop-yarn-project/hadoop-yarn/hadoop-yarn-client hadoop-yarn-project/hadoop-yarn/hadoop-yarn-server/hadoop-yarn-server-resourcemanager:
org.apache.hadoop.yarn.server.resourcemanager.rmapp.TestRMAppTransitions
org.apache.hadoop.yarn.server.resourcemanager.applicationsmanager.TestAMRestart
{color:green}+1 contrib tests{color}. The patch passed contrib unit tests.
Test results: https://builds.apache.org/job/PreCommit-YARN-Build/5337//testReport/
Release audit warnings: https://builds.apache.org/job/PreCommit-YARN-Build/5337//artifact/patchprocess/patchReleaseAuditProblems.txt
Console output: https://builds.apache.org/job/PreCommit-YARN-Build/5337//console
This message is automatically generated.
======================================================================
======================================================================
Adding comment to Jira.
======================================================================
======================================================================
Comment added.
a76442a12581a2ff74f5b799add452d209f3e287 logged out
======================================================================
======================================================================
Finished build.
======================================================================
======================================================================
Build step 'Execute shell' marked build as failure
Archiving artifacts
[description-setter] Could not determine description.
Recording test results
Email was triggered for: Failure
Sending email for trigger: Failure
###################################################################################
############################## FAILED TESTS (if any) ##############################
No tests ran.
Failed: YARN-2544 PreCommit Build #5336
Posted by Apache Jenkins Server <je...@builds.apache.org>.
Jira: https://issues.apache.org/jira/browse/YARN-2544
Build: https://builds.apache.org/job/PreCommit-YARN-Build/5336/
###################################################################################
########################## LAST 60 LINES OF THE CONSOLE ###########################
[...truncated 3410 lines...]
http://issues.apache.org/jira/secure/attachment/12673735/YARN-2544-20141008.1.patch
against trunk revision a169051.
{color:green}+1 @author{color}. The patch does not contain any @author tags.
{color:green}+1 tests included{color}. The patch appears to include 2 new or modified test files.
{color:green}+1 javac{color}. The applied patch does not increase the total number of javac compiler warnings.
{color:red}-1 javadoc{color}. The javadoc tool appears to have generated 2 warning messages.
See https://builds.apache.org/job/PreCommit-YARN-Build/5336//artifact/patchprocess/diffJavadocWarnings.txt for details.
{color:green}+1 eclipse:eclipse{color}. The patch built with eclipse:eclipse.
{color:green}+1 findbugs{color}. The patch does not introduce any new Findbugs (version 2.0.3) warnings.
{color:red}-1 release audit{color}. The applied patch generated 1 release audit warnings.
{color:green}+1 core tests{color}. The patch passed unit tests in hadoop-yarn-project/hadoop-yarn/hadoop-yarn-api hadoop-yarn-project/hadoop-yarn/hadoop-yarn-client hadoop-yarn-project/hadoop-yarn/hadoop-yarn-common.
{color:green}+1 contrib tests{color}. The patch passed contrib unit tests.
Test results: https://builds.apache.org/job/PreCommit-YARN-Build/5336//testReport/
Release audit warnings: https://builds.apache.org/job/PreCommit-YARN-Build/5336//artifact/patchprocess/patchReleaseAuditProblems.txt
Console output: https://builds.apache.org/job/PreCommit-YARN-Build/5336//console
This message is automatically generated.
======================================================================
======================================================================
Adding comment to Jira.
======================================================================
======================================================================
Comment added.
2c56dda1355fc5ec37dccb3d050158b898c5fea7 logged out
======================================================================
======================================================================
Finished build.
======================================================================
======================================================================
Build step 'Execute shell' marked build as failure
Archiving artifacts
Sending artifact delta relative to PreCommit-YARN-Build #4749
Archived 26 artifacts
Archive block size is 32768
Received 0 blocks and 8858001 bytes
Compression is 0.0%
Took 5.4 sec
[description-setter] Could not determine description.
Recording test results
Email was triggered for: Failure
Sending email for trigger: Failure
###################################################################################
############################## FAILED TESTS (if any) ##############################
No tests ran.
Failed: YARN-2662 PreCommit Build #5335
Posted by Apache Jenkins Server <je...@builds.apache.org>.
Jira: https://issues.apache.org/jira/browse/YARN-2662
Build: https://builds.apache.org/job/PreCommit-YARN-Build/5335/
###################################################################################
########################## LAST 60 LINES OF THE CONSOLE ###########################
[...truncated 3302 lines...]
{color:red}-1 overall{color}. Here are the results of testing the latest attachment
http://issues.apache.org/jira/secure/attachment/12673723/YARN-2662.1.patch
against trunk revision 2217e2f.
{color:green}+1 @author{color}. The patch does not contain any @author tags.
{color:green}+1 tests included{color}. The patch appears to include 1 new or modified test files.
{color:green}+1 javac{color}. The applied patch does not increase the total number of javac compiler warnings.
{color:green}+1 javadoc{color}. There were no new javadoc warning messages.
{color:green}+1 eclipse:eclipse{color}. The patch built with eclipse:eclipse.
{color:green}+1 findbugs{color}. The patch does not introduce any new Findbugs (version 2.0.3) warnings.
{color:red}-1 release audit{color}. The applied patch generated 1 release audit warnings.
{color:green}+1 core tests{color}. The patch passed unit tests in hadoop-yarn-project/hadoop-yarn/hadoop-yarn-server/hadoop-yarn-server-nodemanager.
{color:green}+1 contrib tests{color}. The patch passed contrib unit tests.
Test results: https://builds.apache.org/job/PreCommit-YARN-Build/5335//testReport/
Release audit warnings: https://builds.apache.org/job/PreCommit-YARN-Build/5335//artifact/patchprocess/patchReleaseAuditProblems.txt
Console output: https://builds.apache.org/job/PreCommit-YARN-Build/5335//console
This message is automatically generated.
======================================================================
======================================================================
Adding comment to Jira.
======================================================================
======================================================================
Comment added.
29f4ac7e154d7e5c2a095dab201f47cb22e45e16 logged out
======================================================================
======================================================================
Finished build.
======================================================================
======================================================================
Build step 'Execute shell' marked build as failure
Archiving artifacts
Sending artifact delta relative to PreCommit-YARN-Build #4749
Archived 16 artifacts
Archive block size is 32768
Received 0 blocks and 8331217 bytes
Compression is 0.0%
Took 2.9 sec
[description-setter] Could not determine description.
Recording test results
Email was triggered for: Failure
Sending email for trigger: Failure
###################################################################################
############################## FAILED TESTS (if any) ##############################
No tests ran.