You are viewing a plain text version of this content. The canonical link for it is here.
Posted to builds@cassandra.apache.org by Apache Jenkins Server <je...@builds.apache.org> on 2025/03/14 19:48:23 UTC

Build complete: Cassandra-4.1 #566 [FAILURE] f71129290264cab049345508068298f1fc85411b

-------------------------------------------------------------------------------
Build Cassandra-4.1 #566 Failure
URL: https://ci-cassandra.apache.org/job/Cassandra-4.1/566/
-------------------------------------------------------------------------------
Changes:
[Brandon Williams] Suppress CVE-2024-12798

[Brandon Williams] Suppress CVE-2024-12801

[Brandon Williams] Update changes for 20408/20412

[Dmitry Konstantinov] Disable role and network permission caches to avoid interference between test methods


-------------------------------------------------------------------------------
Failed Tests:
3 tests failed.
FAILED:  dtest-large-novnode.replication_test.TestReplication.test_network_topology
FAILED:  dtest-novnode.materialized_views_test.TestMaterializedViews.test_no_base_column_in_view_pk_complex_timestamp_with_flush
FAILED:  dtest.materialized_views_test.TestMaterializedViewsConsistency.test_multi_partition_consistent_reads_after_write

-------------------------------------------------------------------------------
For complete test report and logs see https://nightlies.apache.org/cassandra/Cassandra-4.1/566/